You are viewing a plain text version of this content. The canonical link for it is here.
Posted to notifications@zookeeper.apache.org by Apache Jenkins Server <je...@builds.apache.org> on 2020/05/07 02:53:36 UTC
ZooKeeper_branch34_jdk7 - Build # 2679 - Still Failing
See https://builds.apache.org/job/ZooKeeper_branch34_jdk7/2679/
###################################################################################
########################## LAST 60 LINES OF THE CONSOLE ###########################
[...truncated 46.95 KB...]
[junit] Running org.apache.zookeeper.test.RestoreCommittedLogTest
[junit] Tests run: 1, Failures: 0, Errors: 0, Skipped: 0, Time elapsed: 20.098 sec
[junit] Running org.apache.zookeeper.test.SaslAuthDesignatedClientTest
[junit] Tests run: 2, Failures: 0, Errors: 0, Skipped: 0, Time elapsed: 2.005 sec
[junit] Running org.apache.zookeeper.test.SaslAuthDesignatedServerTest
[junit] Tests run: 1, Failures: 0, Errors: 0, Skipped: 0, Time elapsed: 0.578 sec
[junit] Running org.apache.zookeeper.test.SaslAuthFailDesignatedClientTest
[junit] Tests run: 1, Failures: 0, Errors: 0, Skipped: 0, Time elapsed: 1.129 sec
[junit] Running org.apache.zookeeper.test.SaslAuthFailNotifyTest
[junit] Tests run: 1, Failures: 0, Errors: 0, Skipped: 0, Time elapsed: 0.592 sec
[junit] Running org.apache.zookeeper.test.SaslAuthFailTest
[junit] Tests run: 1, Failures: 0, Errors: 0, Skipped: 0, Time elapsed: 0.639 sec
[junit] Running org.apache.zookeeper.test.SaslAuthMissingClientConfigTest
[junit] Tests run: 1, Failures: 0, Errors: 0, Skipped: 0, Time elapsed: 0.573 sec
[junit] Running org.apache.zookeeper.test.SaslClientTest
[junit] Tests run: 1, Failures: 0, Errors: 0, Skipped: 0, Time elapsed: 0.082 sec
[junit] Running org.apache.zookeeper.test.SessionInvalidationTest
[junit] Tests run: 1, Failures: 0, Errors: 0, Skipped: 0, Time elapsed: 0.661 sec
[junit] Running org.apache.zookeeper.test.SessionTest
[junit] Tests run: 5, Failures: 0, Errors: 0, Skipped: 0, Time elapsed: 11.827 sec
[junit] Running org.apache.zookeeper.test.SessionTimeoutTest
[junit] Tests run: 4, Failures: 0, Errors: 0, Skipped: 0, Time elapsed: 0.965 sec
[junit] Running org.apache.zookeeper.test.StandaloneTest
[junit] Tests run: 1, Failures: 0, Errors: 0, Skipped: 0, Time elapsed: 0.864 sec
[junit] Running org.apache.zookeeper.test.StatTest
[junit] Tests run: 4, Failures: 0, Errors: 0, Skipped: 0, Time elapsed: 0.926 sec
[junit] Running org.apache.zookeeper.test.StaticHostProviderTest
[junit] Tests run: 13, Failures: 0, Errors: 0, Skipped: 0, Time elapsed: 2.221 sec
[junit] Running org.apache.zookeeper.test.SyncCallTest
[junit] Tests run: 1, Failures: 0, Errors: 0, Skipped: 0, Time elapsed: 0.629 sec
[junit] Running org.apache.zookeeper.test.TruncateTest
[junit] Tests run: 3, Failures: 0, Errors: 0, Skipped: 0, Time elapsed: 9.614 sec
[junit] Running org.apache.zookeeper.test.UpgradeTest
[junit] Tests run: 1, Failures: 0, Errors: 0, Skipped: 0, Time elapsed: 1.448 sec
[junit] Running org.apache.zookeeper.test.WatchedEventTest
[junit] Tests run: 4, Failures: 0, Errors: 0, Skipped: 0, Time elapsed: 0.111 sec
[junit] Running org.apache.zookeeper.test.WatcherFuncTest
[junit] Tests run: 6, Failures: 0, Errors: 0, Skipped: 0, Time elapsed: 1.576 sec
[junit] Running org.apache.zookeeper.test.WatcherTest
[junit] Tests run: 7, Failures: 0, Errors: 0, Skipped: 0, Time elapsed: 31.489 sec
[junit] Running org.apache.zookeeper.test.ZkDatabaseCorruptionTest
[junit] Tests run: 1, Failures: 0, Errors: 0, Skipped: 0, Time elapsed: 10.704 sec
[junit] Running org.apache.zookeeper.test.ZooKeeperQuotaTest
[junit] Tests run: 1, Failures: 0, Errors: 0, Skipped: 0, Time elapsed: 0.712 sec
[junit] Running org.apache.jute.BinaryInputArchiveTest
[junit] Tests run: 1, Failures: 0, Errors: 0, Skipped: 0, Time elapsed: 0.081 sec
fail.build.on.test.failure:
BUILD FAILED
/home/jenkins/jenkins-slave/workspace/ZooKeeper_branch34_jdk7/build.xml:1425: The following error occurred while executing this line:
/home/jenkins/jenkins-slave/workspace/ZooKeeper_branch34_jdk7/build.xml:1428: Tests failed!
Total time: 41 minutes 2 seconds
Build step 'Invoke Ant' marked build as failure
Archiving artifacts
Recording test results
Email was triggered for: Failure - Any
Sending email for trigger: Failure - Any
###################################################################################
############################## FAILED TESTS (if any) ##############################
1 tests failed.
FAILED: org.apache.zookeeper.server.quorum.QuorumPeerMainTest.testLeaderOutOfView
Error Message:
null
Stack Trace:
junit.framework.AssertionFailedError
at org.apache.zookeeper.server.quorum.QuorumPeerMainTest.testLeaderOutOfView(QuorumPeerMainTest.java:1321)
at org.apache.zookeeper.JUnit4ZKTestRunner$LoggedInvokeMethod.evaluate(JUnit4ZKTestRunner.java:55)