You are viewing a plain text version of this content. The canonical link for it is here.
Posted to yarn-dev@hadoop.apache.org by Apache Jenkins Server <je...@builds.apache.org> on 2015/08/12 00:40:13 UTC
Failed: YARN-4047 PreCommit Build #8824
Jira: https://issues.apache.org/jira/browse/YARN-4047
Build: https://builds.apache.org/job/PreCommit-YARN-Build/8824/
###################################################################################
########################## LAST 60 LINES OF THE CONSOLE ###########################
[...truncated 284 lines...]
| +1 | whitespace | 0m 0s | The patch has no lines that end in
| | | | whitespace.
| +1 | install | 1m 22s | mvn install still works.
| +1 | eclipse:eclipse | 0m 33s | The patch built with
| | | | eclipse:eclipse.
| +1 | findbugs | 1m 27s | The patch does not introduce any
| | | | new Findbugs (version 3.0.0)
| | | | warnings.
| -1 | yarn tests | 53m 27s | Tests failed in
| | | | hadoop-yarn-server-resourcemanager.
| | | 92m 53s |
Reason | Tests
Failed unit tests | hadoop.yarn.server.resourcemanager.scheduler.capacity.TestContainerAllocation
| hadoop.yarn.server.resourcemanager.TestRMAdminService
|| Subsystem || Report/Notes ||
============================================================================
| Patch URL | http://issues.apache.org/jira/secure/attachment/12749935/YARN-4047.001.patch |
| Optional Tests | javadoc javac unit findbugs checkstyle |
| git revision | trunk / 7c796fd |
| hadoop-yarn-server-resourcemanager test log | /home/jenkins/jenkins-slave/workspace/PreCommit-YARN-Build/patchprocess/testrun_hadoop-yarn-server-resourcemanager.txt |
| Test Results | https://builds.apache.org/job/PreCommit-YARN-Build/8824/testReport/ |
| Java | 1.7.0_55 |
| uname | Linux asf903.gq1.ygridcore.net 3.13.0-36-lowlatency #63-Ubuntu SMP PREEMPT Wed Sep 3 21:56:12 UTC 2014 x86_64 x86_64 x86_64 GNU/Linux |
============================================================================
============================================================================
Adding comment to JIRA
============================================================================
============================================================================
Comment added.
5e596140aaaf6efc88a2c27e87bed94c37553ea8 logged out
============================================================================
============================================================================
Finished build.
============================================================================
============================================================================
Build step 'Execute shell' marked build as failure
Archiving artifacts
Sending artifact delta relative to PreCommit-YARN-Build #8782
Archived 29 artifacts
Archive block size is 32768
Received 51 blocks and 11721141 bytes
Compression is 12.5%
Took 2.7 sec
[description-setter] Could not determine description.
Recording test results
Email was triggered for: Failure
Sending email for trigger: Failure
###################################################################################
############################## FAILED TESTS (if any) ##############################
4 tests failed.
FAILED: org.apache.hadoop.yarn.server.resourcemanager.TestRMAdminService.testModifyLabelsOnNodesWithDistributedConfigurationDisabled
Error Message:
null
Stack Trace:
java.lang.NullPointerException: null
at org.apache.hadoop.util.JvmPauseMonitor.stop(JvmPauseMonitor.java:86)
at org.apache.hadoop.yarn.server.resourcemanager.ResourceManager$RMActiveServices.serviceStop(ResourceManager.java:601)
at org.apache.hadoop.service.AbstractService.stop(AbstractService.java:221)
at org.apache.hadoop.yarn.server.resourcemanager.ResourceManager.stopActiveServices(ResourceManager.java:983)
at org.apache.hadoop.yarn.server.resourcemanager.ResourceManager.transitionToStandby(ResourceManager.java:1038)
at org.apache.hadoop.yarn.server.resourcemanager.ResourceManager.serviceStop(ResourceManager.java:1085)
at org.apache.hadoop.service.AbstractService.stop(AbstractService.java:221)
at org.apache.hadoop.service.AbstractService.close(AbstractService.java:250)
at org.apache.hadoop.yarn.server.resourcemanager.TestRMAdminService.testModifyLabelsOnNodesWithDistributedConfigurationDisabled(TestRMAdminService.java:824)
FAILED: org.apache.hadoop.yarn.server.resourcemanager.TestRMAdminService.testRemoveClusterNodeLabelsWithDistributedConfigurationEnabled
Error Message:
null
Stack Trace:
java.lang.NullPointerException: null
at org.apache.hadoop.util.JvmPauseMonitor.stop(JvmPauseMonitor.java:86)
at org.apache.hadoop.yarn.server.resourcemanager.ResourceManager$RMActiveServices.serviceStop(ResourceManager.java:601)
at org.apache.hadoop.service.AbstractService.stop(AbstractService.java:221)
at org.apache.hadoop.yarn.server.resourcemanager.ResourceManager.stopActiveServices(ResourceManager.java:983)
at org.apache.hadoop.yarn.server.resourcemanager.ResourceManager.transitionToStandby(ResourceManager.java:1038)
at org.apache.hadoop.yarn.server.resourcemanager.ResourceManager.serviceStop(ResourceManager.java:1085)
at org.apache.hadoop.service.AbstractService.stop(AbstractService.java:221)
at org.apache.hadoop.service.AbstractService.close(AbstractService.java:250)
at org.apache.hadoop.yarn.server.resourcemanager.TestRMAdminService.testRemoveClusterNodeLabelsWithDistributedConfigurationEnabled(TestRMAdminService.java:867)
FAILED: org.apache.hadoop.yarn.server.resourcemanager.scheduler.capacity.TestContainerAllocation.testAMContainerAllocationWhenDNSUnavailable
Error Message:
expected:<SCHEDULED> but was:<ALLOCATED>
Stack Trace:
java.lang.AssertionError: expected:<SCHEDULED> but was:<ALLOCATED>
at org.junit.Assert.fail(Assert.java:88)
at org.junit.Assert.failNotEquals(Assert.java:743)
at org.junit.Assert.assertEquals(Assert.java:118)
at org.junit.Assert.assertEquals(Assert.java:144)
at org.apache.hadoop.yarn.server.resourcemanager.scheduler.capacity.TestContainerAllocation.testAMContainerAllocationWhenDNSUnavailable(TestContainerAllocation.java:321)
FAILED: org.apache.hadoop.yarn.server.resourcemanager.scheduler.capacity.TestContainerAllocation.testNormalContainerAllocationWhenDNSUnavailable
Error Message:
expected:<0> but was:<1>
Stack Trace:
java.lang.AssertionError: expected:<0> but was:<1>
at org.junit.Assert.fail(Assert.java:88)
at org.junit.Assert.failNotEquals(Assert.java:743)
at org.junit.Assert.assertEquals(Assert.java:118)
at org.junit.Assert.assertEquals(Assert.java:555)
at org.junit.Assert.assertEquals(Assert.java:542)
at org.apache.hadoop.yarn.server.resourcemanager.scheduler.capacity.TestContainerAllocation.testNormalContainerAllocationWhenDNSUnavailable(TestContainerAllocation.java:206)
Failed: YARN-2467 PreCommit Build #8833
Posted by Apache Jenkins Server <je...@builds.apache.org>.
Jira: https://issues.apache.org/jira/browse/YARN-2467
Build: https://builds.apache.org/job/PreCommit-YARN-Build/8833/
###################################################################################
########################## LAST 60 LINES OF THE CONSOLE ###########################
[...truncated 329 lines...]
| +1 | findbugs | 3m 53s | The patch does not introduce any
| | | | new Findbugs (version 3.0.0)
| | | | warnings.
| +1 | yarn tests | 0m 24s | Tests passed in hadoop-yarn-api.
| +1 | yarn tests | 7m 12s | Tests passed in hadoop-yarn-client.
| -1 | yarn tests | 53m 40s | Tests failed in
| | | | hadoop-yarn-server-resourcemanager.
| | | 105m 46s |
Reason | Tests
Failed unit tests | hadoop.yarn.server.resourcemanager.scheduler.capacity.TestContainerAllocation
|| Subsystem || Report/Notes ||
============================================================================
| Patch URL | http://issues.apache.org/jira/secure/attachment/12750082/YARN-2467.002.patch |
| Optional Tests | javadoc javac unit findbugs checkstyle |
| git revision | trunk / 1c12adb |
| checkstyle | /home/jenkins/jenkins-slave/workspace/PreCommit-YARN-Build/patchprocess/diffcheckstylehadoop-yarn-api.txt |
| whitespace | /home/jenkins/jenkins-slave/workspace/PreCommit-YARN-Build/patchprocess/whitespace.txt |
| hadoop-yarn-api test log | /home/jenkins/jenkins-slave/workspace/PreCommit-YARN-Build/patchprocess/testrun_hadoop-yarn-api.txt |
| hadoop-yarn-client test log | /home/jenkins/jenkins-slave/workspace/PreCommit-YARN-Build/patchprocess/testrun_hadoop-yarn-client.txt |
| hadoop-yarn-server-resourcemanager test log | /home/jenkins/jenkins-slave/workspace/PreCommit-YARN-Build/patchprocess/testrun_hadoop-yarn-server-resourcemanager.txt |
| Test Results | https://builds.apache.org/job/PreCommit-YARN-Build/8833/testReport/ |
| Java | 1.7.0_55 |
| uname | Linux asf903.gq1.ygridcore.net 3.13.0-36-lowlatency #63-Ubuntu SMP PREEMPT Wed Sep 3 21:56:12 UTC 2014 x86_64 x86_64 x86_64 GNU/Linux |
============================================================================
============================================================================
Adding comment to JIRA
============================================================================
============================================================================
Comment added.
dc96d125cde6baf38c2c95c03f43412642881853 logged out
============================================================================
============================================================================
Finished build.
============================================================================
============================================================================
Build step 'Execute shell' marked build as failure
Archiving artifacts
Sending artifact delta relative to PreCommit-YARN-Build #8782
Archived 58 artifacts
Archive block size is 32768
Received 45 blocks and 28713230 bytes
Compression is 4.9%
Took 5.9 sec
[description-setter] Could not determine description.
Recording test results
Email was triggered for: Failure
Sending email for trigger: Failure
###################################################################################
############################## FAILED TESTS (if any) ##############################
2 tests failed.
FAILED: org.apache.hadoop.yarn.server.resourcemanager.scheduler.capacity.TestContainerAllocation.testAMContainerAllocationWhenDNSUnavailable
Error Message:
expected:<SCHEDULED> but was:<ALLOCATED>
Stack Trace:
java.lang.AssertionError: expected:<SCHEDULED> but was:<ALLOCATED>
at org.junit.Assert.fail(Assert.java:88)
at org.junit.Assert.failNotEquals(Assert.java:743)
at org.junit.Assert.assertEquals(Assert.java:118)
at org.junit.Assert.assertEquals(Assert.java:144)
at org.apache.hadoop.yarn.server.resourcemanager.scheduler.capacity.TestContainerAllocation.testAMContainerAllocationWhenDNSUnavailable(TestContainerAllocation.java:321)
FAILED: org.apache.hadoop.yarn.server.resourcemanager.scheduler.capacity.TestContainerAllocation.testNormalContainerAllocationWhenDNSUnavailable
Error Message:
expected:<0> but was:<1>
Stack Trace:
java.lang.AssertionError: expected:<0> but was:<1>
at org.junit.Assert.fail(Assert.java:88)
at org.junit.Assert.failNotEquals(Assert.java:743)
at org.junit.Assert.assertEquals(Assert.java:118)
at org.junit.Assert.assertEquals(Assert.java:555)
at org.junit.Assert.assertEquals(Assert.java:542)
at org.apache.hadoop.yarn.server.resourcemanager.scheduler.capacity.TestContainerAllocation.testNormalContainerAllocationWhenDNSUnavailable(TestContainerAllocation.java:206)
Failed: YARN-3045 PreCommit Build #8832
Posted by Apache Jenkins Server <je...@builds.apache.org>.
Jira: https://issues.apache.org/jira/browse/YARN-3045
Build: https://builds.apache.org/job/PreCommit-YARN-Build/8832/
###################################################################################
########################## LAST 60 LINES OF THE CONSOLE ###########################
[...truncated 418 lines...]
| +1 | yarn tests | 8m 6s | Tests passed in
| | | | hadoop-yarn-applications-distributeds
| | | | hell.
| +1 | yarn tests | 6m 22s | Tests passed in
| | | | hadoop-yarn-server-nodemanager.
| +1 | yarn tests | 1m 24s | Tests passed in
| | | | hadoop-yarn-server-timelineservice.
| | | 56m 15s |
Reason | Tests
FindBugs | module:hadoop-yarn-server-nodemanager
|| Subsystem || Report/Notes ||
============================================================================
| Patch URL | http://issues.apache.org/jira/secure/attachment/12749943/YARN-3045-YARN-2928.009.patch |
| Optional Tests | javac unit findbugs checkstyle javadoc |
| git revision | YARN-2928 / bcd755e |
| javac | /home/jenkins/jenkins-slave/workspace/PreCommit-YARN-Build/patchprocess/diffJavacWarnings.txt |
| Findbugs warnings | /home/jenkins/jenkins-slave/workspace/PreCommit-YARN-Build/patchprocess/newPatchFindbugsWarningshadoop-yarn-server-nodemanager.html |
| hadoop-yarn-applications-distributedshell test log | /home/jenkins/jenkins-slave/workspace/PreCommit-YARN-Build/patchprocess/testrun_hadoop-yarn-applications-distributedshell.txt |
| hadoop-yarn-server-nodemanager test log | /home/jenkins/jenkins-slave/workspace/PreCommit-YARN-Build/patchprocess/testrun_hadoop-yarn-server-nodemanager.txt |
| hadoop-yarn-server-timelineservice test log | /home/jenkins/jenkins-slave/workspace/PreCommit-YARN-Build/patchprocess/testrun_hadoop-yarn-server-timelineservice.txt |
| Test Results | https://builds.apache.org/job/PreCommit-YARN-Build/8832/testReport/ |
| Java | 1.7.0_55 |
| uname | Linux asf909.gq1.ygridcore.net 3.13.0-36-lowlatency #63-Ubuntu SMP PREEMPT Wed Sep 3 21:56:12 UTC 2014 x86_64 x86_64 x86_64 GNU/Linux |
============================================================================
============================================================================
Adding comment to JIRA
============================================================================
============================================================================
Comment added.
ec1376aea00eacd9016378718a1a7f21938c8bbd logged out
============================================================================
============================================================================
Finished build.
============================================================================
============================================================================
Build step 'Execute shell' marked build as failure
Archiving artifacts
Sending artifact delta relative to PreCommit-YARN-Build #8782
Archived 52 artifacts
Archive block size is 32768
Received 38 blocks and 9605124 bytes
Compression is 11.5%
Took 2 sec
[description-setter] Could not determine description.
Recording test results
Email was triggered for: Failure
Sending email for trigger: Failure
###################################################################################
############################## FAILED TESTS (if any) ##############################
All tests passed
Failed: YARN-3964 PreCommit Build #8831
Posted by Apache Jenkins Server <je...@builds.apache.org>.
Jira: https://issues.apache.org/jira/browse/YARN-3964
Build: https://builds.apache.org/job/PreCommit-YARN-Build/8831/
###################################################################################
########################## LAST 60 LINES OF THE CONSOLE ###########################
[...truncated 492 lines...]
| | | | hadoop-yarn-server-resourcemanager.
| | | 123m 23s |
Reason | Tests
FindBugs | module:hadoop-yarn-server-resourcemanager
Failed unit tests | hadoop.yarn.util.TestRackResolver
| hadoop.yarn.server.resourcemanager.scheduler.capacity.TestContainerAllocation
|| Subsystem || Report/Notes ||
============================================================================
| Patch URL | http://issues.apache.org/jira/secure/attachment/12750043/YARN-3964.003.patch |
| Optional Tests | javadoc javac unit findbugs checkstyle |
| git revision | trunk / 1c12adb |
| Pre-patch Findbugs warnings | /home/jenkins/jenkins-slave/workspace/PreCommit-YARN-Build/patchprocess/trunkFindbugsWarningshadoop-yarn-server-common.html |
| checkstyle | /home/jenkins/jenkins-slave/workspace/PreCommit-YARN-Build/patchprocess/diffcheckstylehadoop-yarn-api.txt /home/jenkins/jenkins-slave/workspace/PreCommit-YARN-Build/patchprocess/diffcheckstylehadoop-yarn-server-common.txt |
| Findbugs warnings | /home/jenkins/jenkins-slave/workspace/PreCommit-YARN-Build/patchprocess/newPatchFindbugsWarningshadoop-yarn-server-resourcemanager.html |
| hadoop-yarn-api test log | /home/jenkins/jenkins-slave/workspace/PreCommit-YARN-Build/patchprocess/testrun_hadoop-yarn-api.txt |
| hadoop-yarn-client test log | /home/jenkins/jenkins-slave/workspace/PreCommit-YARN-Build/patchprocess/testrun_hadoop-yarn-client.txt |
| hadoop-yarn-common test log | /home/jenkins/jenkins-slave/workspace/PreCommit-YARN-Build/patchprocess/testrun_hadoop-yarn-common.txt |
| hadoop-yarn-server-common test log | /home/jenkins/jenkins-slave/workspace/PreCommit-YARN-Build/patchprocess/testrun_hadoop-yarn-server-common.txt |
| hadoop-yarn-server-nodemanager test log | /home/jenkins/jenkins-slave/workspace/PreCommit-YARN-Build/patchprocess/testrun_hadoop-yarn-server-nodemanager.txt |
| hadoop-yarn-server-resourcemanager test log | /home/jenkins/jenkins-slave/workspace/PreCommit-YARN-Build/patchprocess/testrun_hadoop-yarn-server-resourcemanager.txt |
| Test Results | https://builds.apache.org/job/PreCommit-YARN-Build/8831/testReport/ |
| Java | 1.7.0_55 |
| uname | Linux asf905.gq1.ygridcore.net 3.13.0-36-lowlatency #63-Ubuntu SMP PREEMPT Wed Sep 3 21:56:12 UTC 2014 x86_64 x86_64 x86_64 GNU/Linux |
============================================================================
============================================================================
Adding comment to JIRA
============================================================================
============================================================================
Comment added.
3edf9bea3bbd9cf3d4c65257a1f99f9ce78850b9 logged out
============================================================================
============================================================================
Finished build.
============================================================================
============================================================================
Build step 'Execute shell' marked build as failure
Archiving artifacts
Sending artifact delta relative to PreCommit-YARN-Build #8782
Archived 95 artifacts
Archive block size is 32768
Received 44 blocks and 32490229 bytes
Compression is 4.2%
Took 6.6 sec
[description-setter] Could not determine description.
Recording test results
Email was triggered for: Failure
Sending email for trigger: Failure
###################################################################################
############################## FAILED TESTS (if any) ##############################
3 tests failed.
FAILED: org.apache.hadoop.yarn.util.TestRackResolver.testCaching
Error Message:
expected:</[default-rack]> but was:</[rack1]>
Stack Trace:
org.junit.ComparisonFailure: expected:</[default-rack]> but was:</[rack1]>
at org.junit.Assert.assertEquals(Assert.java:115)
at org.junit.Assert.assertEquals(Assert.java:144)
at org.apache.hadoop.yarn.util.TestRackResolver.testCaching(TestRackResolver.java:102)
FAILED: org.apache.hadoop.yarn.server.resourcemanager.scheduler.capacity.TestContainerAllocation.testAMContainerAllocationWhenDNSUnavailable
Error Message:
expected:<SCHEDULED> but was:<ALLOCATED>
Stack Trace:
java.lang.AssertionError: expected:<SCHEDULED> but was:<ALLOCATED>
at org.junit.Assert.fail(Assert.java:88)
at org.junit.Assert.failNotEquals(Assert.java:743)
at org.junit.Assert.assertEquals(Assert.java:118)
at org.junit.Assert.assertEquals(Assert.java:144)
at org.apache.hadoop.yarn.server.resourcemanager.scheduler.capacity.TestContainerAllocation.testAMContainerAllocationWhenDNSUnavailable(TestContainerAllocation.java:321)
FAILED: org.apache.hadoop.yarn.server.resourcemanager.scheduler.capacity.TestContainerAllocation.testNormalContainerAllocationWhenDNSUnavailable
Error Message:
expected:<0> but was:<1>
Stack Trace:
java.lang.AssertionError: expected:<0> but was:<1>
at org.junit.Assert.fail(Assert.java:88)
at org.junit.Assert.failNotEquals(Assert.java:743)
at org.junit.Assert.assertEquals(Assert.java:118)
at org.junit.Assert.assertEquals(Assert.java:555)
at org.junit.Assert.assertEquals(Assert.java:542)
at org.apache.hadoop.yarn.server.resourcemanager.scheduler.capacity.TestContainerAllocation.testNormalContainerAllocationWhenDNSUnavailable(TestContainerAllocation.java:206)
Failed: YARN-3986 PreCommit Build #8830
Posted by Apache Jenkins Server <je...@builds.apache.org>.
Jira: https://issues.apache.org/jira/browse/YARN-3986
Build: https://builds.apache.org/job/PreCommit-YARN-Build/8830/
###################################################################################
########################## LAST 60 LINES OF THE CONSOLE ###########################
[...truncated 58 lines...]
throws YarnException;
}
error: patch failed: hadoop-yarn-project/hadoop-yarn/hadoop-yarn-server/hadoop-yarn-server-resourcemanager/src/main/java/org/apache/hadoop/yarn/server/resourcemanager/scheduler/YarnScheduler.java:306
error: hadoop-yarn-project/hadoop-yarn/hadoop-yarn-server/hadoop-yarn-server-resourcemanager/src/main/java/org/apache/hadoop/yarn/server/resourcemanager/scheduler/YarnScheduler.java: patch does not apply
Checking patch hadoop-yarn-project/hadoop-yarn/hadoop-yarn-server/hadoop-yarn-server-resourcemanager/src/test/java/org/apache/hadoop/yarn/server/resourcemanager/TestWorkPreservingRMRestart.java...
git apply failed. Going to apply the patch with: /usr/bin/patch
The patch does not appear to apply with p0 to p2
PATCH APPLICATION FAILED
Elapsed time: 0m 0s
-1 overall
| Vote | Subsystem | Runtime | Comment
============================================================================
| -1 | patch | 0m 0s | The patch command could not apply the
| | | | patch during dryrun.
|| Subsystem || Report/Notes ||
============================================================================
| Patch URL | http://issues.apache.org/jira/secure/attachment/12749639/YARN-3986.02.patch |
| Optional Tests | javadoc javac unit findbugs checkstyle |
| git revision | trunk / 1ea1a83 |
============================================================================
============================================================================
Adding comment to JIRA
============================================================================
============================================================================
Comment added.
fe1b3a6eb364f10524f53ea4d77f1e9b358ae394 logged out
============================================================================
============================================================================
Finished build.
============================================================================
============================================================================
Build step 'Execute shell' marked build as failure
Archiving artifacts
Sending artifact delta relative to PreCommit-YARN-Build #8782
Archived 3 artifacts
Archive block size is 32768
Received 0 blocks and 81214 bytes
Compression is 0.0%
Took 0.18 sec
[description-setter] Could not determine description.
Recording test results
Email was triggered for: Failure
Sending email for trigger: Failure
###################################################################################
############################## FAILED TESTS (if any) ##############################
No tests ran.
Failed: YARN-4026 PreCommit Build #8829
Posted by Apache Jenkins Server <je...@builds.apache.org>.
Jira: https://issues.apache.org/jira/browse/YARN-4026
Build: https://builds.apache.org/job/PreCommit-YARN-Build/8829/
###################################################################################
########################## LAST 60 LINES OF THE CONSOLE ###########################
[...truncated 315 lines...]
| | | | --whitespace=fix.
| +1 | install | 1m 20s | mvn install still works.
| +1 | eclipse:eclipse | 0m 33s | The patch built with
| | | | eclipse:eclipse.
| +1 | findbugs | 1m 29s | The patch does not introduce any
| | | | new Findbugs (version 3.0.0)
| | | | warnings.
| -1 | yarn tests | 53m 24s | Tests failed in
| | | | hadoop-yarn-server-resourcemanager.
| | | 91m 53s |
Reason | Tests
Failed unit tests | hadoop.yarn.server.resourcemanager.scheduler.capacity.TestContainerAllocation
|| Subsystem || Report/Notes ||
============================================================================
| Patch URL | http://issues.apache.org/jira/secure/attachment/12750004/YARN-4026.3.patch |
| Optional Tests | javadoc javac unit findbugs checkstyle |
| git revision | trunk / 3ae716f |
| checkstyle | /home/jenkins/jenkins-slave/workspace/PreCommit-YARN-Build/patchprocess/diffcheckstylehadoop-yarn-server-resourcemanager.txt |
| whitespace | /home/jenkins/jenkins-slave/workspace/PreCommit-YARN-Build/patchprocess/whitespace.txt |
| hadoop-yarn-server-resourcemanager test log | /home/jenkins/jenkins-slave/workspace/PreCommit-YARN-Build/patchprocess/testrun_hadoop-yarn-server-resourcemanager.txt |
| Test Results | https://builds.apache.org/job/PreCommit-YARN-Build/8829/testReport/ |
| Java | 1.7.0_55 |
| uname | Linux asf909.gq1.ygridcore.net 3.13.0-36-lowlatency #63-Ubuntu SMP PREEMPT Wed Sep 3 21:56:12 UTC 2014 x86_64 x86_64 x86_64 GNU/Linux |
============================================================================
============================================================================
Adding comment to JIRA
============================================================================
============================================================================
Comment added.
e5b124a5adfc3d9eacf1169fda13e24a1f035791 logged out
============================================================================
============================================================================
Finished build.
============================================================================
============================================================================
Build step 'Execute shell' marked build as failure
Archiving artifacts
Sending artifact delta relative to PreCommit-YARN-Build #8782
Archived 30 artifacts
Archive block size is 32768
Received 49 blocks and 11896282 bytes
Compression is 11.9%
Took 2.5 sec
[description-setter] Could not determine description.
Recording test results
Email was triggered for: Failure
Sending email for trigger: Failure
###################################################################################
############################## FAILED TESTS (if any) ##############################
2 tests failed.
FAILED: org.apache.hadoop.yarn.server.resourcemanager.scheduler.capacity.TestContainerAllocation.testAMContainerAllocationWhenDNSUnavailable
Error Message:
expected:<SCHEDULED> but was:<ALLOCATED>
Stack Trace:
java.lang.AssertionError: expected:<SCHEDULED> but was:<ALLOCATED>
at org.junit.Assert.fail(Assert.java:88)
at org.junit.Assert.failNotEquals(Assert.java:743)
at org.junit.Assert.assertEquals(Assert.java:118)
at org.junit.Assert.assertEquals(Assert.java:144)
at org.apache.hadoop.yarn.server.resourcemanager.scheduler.capacity.TestContainerAllocation.testAMContainerAllocationWhenDNSUnavailable(TestContainerAllocation.java:321)
FAILED: org.apache.hadoop.yarn.server.resourcemanager.scheduler.capacity.TestContainerAllocation.testNormalContainerAllocationWhenDNSUnavailable
Error Message:
expected:<0> but was:<1>
Stack Trace:
java.lang.AssertionError: expected:<0> but was:<1>
at org.junit.Assert.fail(Assert.java:88)
at org.junit.Assert.failNotEquals(Assert.java:743)
at org.junit.Assert.assertEquals(Assert.java:118)
at org.junit.Assert.assertEquals(Assert.java:555)
at org.junit.Assert.assertEquals(Assert.java:542)
at org.apache.hadoop.yarn.server.resourcemanager.scheduler.capacity.TestContainerAllocation.testNormalContainerAllocationWhenDNSUnavailable(TestContainerAllocation.java:206)
Failed: YARN-313 PreCommit Build #8828
Posted by Apache Jenkins Server <je...@builds.apache.org>.
Jira: https://issues.apache.org/jira/browse/YARN-313
Build: https://builds.apache.org/job/PreCommit-YARN-Build/8828/
###################################################################################
########################## LAST 60 LINES OF THE CONSOLE ###########################
[...truncated 417 lines...]
| -1 | yarn tests | 6m 58s | Tests failed in hadoop-yarn-client.
| -1 | yarn tests | 2m 0s | Tests failed in hadoop-yarn-common.
| -1 | yarn tests | 53m 35s | Tests failed in
| | | | hadoop-yarn-server-resourcemanager.
| | | 111m 5s |
Reason | Tests
Failed unit tests | hadoop.yarn.client.cli.TestRMAdminCLI
| hadoop.yarn.client.api.impl.TestYarnClient
| hadoop.yarn.util.TestRackResolver
| hadoop.yarn.server.resourcemanager.scheduler.capacity.TestContainerAllocation
|| Subsystem || Report/Notes ||
============================================================================
| Patch URL | http://issues.apache.org/jira/secure/attachment/12749993/YARN-313-v7.patch |
| Optional Tests | javadoc javac unit findbugs checkstyle |
| git revision | trunk / 3ae716f |
| checkstyle | /home/jenkins/jenkins-slave/workspace/PreCommit-YARN-Build/patchprocess/diffcheckstylehadoop-yarn-api.txt |
| hadoop-yarn-api test log | /home/jenkins/jenkins-slave/workspace/PreCommit-YARN-Build/patchprocess/testrun_hadoop-yarn-api.txt |
| hadoop-yarn-client test log | /home/jenkins/jenkins-slave/workspace/PreCommit-YARN-Build/patchprocess/testrun_hadoop-yarn-client.txt |
| hadoop-yarn-common test log | /home/jenkins/jenkins-slave/workspace/PreCommit-YARN-Build/patchprocess/testrun_hadoop-yarn-common.txt |
| hadoop-yarn-server-resourcemanager test log | /home/jenkins/jenkins-slave/workspace/PreCommit-YARN-Build/patchprocess/testrun_hadoop-yarn-server-resourcemanager.txt |
| Test Results | https://builds.apache.org/job/PreCommit-YARN-Build/8828/testReport/ |
| Java | 1.7.0_55 |
| uname | Linux asf903.gq1.ygridcore.net 3.13.0-36-lowlatency #63-Ubuntu SMP PREEMPT Wed Sep 3 21:56:12 UTC 2014 x86_64 x86_64 x86_64 GNU/Linux |
============================================================================
============================================================================
Adding comment to JIRA
============================================================================
============================================================================
Comment added.
fcfceb97a3ae3c614b0d78eb108d4c1099e11e3f logged out
============================================================================
============================================================================
Finished build.
============================================================================
============================================================================
Build step 'Execute shell' marked build as failure
Archiving artifacts
Sending artifact delta relative to PreCommit-YARN-Build #8782
Archived 70 artifacts
Archive block size is 32768
Received 46 blocks and 29492690 bytes
Compression is 4.9%
Took 6.1 sec
[description-setter] Could not determine description.
Recording test results
Email was triggered for: Failure
Sending email for trigger: Failure
###################################################################################
############################## FAILED TESTS (if any) ##############################
5 tests failed.
FAILED: org.apache.hadoop.yarn.client.api.impl.TestYarnClient.testReservationAPIs
Error Message:
org.apache.hadoop.yarn.server.resourcemanager.reservation.exceptions.PlanningException: The planning algorithm could not find a valid allocation for your request
at org.apache.hadoop.yarn.ipc.RPCUtil.getRemoteException(RPCUtil.java:38)
at org.apache.hadoop.yarn.server.resourcemanager.ClientRMService.submitReservation(ClientRMService.java:1140)
at org.apache.hadoop.yarn.api.impl.pb.service.ApplicationClientProtocolPBServiceImpl.submitReservation(ApplicationClientProtocolPBServiceImpl.java:423)
at org.apache.hadoop.yarn.proto.ApplicationClientProtocol$ApplicationClientProtocolService$2.callBlockingMethod(ApplicationClientProtocol.java:449)
at org.apache.hadoop.ipc.ProtobufRpcEngine$Server$ProtoBufRpcInvoker.call(ProtobufRpcEngine.java:636)
at org.apache.hadoop.ipc.RPC$Server.call(RPC.java:976)
at org.apache.hadoop.ipc.Server$Handler$1.run(Server.java:2174)
at org.apache.hadoop.ipc.Server$Handler$1.run(Server.java:2170)
at java.security.AccessController.doPrivileged(Native Method)
at javax.security.auth.Subject.doAs(Subject.java:415)
at org.apache.hadoop.security.UserGroupInformation.doAs(UserGroupInformation.java:1667)
at org.apache.hadoop.ipc.Server$Handler.run(Server.java:2168)
Caused by: org.apache.hadoop.yarn.server.resourcemanager.reservation.exceptions.PlanningException: The planning algorithm could not find a valid allocation for your request
at org.apache.hadoop.yarn.server.resourcemanager.reservation.planning.PlanningAlgorithm.allocateUser(PlanningAlgorithm.java:69)
at org.apache.hadoop.yarn.server.resourcemanager.reservation.planning.PlanningAlgorithm.createReservation(PlanningAlgorithm.java:140)
at org.apache.hadoop.yarn.server.resourcemanager.reservation.planning.TryManyReservationAgents.createReservation(TryManyReservationAgents.java:55)
at org.apache.hadoop.yarn.server.resourcemanager.reservation.planning.AlignedPlannerWithGreedy.createReservation(AlignedPlannerWithGreedy.java:84)
at org.apache.hadoop.yarn.server.resourcemanager.ClientRMService.submitReservation(ClientRMService.java:1123)
... 10 more
Stack Trace:
java.lang.AssertionError: org.apache.hadoop.yarn.server.resourcemanager.reservation.exceptions.PlanningException: The planning algorithm could not find a valid allocation for your request
at org.apache.hadoop.yarn.ipc.RPCUtil.getRemoteException(RPCUtil.java:38)
at org.apache.hadoop.yarn.server.resourcemanager.ClientRMService.submitReservation(ClientRMService.java:1140)
at org.apache.hadoop.yarn.api.impl.pb.service.ApplicationClientProtocolPBServiceImpl.submitReservation(ApplicationClientProtocolPBServiceImpl.java:423)
at org.apache.hadoop.yarn.proto.ApplicationClientProtocol$ApplicationClientProtocolService$2.callBlockingMethod(ApplicationClientProtocol.java:449)
at org.apache.hadoop.ipc.ProtobufRpcEngine$Server$ProtoBufRpcInvoker.call(ProtobufRpcEngine.java:636)
at org.apache.hadoop.ipc.RPC$Server.call(RPC.java:976)
at org.apache.hadoop.ipc.Server$Handler$1.run(Server.java:2174)
at org.apache.hadoop.ipc.Server$Handler$1.run(Server.java:2170)
at java.security.AccessController.doPrivileged(Native Method)
at javax.security.auth.Subject.doAs(Subject.java:415)
at org.apache.hadoop.security.UserGroupInformation.doAs(UserGroupInformation.java:1667)
at org.apache.hadoop.ipc.Server$Handler.run(Server.java:2168)
Caused by: org.apache.hadoop.yarn.server.resourcemanager.reservation.exceptions.PlanningException: The planning algorithm could not find a valid allocation for your request
at org.apache.hadoop.yarn.server.resourcemanager.reservation.planning.PlanningAlgorithm.allocateUser(PlanningAlgorithm.java:69)
at org.apache.hadoop.yarn.server.resourcemanager.reservation.planning.PlanningAlgorithm.createReservation(PlanningAlgorithm.java:140)
at org.apache.hadoop.yarn.server.resourcemanager.reservation.planning.TryManyReservationAgents.createReservation(TryManyReservationAgents.java:55)
at org.apache.hadoop.yarn.server.resourcemanager.reservation.planning.AlignedPlannerWithGreedy.createReservation(AlignedPlannerWithGreedy.java:84)
at org.apache.hadoop.yarn.server.resourcemanager.ClientRMService.submitReservation(ClientRMService.java:1123)
... 10 more
at org.junit.Assert.fail(Assert.java:88)
at org.apache.hadoop.yarn.client.api.impl.TestYarnClient.testReservationAPIs(TestYarnClient.java:1204)
FAILED: org.apache.hadoop.yarn.client.cli.TestRMAdminCLI.testRefreshNodesWithGracefulTimeout
Error Message:
Wanted but not invoked:
resourceManagerAdministrationProtocol.refreshNodes(
decommissionType: GRACEFUL
);
-> at org.apache.hadoop.yarn.client.cli.TestRMAdminCLI.testRefreshNodesWithGracefulTimeout(TestRMAdminCLI.java:198)
Actually, there were zero interactions with this mock.
Stack Trace:
org.mockito.exceptions.verification.WantedButNotInvoked:
Wanted but not invoked:
resourceManagerAdministrationProtocol.refreshNodes(
decommissionType: GRACEFUL
);
-> at org.apache.hadoop.yarn.client.cli.TestRMAdminCLI.testRefreshNodesWithGracefulTimeout(TestRMAdminCLI.java:198)
Actually, there were zero interactions with this mock.
at org.apache.hadoop.yarn.client.cli.TestRMAdminCLI.testRefreshNodesWithGracefulTimeout(TestRMAdminCLI.java:198)
FAILED: org.apache.hadoop.yarn.util.TestRackResolver.testCaching
Error Message:
expected:</[default-rack]> but was:</[rack1]>
Stack Trace:
org.junit.ComparisonFailure: expected:</[default-rack]> but was:</[rack1]>
at org.junit.Assert.assertEquals(Assert.java:115)
at org.junit.Assert.assertEquals(Assert.java:144)
at org.apache.hadoop.yarn.util.TestRackResolver.testCaching(TestRackResolver.java:102)
FAILED: org.apache.hadoop.yarn.server.resourcemanager.scheduler.capacity.TestContainerAllocation.testAMContainerAllocationWhenDNSUnavailable
Error Message:
expected:<SCHEDULED> but was:<ALLOCATED>
Stack Trace:
java.lang.AssertionError: expected:<SCHEDULED> but was:<ALLOCATED>
at org.junit.Assert.fail(Assert.java:88)
at org.junit.Assert.failNotEquals(Assert.java:743)
at org.junit.Assert.assertEquals(Assert.java:118)
at org.junit.Assert.assertEquals(Assert.java:144)
at org.apache.hadoop.yarn.server.resourcemanager.scheduler.capacity.TestContainerAllocation.testAMContainerAllocationWhenDNSUnavailable(TestContainerAllocation.java:321)
FAILED: org.apache.hadoop.yarn.server.resourcemanager.scheduler.capacity.TestContainerAllocation.testNormalContainerAllocationWhenDNSUnavailable
Error Message:
expected:<0> but was:<1>
Stack Trace:
java.lang.AssertionError: expected:<0> but was:<1>
at org.junit.Assert.fail(Assert.java:88)
at org.junit.Assert.failNotEquals(Assert.java:743)
at org.junit.Assert.assertEquals(Assert.java:118)
at org.junit.Assert.assertEquals(Assert.java:555)
at org.junit.Assert.assertEquals(Assert.java:542)
at org.apache.hadoop.yarn.server.resourcemanager.scheduler.capacity.TestContainerAllocation.testNormalContainerAllocationWhenDNSUnavailable(TestContainerAllocation.java:206)
Failed: YARN-4026 PreCommit Build #8827
Posted by Apache Jenkins Server <je...@builds.apache.org>.
Jira: https://issues.apache.org/jira/browse/YARN-4026
Build: https://builds.apache.org/job/PreCommit-YARN-Build/8827/
###################################################################################
########################## LAST 60 LINES OF THE CONSOLE ###########################
[...truncated 316 lines...]
| +1 | install | 1m 27s | mvn install still works.
| +1 | eclipse:eclipse | 0m 36s | The patch built with
| | | | eclipse:eclipse.
| +1 | findbugs | 1m 34s | The patch does not introduce any
| | | | new Findbugs (version 3.0.0)
| | | | warnings.
| -1 | yarn tests | 53m 47s | Tests failed in
| | | | hadoop-yarn-server-resourcemanager.
| | | 94m 41s |
Reason | Tests
Failed unit tests | hadoop.yarn.server.resourcemanager.TestRMAdminService
| hadoop.yarn.server.resourcemanager.scheduler.capacity.TestContainerAllocation
|| Subsystem || Report/Notes ||
============================================================================
| Patch URL | http://issues.apache.org/jira/secure/attachment/12750004/YARN-4026.3.patch |
| Optional Tests | javadoc javac unit findbugs checkstyle |
| git revision | trunk / 7c796fd |
| checkstyle | /home/jenkins/jenkins-slave/workspace/PreCommit-YARN-Build/patchprocess/diffcheckstylehadoop-yarn-server-resourcemanager.txt |
| whitespace | /home/jenkins/jenkins-slave/workspace/PreCommit-YARN-Build/patchprocess/whitespace.txt |
| hadoop-yarn-server-resourcemanager test log | /home/jenkins/jenkins-slave/workspace/PreCommit-YARN-Build/patchprocess/testrun_hadoop-yarn-server-resourcemanager.txt |
| Test Results | https://builds.apache.org/job/PreCommit-YARN-Build/8827/testReport/ |
| Java | 1.7.0_55 |
| uname | Linux asf905.gq1.ygridcore.net 3.13.0-36-lowlatency #63-Ubuntu SMP PREEMPT Wed Sep 3 21:56:12 UTC 2014 x86_64 x86_64 x86_64 GNU/Linux |
============================================================================
============================================================================
Adding comment to JIRA
============================================================================
============================================================================
Comment added.
126c2f75fd7c48e0fd4d13e7a3a57cfe9400a6a5 logged out
============================================================================
============================================================================
Finished build.
============================================================================
============================================================================
Build step 'Execute shell' marked build as failure
Archiving artifacts
Sending artifact delta relative to PreCommit-YARN-Build #8782
Archived 30 artifacts
Archive block size is 32768
Received 53 blocks and 11760342 bytes
Compression is 12.9%
Took 2.7 sec
[description-setter] Could not determine description.
Recording test results
Email was triggered for: Failure
Sending email for trigger: Failure
###################################################################################
############################## FAILED TESTS (if any) ##############################
4 tests failed.
FAILED: org.apache.hadoop.yarn.server.resourcemanager.TestRMAdminService.testModifyLabelsOnNodesWithDistributedConfigurationDisabled
Error Message:
null
Stack Trace:
java.lang.NullPointerException: null
at org.apache.hadoop.util.JvmPauseMonitor.stop(JvmPauseMonitor.java:86)
at org.apache.hadoop.yarn.server.resourcemanager.ResourceManager$RMActiveServices.serviceStop(ResourceManager.java:601)
at org.apache.hadoop.service.AbstractService.stop(AbstractService.java:221)
at org.apache.hadoop.yarn.server.resourcemanager.ResourceManager.stopActiveServices(ResourceManager.java:983)
at org.apache.hadoop.yarn.server.resourcemanager.ResourceManager.transitionToStandby(ResourceManager.java:1038)
at org.apache.hadoop.yarn.server.resourcemanager.ResourceManager.serviceStop(ResourceManager.java:1085)
at org.apache.hadoop.service.AbstractService.stop(AbstractService.java:221)
at org.apache.hadoop.service.AbstractService.close(AbstractService.java:250)
at org.apache.hadoop.yarn.server.resourcemanager.TestRMAdminService.testModifyLabelsOnNodesWithDistributedConfigurationDisabled(TestRMAdminService.java:824)
FAILED: org.apache.hadoop.yarn.server.resourcemanager.TestRMAdminService.testRemoveClusterNodeLabelsWithDistributedConfigurationEnabled
Error Message:
null
Stack Trace:
java.lang.NullPointerException: null
at org.apache.hadoop.util.JvmPauseMonitor.stop(JvmPauseMonitor.java:86)
at org.apache.hadoop.yarn.server.resourcemanager.ResourceManager$RMActiveServices.serviceStop(ResourceManager.java:601)
at org.apache.hadoop.service.AbstractService.stop(AbstractService.java:221)
at org.apache.hadoop.yarn.server.resourcemanager.ResourceManager.stopActiveServices(ResourceManager.java:983)
at org.apache.hadoop.yarn.server.resourcemanager.ResourceManager.transitionToStandby(ResourceManager.java:1038)
at org.apache.hadoop.yarn.server.resourcemanager.ResourceManager.serviceStop(ResourceManager.java:1085)
at org.apache.hadoop.service.AbstractService.stop(AbstractService.java:221)
at org.apache.hadoop.service.AbstractService.close(AbstractService.java:250)
at org.apache.hadoop.yarn.server.resourcemanager.TestRMAdminService.testRemoveClusterNodeLabelsWithDistributedConfigurationEnabled(TestRMAdminService.java:867)
FAILED: org.apache.hadoop.yarn.server.resourcemanager.scheduler.capacity.TestContainerAllocation.testAMContainerAllocationWhenDNSUnavailable
Error Message:
expected:<SCHEDULED> but was:<ALLOCATED>
Stack Trace:
java.lang.AssertionError: expected:<SCHEDULED> but was:<ALLOCATED>
at org.junit.Assert.fail(Assert.java:88)
at org.junit.Assert.failNotEquals(Assert.java:743)
at org.junit.Assert.assertEquals(Assert.java:118)
at org.junit.Assert.assertEquals(Assert.java:144)
at org.apache.hadoop.yarn.server.resourcemanager.scheduler.capacity.TestContainerAllocation.testAMContainerAllocationWhenDNSUnavailable(TestContainerAllocation.java:321)
FAILED: org.apache.hadoop.yarn.server.resourcemanager.scheduler.capacity.TestContainerAllocation.testNormalContainerAllocationWhenDNSUnavailable
Error Message:
expected:<0> but was:<1>
Stack Trace:
java.lang.AssertionError: expected:<0> but was:<1>
at org.junit.Assert.fail(Assert.java:88)
at org.junit.Assert.failNotEquals(Assert.java:743)
at org.junit.Assert.assertEquals(Assert.java:118)
at org.junit.Assert.assertEquals(Assert.java:555)
at org.junit.Assert.assertEquals(Assert.java:542)
at org.apache.hadoop.yarn.server.resourcemanager.scheduler.capacity.TestContainerAllocation.testNormalContainerAllocationWhenDNSUnavailable(TestContainerAllocation.java:206)
Failed: YARN-3045 PreCommit Build #8826
Posted by Apache Jenkins Server <je...@builds.apache.org>.
Jira: https://issues.apache.org/jira/browse/YARN-3045
Build: https://builds.apache.org/job/PreCommit-YARN-Build/8826/
###################################################################################
########################## LAST 60 LINES OF THE CONSOLE ###########################
[...truncated 419 lines...]
| | | | hadoop-yarn-applications-distributeds
| | | | hell.
| -1 | yarn tests | 6m 4s | Tests failed in
| | | | hadoop-yarn-server-nodemanager.
| +1 | yarn tests | 1m 22s | Tests passed in
| | | | hadoop-yarn-server-timelineservice.
| | | 55m 53s |
Reason | Tests
FindBugs | module:hadoop-yarn-server-nodemanager
Failed unit tests | hadoop.yarn.server.nodemanager.TestDeletionService
|| Subsystem || Report/Notes ||
============================================================================
| Patch URL | http://issues.apache.org/jira/secure/attachment/12749943/YARN-3045-YARN-2928.009.patch |
| Optional Tests | javac unit findbugs checkstyle javadoc |
| git revision | YARN-2928 / 07433c2 |
| javac | /home/jenkins/jenkins-slave/workspace/PreCommit-YARN-Build/patchprocess/diffJavacWarnings.txt |
| Findbugs warnings | /home/jenkins/jenkins-slave/workspace/PreCommit-YARN-Build/patchprocess/newPatchFindbugsWarningshadoop-yarn-server-nodemanager.html |
| hadoop-yarn-applications-distributedshell test log | /home/jenkins/jenkins-slave/workspace/PreCommit-YARN-Build/patchprocess/testrun_hadoop-yarn-applications-distributedshell.txt |
| hadoop-yarn-server-nodemanager test log | /home/jenkins/jenkins-slave/workspace/PreCommit-YARN-Build/patchprocess/testrun_hadoop-yarn-server-nodemanager.txt |
| hadoop-yarn-server-timelineservice test log | /home/jenkins/jenkins-slave/workspace/PreCommit-YARN-Build/patchprocess/testrun_hadoop-yarn-server-timelineservice.txt |
| Test Results | https://builds.apache.org/job/PreCommit-YARN-Build/8826/testReport/ |
| Java | 1.7.0_55 |
| uname | Linux asf907.gq1.ygridcore.net 3.13.0-36-lowlatency #63-Ubuntu SMP PREEMPT Wed Sep 3 21:56:12 UTC 2014 x86_64 x86_64 x86_64 GNU/Linux |
============================================================================
============================================================================
Adding comment to JIRA
============================================================================
============================================================================
Comment added.
48a8f6c933caa79c2f42b6217af9453b6b4293ff logged out
============================================================================
============================================================================
Finished build.
============================================================================
============================================================================
Build step 'Execute shell' marked build as failure
Archiving artifacts
Sending artifact delta relative to PreCommit-YARN-Build #8782
Archived 52 artifacts
Archive block size is 32768
Received 35 blocks and 9677438 bytes
Compression is 10.6%
Took 2.2 sec
[description-setter] Could not determine description.
Recording test results
Email was triggered for: Failure
Sending email for trigger: Failure
###################################################################################
############################## FAILED TESTS (if any) ##############################
1 tests failed.
FAILED: org.apache.hadoop.yarn.server.nodemanager.TestDeletionService.testAbsDelete
Error Message:
/home/jenkins/jenkins-slave/workspace/PreCommit-YARN-Build/hadoop-yarn-project/hadoop-yarn/hadoop-yarn-server/hadoop-yarn-server-nodemanager/target/org.apache.hadoop.yarn.server.nodemanager.TestDeletionService/-6499836351327480810
Stack Trace:
java.nio.file.NoSuchFileException: /home/jenkins/jenkins-slave/workspace/PreCommit-YARN-Build/hadoop-yarn-project/hadoop-yarn/hadoop-yarn-server/hadoop-yarn-server-nodemanager/target/org.apache.hadoop.yarn.server.nodemanager.TestDeletionService/-6499836351327480810
at sun.nio.fs.UnixException.translateToIOException(UnixException.java:86)
at sun.nio.fs.UnixException.rethrowAsIOException(UnixException.java:102)
at sun.nio.fs.UnixException.rethrowAsIOException(UnixException.java:107)
at sun.nio.fs.UnixFileAttributeViews$Basic.readAttributes(UnixFileAttributeViews.java:55)
at sun.nio.fs.UnixFileSystemProvider.readAttributes(UnixFileSystemProvider.java:144)
at sun.nio.fs.LinuxFileSystemProvider.readAttributes(LinuxFileSystemProvider.java:97)
at java.nio.file.Files.readAttributes(Files.java:1684)
at org.apache.hadoop.fs.RawLocalFileSystem$DeprecatedRawLocalFileStatus.<init>(RawLocalFileSystem.java:656)
at org.apache.hadoop.fs.RawLocalFileSystem.deprecatedGetFileStatus(RawLocalFileSystem.java:637)
at org.apache.hadoop.fs.RawLocalFileSystem.getFileLinkStatusInternal(RawLocalFileSystem.java:853)
at org.apache.hadoop.fs.RawLocalFileSystem.getFileStatus(RawLocalFileSystem.java:630)
at org.apache.hadoop.fs.DelegateToFileSystem.getFileStatus(DelegateToFileSystem.java:110)
at org.apache.hadoop.fs.FilterFs.getFileStatus(FilterFs.java:121)
at org.apache.hadoop.fs.FileContext$15.next(FileContext.java:1164)
at org.apache.hadoop.fs.FileContext$15.next(FileContext.java:1160)
at org.apache.hadoop.fs.FSLinkResolver.resolve(FSLinkResolver.java:90)
at org.apache.hadoop.fs.FileContext.getFileStatus(FileContext.java:1160)
at org.apache.hadoop.fs.FileContext$Util.exists(FileContext.java:1625)
at org.apache.hadoop.yarn.server.nodemanager.TestDeletionService.testAbsDelete(TestDeletionService.java:132)
Failed: YARN-4046 PreCommit Build #8825
Posted by Apache Jenkins Server <je...@builds.apache.org>.
Jira: https://issues.apache.org/jira/browse/YARN-4046
Build: https://builds.apache.org/job/PreCommit-YARN-Build/8825/
###################################################################################
########################## LAST 60 LINES OF THE CONSOLE ###########################
[...truncated 284 lines...]
| | | | --whitespace=fix.
| +1 | install | 1m 21s | mvn install still works.
| +1 | eclipse:eclipse | 0m 32s | The patch built with
| | | | eclipse:eclipse.
| +1 | findbugs | 1m 57s | The patch does not introduce any
| | | | new Findbugs (version 3.0.0)
| | | | warnings.
| -1 | common tests | 22m 42s | Tests failed in hadoop-common.
| | | 63m 5s |
Reason | Tests
Failed unit tests | hadoop.ha.TestZKFailoverController
| hadoop.net.TestNetUtils
|| Subsystem || Report/Notes ||
============================================================================
| Patch URL | http://issues.apache.org/jira/secure/attachment/12749949/YARN-4096.001.patch |
| Optional Tests | javadoc javac unit findbugs checkstyle |
| git revision | trunk / 7c796fd |
| checkstyle | /home/jenkins/jenkins-slave/workspace/PreCommit-YARN-Build/patchprocess/diffcheckstylehadoop-common.txt |
| whitespace | /home/jenkins/jenkins-slave/workspace/PreCommit-YARN-Build/patchprocess/whitespace.txt |
| hadoop-common test log | /home/jenkins/jenkins-slave/workspace/PreCommit-YARN-Build/patchprocess/testrun_hadoop-common.txt |
| Test Results | https://builds.apache.org/job/PreCommit-YARN-Build/8825/testReport/ |
| Java | 1.7.0_55 |
| uname | Linux asf903.gq1.ygridcore.net 3.13.0-36-lowlatency #63-Ubuntu SMP PREEMPT Wed Sep 3 21:56:12 UTC 2014 x86_64 x86_64 x86_64 GNU/Linux |
============================================================================
============================================================================
Adding comment to JIRA
============================================================================
============================================================================
Comment added.
b37ecf7be362ae90c062091fe77b07bf08b5eea8 logged out
============================================================================
============================================================================
Finished build.
============================================================================
============================================================================
Build step 'Execute shell' marked build as failure
Archiving artifacts
Sending artifact delta relative to PreCommit-YARN-Build #8782
Archived 30 artifacts
Archive block size is 32768
Received 49 blocks and 18308712 bytes
Compression is 8.1%
Took 4.2 sec
[description-setter] Could not determine description.
Recording test results
Email was triggered for: Failure
Sending email for trigger: Failure
###################################################################################
############################## FAILED TESTS (if any) ##############################
6 tests failed.
FAILED: org.apache.hadoop.ha.TestZKFailoverController.testGracefulFailoverFailBecomingStandbyAndFailFence
Error Message:
Failover should have failed when old node wont fence
Stack Trace:
java.lang.AssertionError: Failover should have failed when old node wont fence
at org.junit.Assert.fail(Assert.java:88)
at org.apache.hadoop.ha.TestZKFailoverController.testGracefulFailoverFailBecomingStandbyAndFailFence(TestZKFailoverController.java:557)
FAILED: org.apache.hadoop.ha.TestZKFailoverController.testGracefulFailover
Error Message:
test timed out after 25000 milliseconds
Stack Trace:
java.lang.Exception: test timed out after 25000 milliseconds
at java.lang.Thread.sleep(Native Method)
at org.apache.hadoop.ha.ActiveStandbyElectorTestUtil.waitForActiveLockData(ActiveStandbyElectorTestUtil.java:68)
at org.apache.hadoop.ha.MiniZKFCCluster.waitForActiveLockHolder(MiniZKFCCluster.java:253)
at org.apache.hadoop.ha.TestZKFailoverController.testGracefulFailover(TestZKFailoverController.java:449)
FAILED: org.apache.hadoop.ha.TestZKFailoverController.testGracefulFailoverFailBecomingStandby
Error Message:
expected:<1> but was:<0>
Stack Trace:
java.lang.AssertionError: expected:<1> but was:<0>
at org.junit.Assert.fail(Assert.java:88)
at org.junit.Assert.failNotEquals(Assert.java:743)
at org.junit.Assert.assertEquals(Assert.java:118)
at org.junit.Assert.assertEquals(Assert.java:555)
at org.junit.Assert.assertEquals(Assert.java:542)
at org.apache.hadoop.ha.TestZKFailoverController.testGracefulFailoverFailBecomingStandby(TestZKFailoverController.java:535)
FAILED: org.apache.hadoop.ha.TestZKFailoverController.testGracefulFailoverMultipleZKfcs
Error Message:
test timed out after 25000 milliseconds
Stack Trace:
java.lang.Exception: test timed out after 25000 milliseconds
at java.lang.Thread.sleep(Native Method)
at org.apache.hadoop.ha.ActiveStandbyElectorTestUtil.waitForActiveLockData(ActiveStandbyElectorTestUtil.java:68)
at org.apache.hadoop.ha.MiniZKFCCluster.waitForActiveLockHolder(MiniZKFCCluster.java:253)
at org.apache.hadoop.ha.TestZKFailoverController.testGracefulFailoverMultipleZKfcs(TestZKFailoverController.java:617)
FAILED: org.apache.hadoop.ha.TestZKFailoverController.testGracefulFailoverFailBecomingActive
Error Message:
Did not fail to graceful failover when target failed to become active!
Stack Trace:
java.lang.AssertionError: Did not fail to graceful failover when target failed to become active!
at org.junit.Assert.fail(Assert.java:88)
at org.apache.hadoop.ha.TestZKFailoverController.testGracefulFailoverFailBecomingActive(TestZKFailoverController.java:501)
FAILED: org.apache.hadoop.net.TestNetUtils.testNormalizeHostName
Error Message:
expected:<[198.105.254.11]> but was:<[UnknownHost123]>
Stack Trace:
org.junit.ComparisonFailure: expected:<[198.105.254.11]> but was:<[UnknownHost123]>
at org.junit.Assert.assertEquals(Assert.java:115)
at org.junit.Assert.assertEquals(Assert.java:144)
at org.apache.hadoop.net.TestNetUtils.testNormalizeHostName(TestNetUtils.java:631)