You are viewing a plain text version of this content. The canonical link for it is here.
Posted to builds@solr.apache.org by Apache Jenkins Server <je...@builds.apache.org> on 2026/10/08 12:23:58 UTC

[JENKINS] Solr » Solr-TestIntegration-10.x - Build # 349 - Failure!

Build: https://ci-builds.apache.org/job/Solr/job/Solr-TestIntegration-10.x/349/

No tests ran.

Build Log:
[...truncated 393 lines...]
# ERROR: Did not see Solr at null come online within 30 seconds!
# 
ok 42 Check export command # in 17836 ms
ok 43 export fails on non cloud mode # in 8757 ms
Waiting for Tika Server to be ready on port 41388
Tika Server is ready on port 41388
ok 44 using curl to extract a single pdf file # in 18275 ms
ok 45 using the bin/solr post tool to extract content from pdf # in 19811 ms
ok 46 using the bin/solr post tool to crawl web site # in 21134 ms
Stopping Tika Server container
ok 47 healthcheck on cloud solr # in 12223 ms
ok 48 healthcheck errors on standalone solr # in 6503 ms
ok 49 solr help flag prints help # in 691 ms
ok 50 solr with no flags prints help # in 690 ms
ok 51 start help flag prints help # in 136 ms
ok 52 start h flag prints help # in 136 ms
ok 53 stop help flag prints help # in 130 ms
ok 54 restart help flag prints help # in 135 ms
ok 55 status help flag prints help # in 743 ms
ok 56 healthcheck help flag prints help # in 690 ms
ok 57 create help flag prints help # in 691 ms
ok 58 delete help flag prints help # in 683 ms
ok 59 zk help flag prints help # in 708 ms
ok 60 auth help flag prints help # in 691 ms
ok 61 assert help flag prints help # in 694 ms
ok 62 post help flag prints help # in 695 ms
ok 63 SQL Module # in 14846 ms
ok 64 icu collation in analysis-extras module # in 11564 ms
ok 65 Check lifecycle of sentiment classification # in 26488 ms
ok 66 Affinity placement plugin using sysprop # in 16497 ms
ok 67 Random placement plugin using ENV # in 14406 ms
ok 68 Check help command # in 2096 ms
ok 69 basic post with a type specified # in 5073 ms
ok 70 basic post with collection instead of url parameter # in 3660 ms
ok 71 basic post with solr-url and collection # in 3645 ms
ok 72 basic post with -s (solr-connection short form) and collection # in 3608 ms
ok 73 basic post WITHOUT a type specified # in 10449 ms
ok 74 crawling a directory as a dry-run # in 726 ms
ok 75 crawling a directory # in 4020 ms
ok 76 skipcommit and optimize and delete # in 3476 ms
ok 77 args mode # in 6282 ms
ok 78 stdin mode # in 3126 ms
ok 79 verbose echo the Solr response # in 3588 ms
ok 80 post solr log into solr via cli # in 8587 ms
# Docker artifacts saved to: /home/jenkins/jenkins-agent/workspace/Solr/Solr-TestIntegration-10.x/solr/packaging/build/test-output/docker
ok 81 Docker SolrCloud rolling upgrade # in 71665 ms
ok 82 allowPaths - backup # in 14462 ms
ok 83 snapshot lifecycle # in 4416 ms
ok 84 snapshot list # in 3046 ms
ok 85 snapshot list via --solr-connection # in 3064 ms
ok 86 snapshot describe # in 3065 ms
ok 87 snapshot describe via --solr-connection # in 3068 ms
ok 88 start solr with ssl # in 15564 ms
ok 89 use different hostname when not checking peer-name # in 23428 ms
ok 90 start solr with ssl and auth # in 13958 ms
ok 91 start solr with client truststore and security manager # in 15485 ms
ok 92 start solr with mTLS needed # in 43090 ms
ok 93 start solr with mTLS wanted # in 31678 ms
ok 94 test keystore reload # in 54888 ms
ok 95 SOLR-11740 check 'solr stop' connection # in 15516 ms
ok 96 stop command for single port # in 17758 ms
ok 97 check stop command doesn't hang # skip timeout utility is not available
ok 98 SOLR-16976 solr starts with remote JMX enabled # in 8002 ms
ok 99 deprecated system properties converted to modern properties # in 43653 ms
ok 100 start with custom jetty options # in 7878 ms
ok 101 -c flag prints no-op warning and still starts in cloud mode # in 8993 ms
ok 102 bootstrapping a configset # in 8921 ms
ok 103 status detects locally running solr # in 2550 ms
ok 104 status with --solr-url from user # in 1248 ms
ok 105 status with --port from user # in 1293 ms
ok 106 multiple connection options are prevented # in 724 ms
ok 107 status with invalid --solr-url from user # in 965 ms
ok 108 status with --short format # in 726 ms
ok 109 searching solr via locally executed streaming expression # in 1626 ms
ok 110 searching solr via remotely executed streaming expression by solr-url # in 1385 ms
ok 111 searching solr via remotely executed streaming expression by solr connection # in 1106 ms
ok 112 variable interpolation # in 1578 ms
ok 113 searching solr without credentials fails with error # in 1057 ms
ok 114 --version returns Solr version # in 675 ms
ok 115 version as direct tool call still runs # in 678 ms
ok 116 short help # in 743 ms
ok 117 short help is inferred # in 706 ms
ok 118 long help # in 716 ms
ok 119 listing out files # in 1051 ms
ok 120 connecting to solr via various solr urls and zk hosts # in 7873 ms
ok 121 copying files around # in 7344 ms
ok 122 upconfig # in 1347 ms
ok 123 SOLR-12429 test upconfig fails with symlink # in 1030 ms
ok 124 downconfig # in 1097 ms
ok 125 bin/solr zk cp gets 'solrhome' from '--solr-home' command line option # in 1336 ms
ok 126 env var ZK_HOST is honored # in 1975 ms
ok 127 Cleanup # in 1796 ms
# bats warning: Executed 126 instead of expected 127 tests

> Task :solr:packaging:integrationTests FAILED

[Incubating] Problems report is available at: file:///home/jenkins/jenkins-agent/workspace/Solr/Solr-TestIntegration-10.x/build/reports/problems/problems-report.html

FAILURE: Build failed with an exception.

* Where:
Build file '/home/jenkins/jenkins-agent/workspace/Solr/Solr-TestIntegration-10.x/solr/packaging/build.gradle' line: 409

* What went wrong:
Execution failed for task ':solr:packaging:integrationTests' (registered in build file 'solr/packaging/build.gradle').
> Process 'command '/home/jenkins/jenkins-agent/workspace/Solr/Solr-TestIntegration-10.x/solr/packaging/build/bats-libs/bats-core/bin/bats'' finished with non-zero exit value 1

* Try:
> Run with --stacktrace option to get the stack trace.
> Run with --info or --debug option to get more log output.
> Get more help at https://help.gradle.org.

Deprecated Gradle features were used in this build, making it incompatible with Gradle 10.

You can use '--warning-mode all' to show the individual deprecation warnings and determine if they come from your own scripts or plugins.

For more on this, please refer to https://docs.gradle.org/9.7.0/userguide/command_line_interface.html#sec:command_line_warnings in the Gradle documentation.

BUILD FAILED in 25m 22s
92 actionable tasks: 92 executed

Publishing Build Scan to Develocity...

The Develocity server (develocity.apache.org) rejected the credential with prefix '7x3jzizm4zpygv7psbkg6byvm4'.
Your credential has expired.

Build step 'Invoke Gradle script' changed build result to FAILURE
Build step 'Invoke Gradle script' marked build as failure
Archiving artifacts
Email was triggered for: Failure - Any
Sending email for trigger: Failure - Any