You are viewing a plain text version of this content. The canonical link for it is here.
Posted to builds@beam.apache.org by Apache Jenkins Server <je...@builds.apache.org> on 2023/03/27 18:12:09 UTC
Build failed in Jenkins: beam_PostCommit_Python310 #639
See <https://ci-beam.apache.org/job/beam_PostCommit_Python310/639/display/redirect?page=changes>
Changes:
[noreply] Bump webpack (#25846)
------------------------------------------
[...truncated 11.77 MB...]
apache_beam/io/gcp/bigquery_test.py: 3 warnings
apache_beam/io/gcp/big_query_query_to_table_it_test.py: 4 warnings
<https://ci-beam.apache.org/job/beam_PostCommit_Python310/ws/src/sdks/python/apache_beam/io/gcp/bigquery_file_loads.py>:1175: BeamDeprecationWarning: options is deprecated since First stable release. References to <pipeline>.options will not be supported
p.options.view_as(GoogleCloudOptions).job_name or 'AUTOMATIC_JOB_NAME')
apache_beam/examples/cookbook/bigquery_tornadoes_it_test.py::BigqueryTornadoesIT::test_bigquery_tornadoes_it
<https://ci-beam.apache.org/job/beam_PostCommit_Python310/ws/src/sdks/python/apache_beam/io/gcp/tests/utils.py>:100: PendingDeprecationWarning: Client.dataset is deprecated and will be removed in a future version. Use a string like 'my_project.my_dataset' or a cloud.google.bigquery.DatasetReference object, instead.
table_ref = client.dataset(dataset_id).table(table_id)
apache_beam/dataframe/io_it_test.py: 2 warnings
apache_beam/io/gcp/bigquery_json_it_test.py: 1 warning
apache_beam/io/gcp/bigquery_read_it_test.py: 9 warnings
<https://ci-beam.apache.org/job/beam_PostCommit_Python310/ws/src/sdks/python/apache_beam/io/gcp/bigquery.py>:2536: BeamDeprecationWarning: options is deprecated since First stable release. References to <pipeline>.options will not be supported
project_id = pcoll.pipeline.options.view_as(GoogleCloudOptions).project
apache_beam/dataframe/io_it_test.py: 2 warnings
apache_beam/io/gcp/bigquery_json_it_test.py: 1 warning
apache_beam/io/gcp/bigquery_read_it_test.py: 9 warnings
<https://ci-beam.apache.org/job/beam_PostCommit_Python310/ws/src/sdks/python/apache_beam/io/gcp/bigquery.py>:2557: BeamDeprecationWarning: options is deprecated since First stable release. References to <pipeline>.options will not be supported
pipeline_options=pcoll.pipeline.options,
apache_beam/examples/dataframe/taxiride_it_test.py::TaxirideIT::test_aggregation
apache_beam/examples/dataframe/flight_delays_it_test.py::FlightDelaysTest::test_flight_delays
apache_beam/examples/dataframe/taxiride_it_test.py::TaxirideIT::test_enrich
<https://ci-beam.apache.org/job/beam_PostCommit_Python310/ws/src/sdks/python/apache_beam/dataframe/io.py>:659: FutureWarning: WriteToFiles is experimental.
return pcoll | fileio.WriteToFiles(
apache_beam/examples/dataframe/taxiride_it_test.py::TaxirideIT::test_aggregation
apache_beam/examples/dataframe/flight_delays_it_test.py::FlightDelaysTest::test_flight_delays
apache_beam/examples/dataframe/taxiride_it_test.py::TaxirideIT::test_enrich
<https://ci-beam.apache.org/job/beam_PostCommit_Python310/ws/src/sdks/python/apache_beam/io/fileio.py>:596: BeamDeprecationWarning: options is deprecated since First stable release. References to <pipeline>.options will not be supported
p.options.view_as(GoogleCloudOptions).temp_location or
apache_beam/examples/dataframe/flight_delays_it_test.py::FlightDelaysTest::test_flight_delays
<https://ci-beam.apache.org/job/beam_PostCommit_Python310/ws/src/sdks/python/apache_beam/examples/dataframe/flight_delays.py>:47: FutureWarning: The default value of numeric_only in DataFrame.mean is deprecated. In a future version, it will default to False. In addition, specifying 'numeric_only=None' is deprecated. Select only valid columns or specify the value of numeric_only to silence this warning.
return airline_df[at_top_airports].mean()
apache_beam/io/gcp/bigquery_test.py::BigQueryStreamingInsertTransformIntegrationTests::test_multiple_destinations_transform
<https://ci-beam.apache.org/job/beam_PostCommit_Python310/ws/src/sdks/python/apache_beam/io/gcp/bigquery_test.py>:1694: BeamDeprecationWarning: options is deprecated since First stable release. References to <pipeline>.options will not be supported
streaming = self.test_pipeline.options.view_as(StandardOptions).streaming
apache_beam/io/gcp/bigquery_read_it_test.py::ReadTests::test_native_source
<https://ci-beam.apache.org/job/beam_PostCommit_Python310/ws/src/sdks/python/apache_beam/io/gcp/bigquery_read_it_test.py>:170: BeamDeprecationWarning: BigQuerySource is deprecated since 2.25.0. Use ReadFromBigQuery instead.
beam.io.BigQuerySource(query=self.query, use_standard_sql=True)))
apache_beam/ml/gcp/cloud_dlp_it_test.py::CloudDLPIT::test_deidentification
<https://ci-beam.apache.org/job/beam_PostCommit_Python310/ws/src/sdks/python/apache_beam/ml/gcp/cloud_dlp_it_test.py>:74: FutureWarning: MaskDetectedDetails is experimental.
| MaskDetectedDetails(
apache_beam/ml/gcp/cloud_dlp_it_test.py::CloudDLPIT::test_inspection
<https://ci-beam.apache.org/job/beam_PostCommit_Python310/ws/src/sdks/python/apache_beam/ml/gcp/cloud_dlp_it_test.py>:85: FutureWarning: InspectForDetails is experimental.
| InspectForDetails(
apache_beam/ml/inference/sklearn_inference_it_test.py::SklearnInference::test_sklearn_regression
<https://ci-beam.apache.org/job/beam_PostCommit_Python310/ws/src/sdks/python/apache_beam/examples/inference/sklearn_japanese_housing_regression.py>:128: FutureWarning: SklearnModelHandlerPandas is experimental. No backwards-compatibility guarantees.
model_loader = SklearnModelHandlerPandas(
apache_beam/ml/inference/sklearn_inference_it_test.py::SklearnInference::test_sklearn_regression
<https://ci-beam.apache.org/job/beam_PostCommit_Python310/ws/src/build/gradleenv/2050596098/lib/python3.10/site-packages/dill/_dill.py>:472: FutureWarning: SklearnModelHandlerPandas is experimental. No backwards-compatibility guarantees.
obj = StockUnpickler.load(self)
apache_beam/io/gcp/bigquery_read_it_test.py::ReadNewTypesTests::test_native_source
<https://ci-beam.apache.org/job/beam_PostCommit_Python310/ws/src/sdks/python/apache_beam/io/gcp/bigquery_read_it_test.py>:693: BeamDeprecationWarning: BigQuerySource is deprecated since 2.25.0. Use ReadFromBigQuery instead.
beam.io.BigQuerySource(query=self.query, use_standard_sql=True)))
apache_beam/io/gcp/bigquery_read_it_test.py::ReadAllBQTests::test_read_queries
<https://ci-beam.apache.org/job/beam_PostCommit_Python310/ws/src/sdks/python/apache_beam/io/gcp/bigquery_read_it_test.py>:808: FutureWarning: ReadAllFromBigQuery is experimental.
| beam.io.ReadAllFromBigQuery())
apache_beam/io/gcp/bigquery_read_it_test.py::ReadAllBQTests::test_read_queries
<https://ci-beam.apache.org/job/beam_PostCommit_Python310/ws/src/sdks/python/apache_beam/io/gcp/bigquery.py>:2665: BeamDeprecationWarning: options is deprecated since First stable release. References to <pipeline>.options will not be supported
job_name = pcoll.pipeline.options.view_as(GoogleCloudOptions).job_name
apache_beam/io/gcp/bigquery_read_it_test.py::ReadAllBQTests::test_read_queries
<https://ci-beam.apache.org/job/beam_PostCommit_Python310/ws/src/sdks/python/apache_beam/io/gcp/bigquery.py>:2666: BeamDeprecationWarning: options is deprecated since First stable release. References to <pipeline>.options will not be supported
project = pcoll.pipeline.options.view_as(GoogleCloudOptions).project
apache_beam/io/gcp/bigquery_read_it_test.py::ReadAllBQTests::test_read_queries
<https://ci-beam.apache.org/job/beam_PostCommit_Python310/ws/src/sdks/python/apache_beam/io/gcp/bigquery.py>:2679: BeamDeprecationWarning: options is deprecated since First stable release. References to <pipeline>.options will not be supported
options=pcoll.pipeline.options,
-- Docs: https://docs.pytest.org/en/stable/how-to/capture-warnings.html
- generated xml file: <https://ci-beam.apache.org/job/beam_PostCommit_Python310/ws/src/sdks/python/pytest_postCommitIT-df-py310.xml> -
[36m[1m=========================== short test summary info ============================[0m
[31mFAILED[0m apache_beam/ml/inference/sklearn_inference_it_test.py::[1mSklearnInference::test_sklearn_regression[0m - apache_beam.runners.dataflow.dataflow_runner.DataflowRuntimeException: Dataflow pipeline failed. State: FAILED, Error:
Traceback (most recent call last):
File "apache_beam/runners/common.py", line 1418, in apache_beam.runners.common.DoFnRunner.process
File "apache_beam/runners/common.py", line 838, in apache_beam.runners.common.PerWindowInvoker.invoke_process
File "apache_beam/runners/common.py", line 984, in apache_beam.runners.common.PerWindowInvoker._invoke_process_per_window
File "/usr/local/lib/python3.10/site-packages/apache_beam/ml/inference/base.py", line 552, in process
return self._run_inference(batch, inference_args)
File "/usr/local/lib/python3.10/site-packages/apache_beam/ml/inference/base.py", line 521, in _run_inference
raise e
File "/usr/local/lib/python3.10/site-packages/apache_beam/ml/inference/base.py", line 517, in _run_inference
result_generator = self._model_handler.run_inference(
File "/usr/local/lib/python3.10/site-packages/apache_beam/ml/inference/sklearn_inference.py", line 268, in run_inference
predictions, splits = self._model_inference_fn(model, batch, inference_args)
File "/usr/local/lib/python3.10/site-packages/apache_beam/ml/inference/sklearn_inference.py", line 185, in _default_pandas_inference_fn
predictions = model.predict(vectorized_batch)
File "/usr/local/lib/python3.10/site-packages/sklearn/pipeline.py", line 480, in predict
Xt = transform.transform(Xt)
File "/usr/local/lib/python3.10/site-packages/sklearn/utils/_set_output.py", line 140, in wrapped
data_to_wrap = f(self, X, *args, **kwargs)
File "/usr/local/lib/python3.10/site-packages/sklearn/compose/_column_transformer.py", line 800, in transform
Xs = self._fit_transform(
File "/usr/local/lib/python3.10/site-packages/sklearn/compose/_column_transformer.py", line 652, in _fit_transform
transformers = list(
File "/usr/local/lib/python3.10/site-packages/sklearn/compose/_column_transformer.py", line 349, in _iter
transformers = [
File "/usr/local/lib/python3.10/site-packages/sklearn/compose/_column_transformer.py", line 350, in <listcomp>
replace_passthrough(*trans) for trans in self.transformers_
File "/usr/local/lib/python3.10/site-packages/sklearn/compose/_column_transformer.py", line 345, in replace_passthrough
if name not in self._name_to_fitted_passthrough:
AttributeError: 'ColumnTransformer' object has no attribute '_name_to_fitted_passthrough'
During handling of the above exception, another exception occurred:
Traceback (most recent call last):
File "/usr/local/lib/python3.10/site-packages/apache_beam/runners/worker/sdk_worker.py", line 295, in _execute
response = task()
File "/usr/local/lib/python3.10/site-packages/apache_beam/runners/worker/sdk_worker.py", line 370, in <lambda>
lambda: self.create_worker().do_instruction(request), request)
File "/usr/local/lib/python3.10/site-packages/apache_beam/runners/worker/sdk_worker.py", line 629, in do_instruction
return getattr(self, request_type)(
File "/usr/local/lib/python3.10/site-packages/apache_beam/runners/worker/sdk_worker.py", line 667, in process_bundle
bundle_processor.process_bundle(instruction_id))
File "/usr/local/lib/python3.10/site-packages/apache_beam/runners/worker/bundle_processor.py", line 1062, in process_bundle
input_op_by_transform_id[element.transform_id].process_encoded(
File "/usr/local/lib/python3.10/site-packages/apache_beam/runners/worker/bundle_processor.py", line 232, in process_encoded
self.output(decoded_value)
File "apache_beam/runners/worker/operations.py", line 526, in apache_beam.runners.worker.operations.Operation.output
File "apache_beam/runners/worker/operations.py", line 528, in apache_beam.runners.worker.operations.Operation.output
File "apache_beam/runners/worker/operations.py", line 237, in apache_beam.runners.worker.operations.SingletonElementConsumerSet.receive
File "apache_beam/runners/worker/operations.py", line 240, in apache_beam.runners.worker.operations.SingletonElementConsumerSet.receive
File "apache_beam/runners/worker/operations.py", line 907, in apache_beam.runners.worker.operations.DoOperation.process
File "apache_beam/runners/worker/operations.py", line 908, in apache_beam.runners.worker.operations.DoOperation.process
File "apache_beam/runners/common.py", line 1420, in apache_beam.runners.common.DoFnRunner.process
File "apache_beam/runners/common.py", line 1492, in apache_beam.runners.common.DoFnRunner._reraise_augmented
File "apache_beam/runners/common.py", line 1418, in apache_beam.runners.common.DoFnRunner.process
File "apache_beam/runners/common.py", line 624, in apache_beam.runners.common.SimpleInvoker.invoke_process
File "apache_beam/runners/common.py", line 1582, in apache_beam.runners.common._OutputHandler.handle_process_outputs
File "apache_beam/runners/common.py", line 1695, in apache_beam.runners.common._OutputHandler._write_value_to_tag
File "apache_beam/runners/worker/operations.py", line 240, in apache_beam.runners.worker.operations.SingletonElementConsumerSet.receive
File "apache_beam/runners/worker/operations.py", line 907, in apache_beam.runners.worker.operations.DoOperation.process
File "apache_beam/runners/worker/operations.py", line 908, in apache_beam.runners.worker.operations.DoOperation.process
File "apache_beam/runners/common.py", line 1420, in apache_beam.runners.common.DoFnRunner.process
File "apache_beam/runners/common.py", line 1492, in apache_beam.runners.common.DoFnRunner._reraise_augmented
File "apache_beam/runners/common.py", line 1418, in apache_beam.runners.common.DoFnRunner.process
File "apache_beam/runners/common.py", line 624, in apache_beam.runners.common.SimpleInvoker.invoke_process
File "apache_beam/runners/common.py", line 1582, in apache_beam.runners.common._OutputHandler.handle_process_outputs
File "apache_beam/runners/common.py", line 1695, in apache_beam.runners.common._OutputHandler._write_value_to_tag
File "apache_beam/runners/worker/operations.py", line 240, in apache_beam.runners.worker.operations.SingletonElementConsumerSet.receive
File "apache_beam/runners/worker/operations.py", line 907, in apache_beam.runners.worker.operations.DoOperation.process
File "apache_beam/runners/worker/operations.py", line 908, in apache_beam.runners.worker.operations.DoOperation.process
File "apache_beam/runners/common.py", line 1420, in apache_beam.runners.common.DoFnRunner.process
File "apache_beam/runners/common.py", line 1492, in apache_beam.runners.common.DoFnRunner._reraise_augmented
File "apache_beam/runners/common.py", line 1418, in apache_beam.runners.common.DoFnRunner.process
File "apache_beam/runners/common.py", line 624, in apache_beam.runners.common.SimpleInvoker.invoke_process
File "apache_beam/runners/common.py", line 1582, in apache_beam.runners.common._OutputHandler.handle_process_outputs
File "apache_beam/runners/common.py", line 1695, in apache_beam.runners.common._OutputHandler._write_value_to_tag
File "apache_beam/runners/worker/operations.py", line 240, in apache_beam.runners.worker.operations.SingletonElementConsumerSet.receive
File "apache_beam/runners/worker/operations.py", line 907, in apache_beam.runners.worker.operations.DoOperation.process
File "apache_beam/runners/worker/operations.py", line 908, in apache_beam.runners.worker.operations.DoOperation.process
File "apache_beam/runners/common.py", line 1420, in apache_beam.runners.common.DoFnRunner.process
File "apache_beam/runners/common.py", line 1492, in apache_beam.runners.common.DoFnRunner._reraise_augmented
File "apache_beam/runners/common.py", line 1418, in apache_beam.runners.common.DoFnRunner.process
File "apache_beam/runners/common.py", line 838, in apache_beam.runners.common.PerWindowInvoker.invoke_process
File "apache_beam/runners/common.py", line 982, in apache_beam.runners.common.PerWindowInvoker._invoke_process_per_window
File "apache_beam/runners/common.py", line 1582, in apache_beam.runners.common._OutputHandler.handle_process_outputs
File "apache_beam/runners/common.py", line 1697, in apache_beam.runners.common._OutputHandler._write_value_to_tag
File "apache_beam/runners/worker/operations.py", line 237, in apache_beam.runners.worker.operations.SingletonElementConsumerSet.receive
File "apache_beam/runners/worker/operations.py", line 240, in apache_beam.runners.worker.operations.SingletonElementConsumerSet.receive
File "apache_beam/runners/worker/operations.py", line 907, in apache_beam.runners.worker.operations.DoOperation.process
File "apache_beam/runners/worker/operations.py", line 908, in apache_beam.runners.worker.operations.DoOperation.process
File "apache_beam/runners/common.py", line 1420, in apache_beam.runners.common.DoFnRunner.process
File "apache_beam/runners/common.py", line 1492, in apache_beam.runners.common.DoFnRunner._reraise_augmented
File "apache_beam/runners/common.py", line 1418, in apache_beam.runners.common.DoFnRunner.process
File "apache_beam/runners/common.py", line 624, in apache_beam.runners.common.SimpleInvoker.invoke_process
File "apache_beam/runners/common.py", line 1582, in apache_beam.runners.common._OutputHandler.handle_process_outputs
File "apache_beam/runners/common.py", line 1695, in apache_beam.runners.common._OutputHandler._write_value_to_tag
File "apache_beam/runners/worker/operations.py", line 240, in apache_beam.runners.worker.operations.SingletonElementConsumerSet.receive
File "apache_beam/runners/worker/operations.py", line 907, in apache_beam.runners.worker.operations.DoOperation.process
File "apache_beam/runners/worker/operations.py", line 908, in apache_beam.runners.worker.operations.DoOperation.process
File "apache_beam/runners/common.py", line 1420, in apache_beam.runners.common.DoFnRunner.process
File "apache_beam/runners/common.py", line 1508, in apache_beam.runners.common.DoFnRunner._reraise_augmented
File "apache_beam/runners/common.py", line 1418, in apache_beam.runners.common.DoFnRunner.process
File "apache_beam/runners/common.py", line 838, in apache_beam.runners.common.PerWindowInvoker.invoke_process
File "apache_beam/runners/common.py", line 984, in apache_beam.runners.common.PerWindowInvoker._invoke_process_per_window
File "/usr/local/lib/python3.10/site-packages/apache_beam/ml/inference/base.py", line 552, in process
return self._run_inference(batch, inference_args)
File "/usr/local/lib/python3.10/site-packages/apache_beam/ml/inference/base.py", line 521, in _run_inference
raise e
File "/usr/local/lib/python3.10/site-packages/apache_beam/ml/inference/base.py", line 517, in _run_inference
result_generator = self._model_handler.run_inference(
File "/usr/local/lib/python3.10/site-packages/apache_beam/ml/inference/sklearn_inference.py", line 268, in run_inference
predictions, splits = self._model_inference_fn(model, batch, inference_args)
File "/usr/local/lib/python3.10/site-packages/apache_beam/ml/inference/sklearn_inference.py", line 185, in _default_pandas_inference_fn
predictions = model.predict(vectorized_batch)
File "/usr/local/lib/python3.10/site-packages/sklearn/pipeline.py", line 480, in predict
Xt = transform.transform(Xt)
File "/usr/local/lib/python3.10/site-packages/sklearn/utils/_set_output.py", line 140, in wrapped
data_to_wrap = f(self, X, *args, **kwargs)
File "/usr/local/lib/python3.10/site-packages/sklearn/compose/_column_transformer.py", line 800, in transform
Xs = self._fit_transform(
File "/usr/local/lib/python3.10/site-packages/sklearn/compose/_column_transformer.py", line 652, in _fit_transform
transformers = list(
File "/usr/local/lib/python3.10/site-packages/sklearn/compose/_column_transformer.py", line 349, in _iter
transformers = [
File "/usr/local/lib/python3.10/site-packages/sklearn/compose/_column_transformer.py", line 350, in <listcomp>
replace_passthrough(*trans) for trans in self.transformers_
File "/usr/local/lib/python3.10/site-packages/sklearn/compose/_column_transformer.py", line 345, in replace_passthrough
if name not in self._name_to_fitted_passthrough:
AttributeError: 'ColumnTransformer' object has no attribute '_name_to_fitted_passthrough' [while running 'RunInference all_features/BeamML_RunInference-ptransform-150']
[31m===== [31m[1m1 failed[0m, [32m82 passed[0m, [33m39 skipped[0m, [33m616 warnings[0m[31m in 11009.60s (3:03:29)[0m[31m =====[0m
> Task :sdks:python:test-suites:dataflow:py310:postCommitIT FAILED
FAILURE: Build failed with an exception.
* Where:
Script '<https://ci-beam.apache.org/job/beam_PostCommit_Python310/ws/src/sdks/python/test-suites/dataflow/common.gradle'> line: 111
* What went wrong:
Execution failed for task ':sdks:python:test-suites:dataflow:py310:postCommitIT'.
> Process 'command 'sh'' finished with non-zero exit value 1
* Try:
> Run with --stacktrace option to get the stack trace.
> Run with --info or --debug option to get more log output.
* Get more help at https://help.gradle.org
Deprecated Gradle features were used in this build, making it incompatible with Gradle 8.0.
You can use '--warning-mode all' to show the individual deprecation warnings and determine if they come from your own scripts or plugins.
See https://docs.gradle.org/7.5.1/userguide/command_line_interface.html#sec:command_line_warnings
Execution optimizations have been disabled for 1 invalid unit(s) of work during this build to ensure correctness.
Please consult deprecation warnings for more details.
BUILD FAILED in 3h 6m 5s
207 actionable tasks: 142 executed, 59 from cache, 6 up-to-date
Publishing build scan...
https://gradle.com/s/2kpbiinlxxsya
Build step 'Invoke Gradle script' changed build result to FAILURE
Build step 'Invoke Gradle script' marked build as failure
---------------------------------------------------------------------
To unsubscribe, e-mail: builds-unsubscribe@beam.apache.org
For additional commands, e-mail: builds-help@beam.apache.org
Jenkins build is back to normal : beam_PostCommit_Python310 #641
Posted by Apache Jenkins Server <je...@builds.apache.org>.
See <https://ci-beam.apache.org/job/beam_PostCommit_Python310/641/display/redirect>
---------------------------------------------------------------------
To unsubscribe, e-mail: builds-unsubscribe@beam.apache.org
For additional commands, e-mail: builds-help@beam.apache.org
Build failed in Jenkins: beam_PostCommit_Python310 #640
Posted by Apache Jenkins Server <je...@builds.apache.org>.
See <https://ci-beam.apache.org/job/beam_PostCommit_Python310/640/display/redirect>
Changes:
------------------------------------------
[...truncated 11.77 MB...]
apache_beam/io/gcp/bigquery_write_it_test.py: 3 warnings
apache_beam/io/gcp/bigquery_test.py: 3 warnings
<https://ci-beam.apache.org/job/beam_PostCommit_Python310/ws/src/sdks/python/apache_beam/io/gcp/bigquery_file_loads.py>:1173: BeamDeprecationWarning: options is deprecated since First stable release. References to <pipeline>.options will not be supported
temp_location = p.options.view_as(GoogleCloudOptions).temp_location
apache_beam/examples/cookbook/bigquery_tornadoes_it_test.py: 1 warning
apache_beam/examples/complete/game/hourly_team_score_it_test.py: 1 warning
apache_beam/io/gcp/big_query_query_to_table_it_test.py: 4 warnings
apache_beam/io/gcp/bigquery_file_loads_test.py: 3 warnings
apache_beam/io/gcp/bigquery_write_it_test.py: 3 warnings
apache_beam/io/gcp/bigquery_test.py: 3 warnings
<https://ci-beam.apache.org/job/beam_PostCommit_Python310/ws/src/sdks/python/apache_beam/io/gcp/bigquery_file_loads.py>:1175: BeamDeprecationWarning: options is deprecated since First stable release. References to <pipeline>.options will not be supported
p.options.view_as(GoogleCloudOptions).job_name or 'AUTOMATIC_JOB_NAME')
apache_beam/examples/cookbook/bigquery_tornadoes_it_test.py::BigqueryTornadoesIT::test_bigquery_tornadoes_it
<https://ci-beam.apache.org/job/beam_PostCommit_Python310/ws/src/sdks/python/apache_beam/io/gcp/tests/utils.py>:100: PendingDeprecationWarning: Client.dataset is deprecated and will be removed in a future version. Use a string like 'my_project.my_dataset' or a cloud.google.bigquery.DatasetReference object, instead.
table_ref = client.dataset(dataset_id).table(table_id)
apache_beam/examples/dataframe/flight_delays_it_test.py::FlightDelaysTest::test_flight_delays
<https://ci-beam.apache.org/job/beam_PostCommit_Python310/ws/src/sdks/python/apache_beam/examples/dataframe/flight_delays.py>:47: FutureWarning: The default value of numeric_only in DataFrame.mean is deprecated. In a future version, it will default to False. In addition, specifying 'numeric_only=None' is deprecated. Select only valid columns or specify the value of numeric_only to silence this warning.
return airline_df[at_top_airports].mean()
apache_beam/examples/dataframe/flight_delays_it_test.py::FlightDelaysTest::test_flight_delays
apache_beam/examples/dataframe/taxiride_it_test.py::TaxirideIT::test_aggregation
apache_beam/examples/dataframe/taxiride_it_test.py::TaxirideIT::test_enrich
<https://ci-beam.apache.org/job/beam_PostCommit_Python310/ws/src/sdks/python/apache_beam/dataframe/io.py>:659: FutureWarning: WriteToFiles is experimental.
return pcoll | fileio.WriteToFiles(
apache_beam/examples/dataframe/flight_delays_it_test.py::FlightDelaysTest::test_flight_delays
apache_beam/examples/dataframe/taxiride_it_test.py::TaxirideIT::test_aggregation
apache_beam/examples/dataframe/taxiride_it_test.py::TaxirideIT::test_enrich
<https://ci-beam.apache.org/job/beam_PostCommit_Python310/ws/src/sdks/python/apache_beam/io/fileio.py>:596: BeamDeprecationWarning: options is deprecated since First stable release. References to <pipeline>.options will not be supported
p.options.view_as(GoogleCloudOptions).temp_location or
apache_beam/io/gcp/bigquery_test.py::BigQueryStreamingInsertTransformIntegrationTests::test_multiple_destinations_transform
<https://ci-beam.apache.org/job/beam_PostCommit_Python310/ws/src/sdks/python/apache_beam/io/gcp/bigquery_test.py>:1694: BeamDeprecationWarning: options is deprecated since First stable release. References to <pipeline>.options will not be supported
streaming = self.test_pipeline.options.view_as(StandardOptions).streaming
apache_beam/io/gcp/bigquery_read_it_test.py::ReadTests::test_native_source
<https://ci-beam.apache.org/job/beam_PostCommit_Python310/ws/src/sdks/python/apache_beam/io/gcp/bigquery_read_it_test.py>:170: BeamDeprecationWarning: BigQuerySource is deprecated since 2.25.0. Use ReadFromBigQuery instead.
beam.io.BigQuerySource(query=self.query, use_standard_sql=True)))
apache_beam/ml/gcp/cloud_dlp_it_test.py::CloudDLPIT::test_deidentification
<https://ci-beam.apache.org/job/beam_PostCommit_Python310/ws/src/sdks/python/apache_beam/ml/gcp/cloud_dlp_it_test.py>:74: FutureWarning: MaskDetectedDetails is experimental.
| MaskDetectedDetails(
apache_beam/ml/inference/sklearn_inference_it_test.py::SklearnInference::test_sklearn_regression
<https://ci-beam.apache.org/job/beam_PostCommit_Python310/ws/src/sdks/python/apache_beam/examples/inference/sklearn_japanese_housing_regression.py>:128: FutureWarning: SklearnModelHandlerPandas is experimental. No backwards-compatibility guarantees.
model_loader = SklearnModelHandlerPandas(
apache_beam/ml/inference/sklearn_inference_it_test.py::SklearnInference::test_sklearn_regression
<https://ci-beam.apache.org/job/beam_PostCommit_Python310/ws/src/build/gradleenv/2050596098/lib/python3.10/site-packages/dill/_dill.py>:472: FutureWarning: SklearnModelHandlerPandas is experimental. No backwards-compatibility guarantees.
obj = StockUnpickler.load(self)
apache_beam/ml/gcp/cloud_dlp_it_test.py::CloudDLPIT::test_inspection
<https://ci-beam.apache.org/job/beam_PostCommit_Python310/ws/src/sdks/python/apache_beam/ml/gcp/cloud_dlp_it_test.py>:85: FutureWarning: InspectForDetails is experimental.
| InspectForDetails(
apache_beam/io/gcp/bigquery_read_it_test.py::ReadNewTypesTests::test_native_source
<https://ci-beam.apache.org/job/beam_PostCommit_Python310/ws/src/sdks/python/apache_beam/io/gcp/bigquery_read_it_test.py>:693: BeamDeprecationWarning: BigQuerySource is deprecated since 2.25.0. Use ReadFromBigQuery instead.
beam.io.BigQuerySource(query=self.query, use_standard_sql=True)))
apache_beam/io/gcp/bigquery_read_it_test.py::ReadAllBQTests::test_read_queries
<https://ci-beam.apache.org/job/beam_PostCommit_Python310/ws/src/sdks/python/apache_beam/io/gcp/bigquery_read_it_test.py>:808: FutureWarning: ReadAllFromBigQuery is experimental.
| beam.io.ReadAllFromBigQuery())
apache_beam/io/gcp/bigquery_read_it_test.py::ReadAllBQTests::test_read_queries
<https://ci-beam.apache.org/job/beam_PostCommit_Python310/ws/src/sdks/python/apache_beam/io/gcp/bigquery.py>:2665: BeamDeprecationWarning: options is deprecated since First stable release. References to <pipeline>.options will not be supported
job_name = pcoll.pipeline.options.view_as(GoogleCloudOptions).job_name
apache_beam/io/gcp/bigquery_read_it_test.py::ReadAllBQTests::test_read_queries
<https://ci-beam.apache.org/job/beam_PostCommit_Python310/ws/src/sdks/python/apache_beam/io/gcp/bigquery.py>:2666: BeamDeprecationWarning: options is deprecated since First stable release. References to <pipeline>.options will not be supported
project = pcoll.pipeline.options.view_as(GoogleCloudOptions).project
apache_beam/io/gcp/bigquery_read_it_test.py::ReadAllBQTests::test_read_queries
<https://ci-beam.apache.org/job/beam_PostCommit_Python310/ws/src/sdks/python/apache_beam/io/gcp/bigquery.py>:2679: BeamDeprecationWarning: options is deprecated since First stable release. References to <pipeline>.options will not be supported
options=pcoll.pipeline.options,
-- Docs: https://docs.pytest.org/en/stable/how-to/capture-warnings.html
- generated xml file: <https://ci-beam.apache.org/job/beam_PostCommit_Python310/ws/src/sdks/python/pytest_postCommitIT-df-py310.xml> -
[36m[1m=========================== short test summary info ============================[0m
[31mFAILED[0m apache_beam/examples/complete/game/leader_board_it_test.py::[1mLeaderBoardIT::test_leader_board_it[0m - AssertionError:
Expected: (Test pipeline expected terminated in state: RUNNING and Expected checksum is de00231fe6730b972c0ff60a99988438911cda53 and Expected checksum is de00231fe6730b972c0ff60a99988438911cda53)
but: Expected checksum is de00231fe6730b972c0ff60a99988438911cda53 Actual checksum is da39a3ee5e6b4b0d3255bfef95601890afd80709
[31mFAILED[0m apache_beam/ml/inference/sklearn_inference_it_test.py::[1mSklearnInference::test_sklearn_regression[0m - apache_beam.runners.dataflow.dataflow_runner.DataflowRuntimeException: Dataflow pipeline failed. State: FAILED, Error:
Traceback (most recent call last):
File "apache_beam/runners/common.py", line 1418, in apache_beam.runners.common.DoFnRunner.process
File "apache_beam/runners/common.py", line 838, in apache_beam.runners.common.PerWindowInvoker.invoke_process
File "apache_beam/runners/common.py", line 984, in apache_beam.runners.common.PerWindowInvoker._invoke_process_per_window
File "/usr/local/lib/python3.10/site-packages/apache_beam/ml/inference/base.py", line 552, in process
return self._run_inference(batch, inference_args)
File "/usr/local/lib/python3.10/site-packages/apache_beam/ml/inference/base.py", line 521, in _run_inference
raise e
File "/usr/local/lib/python3.10/site-packages/apache_beam/ml/inference/base.py", line 517, in _run_inference
result_generator = self._model_handler.run_inference(
File "/usr/local/lib/python3.10/site-packages/apache_beam/ml/inference/sklearn_inference.py", line 268, in run_inference
predictions, splits = self._model_inference_fn(model, batch, inference_args)
File "/usr/local/lib/python3.10/site-packages/apache_beam/ml/inference/sklearn_inference.py", line 185, in _default_pandas_inference_fn
predictions = model.predict(vectorized_batch)
File "/usr/local/lib/python3.10/site-packages/sklearn/pipeline.py", line 480, in predict
Xt = transform.transform(Xt)
File "/usr/local/lib/python3.10/site-packages/sklearn/utils/_set_output.py", line 140, in wrapped
data_to_wrap = f(self, X, *args, **kwargs)
File "/usr/local/lib/python3.10/site-packages/sklearn/compose/_column_transformer.py", line 800, in transform
Xs = self._fit_transform(
File "/usr/local/lib/python3.10/site-packages/sklearn/compose/_column_transformer.py", line 652, in _fit_transform
transformers = list(
File "/usr/local/lib/python3.10/site-packages/sklearn/compose/_column_transformer.py", line 349, in _iter
transformers = [
File "/usr/local/lib/python3.10/site-packages/sklearn/compose/_column_transformer.py", line 350, in <listcomp>
replace_passthrough(*trans) for trans in self.transformers_
File "/usr/local/lib/python3.10/site-packages/sklearn/compose/_column_transformer.py", line 345, in replace_passthrough
if name not in self._name_to_fitted_passthrough:
AttributeError: 'ColumnTransformer' object has no attribute '_name_to_fitted_passthrough'
During handling of the above exception, another exception occurred:
Traceback (most recent call last):
File "/usr/local/lib/python3.10/site-packages/apache_beam/runners/worker/sdk_worker.py", line 295, in _execute
response = task()
File "/usr/local/lib/python3.10/site-packages/apache_beam/runners/worker/sdk_worker.py", line 370, in <lambda>
lambda: self.create_worker().do_instruction(request), request)
File "/usr/local/lib/python3.10/site-packages/apache_beam/runners/worker/sdk_worker.py", line 629, in do_instruction
return getattr(self, request_type)(
File "/usr/local/lib/python3.10/site-packages/apache_beam/runners/worker/sdk_worker.py", line 667, in process_bundle
bundle_processor.process_bundle(instruction_id))
File "/usr/local/lib/python3.10/site-packages/apache_beam/runners/worker/bundle_processor.py", line 1062, in process_bundle
input_op_by_transform_id[element.transform_id].process_encoded(
File "/usr/local/lib/python3.10/site-packages/apache_beam/runners/worker/bundle_processor.py", line 232, in process_encoded
self.output(decoded_value)
File "apache_beam/runners/worker/operations.py", line 526, in apache_beam.runners.worker.operations.Operation.output
File "apache_beam/runners/worker/operations.py", line 528, in apache_beam.runners.worker.operations.Operation.output
File "apache_beam/runners/worker/operations.py", line 237, in apache_beam.runners.worker.operations.SingletonElementConsumerSet.receive
File "apache_beam/runners/worker/operations.py", line 240, in apache_beam.runners.worker.operations.SingletonElementConsumerSet.receive
File "apache_beam/runners/worker/operations.py", line 907, in apache_beam.runners.worker.operations.DoOperation.process
File "apache_beam/runners/worker/operations.py", line 908, in apache_beam.runners.worker.operations.DoOperation.process
File "apache_beam/runners/common.py", line 1420, in apache_beam.runners.common.DoFnRunner.process
File "apache_beam/runners/common.py", line 1492, in apache_beam.runners.common.DoFnRunner._reraise_augmented
File "apache_beam/runners/common.py", line 1418, in apache_beam.runners.common.DoFnRunner.process
File "apache_beam/runners/common.py", line 624, in apache_beam.runners.common.SimpleInvoker.invoke_process
File "apache_beam/runners/common.py", line 1582, in apache_beam.runners.common._OutputHandler.handle_process_outputs
File "apache_beam/runners/common.py", line 1695, in apache_beam.runners.common._OutputHandler._write_value_to_tag
File "apache_beam/runners/worker/operations.py", line 240, in apache_beam.runners.worker.operations.SingletonElementConsumerSet.receive
File "apache_beam/runners/worker/operations.py", line 907, in apache_beam.runners.worker.operations.DoOperation.process
File "apache_beam/runners/worker/operations.py", line 908, in apache_beam.runners.worker.operations.DoOperation.process
File "apache_beam/runners/common.py", line 1420, in apache_beam.runners.common.DoFnRunner.process
File "apache_beam/runners/common.py", line 1492, in apache_beam.runners.common.DoFnRunner._reraise_augmented
File "apache_beam/runners/common.py", line 1418, in apache_beam.runners.common.DoFnRunner.process
File "apache_beam/runners/common.py", line 624, in apache_beam.runners.common.SimpleInvoker.invoke_process
File "apache_beam/runners/common.py", line 1582, in apache_beam.runners.common._OutputHandler.handle_process_outputs
File "apache_beam/runners/common.py", line 1695, in apache_beam.runners.common._OutputHandler._write_value_to_tag
File "apache_beam/runners/worker/operations.py", line 240, in apache_beam.runners.worker.operations.SingletonElementConsumerSet.receive
File "apache_beam/runners/worker/operations.py", line 907, in apache_beam.runners.worker.operations.DoOperation.process
File "apache_beam/runners/worker/operations.py", line 908, in apache_beam.runners.worker.operations.DoOperation.process
File "apache_beam/runners/common.py", line 1420, in apache_beam.runners.common.DoFnRunner.process
File "apache_beam/runners/common.py", line 1492, in apache_beam.runners.common.DoFnRunner._reraise_augmented
File "apache_beam/runners/common.py", line 1418, in apache_beam.runners.common.DoFnRunner.process
File "apache_beam/runners/common.py", line 624, in apache_beam.runners.common.SimpleInvoker.invoke_process
File "apache_beam/runners/common.py", line 1582, in apache_beam.runners.common._OutputHandler.handle_process_outputs
File "apache_beam/runners/common.py", line 1695, in apache_beam.runners.common._OutputHandler._write_value_to_tag
File "apache_beam/runners/worker/operations.py", line 240, in apache_beam.runners.worker.operations.SingletonElementConsumerSet.receive
File "apache_beam/runners/worker/operations.py", line 907, in apache_beam.runners.worker.operations.DoOperation.process
File "apache_beam/runners/worker/operations.py", line 908, in apache_beam.runners.worker.operations.DoOperation.process
File "apache_beam/runners/common.py", line 1420, in apache_beam.runners.common.DoFnRunner.process
File "apache_beam/runners/common.py", line 1492, in apache_beam.runners.common.DoFnRunner._reraise_augmented
File "apache_beam/runners/common.py", line 1418, in apache_beam.runners.common.DoFnRunner.process
File "apache_beam/runners/common.py", line 838, in apache_beam.runners.common.PerWindowInvoker.invoke_process
File "apache_beam/runners/common.py", line 982, in apache_beam.runners.common.PerWindowInvoker._invoke_process_per_window
File "apache_beam/runners/common.py", line 1582, in apache_beam.runners.common._OutputHandler.handle_process_outputs
File "apache_beam/runners/common.py", line 1697, in apache_beam.runners.common._OutputHandler._write_value_to_tag
File "apache_beam/runners/worker/operations.py", line 237, in apache_beam.runners.worker.operations.SingletonElementConsumerSet.receive
File "apache_beam/runners/worker/operations.py", line 240, in apache_beam.runners.worker.operations.SingletonElementConsumerSet.receive
File "apache_beam/runners/worker/operations.py", line 907, in apache_beam.runners.worker.operations.DoOperation.process
File "apache_beam/runners/worker/operations.py", line 908, in apache_beam.runners.worker.operations.DoOperation.process
File "apache_beam/runners/common.py", line 1420, in apache_beam.runners.common.DoFnRunner.process
File "apache_beam/runners/common.py", line 1492, in apache_beam.runners.common.DoFnRunner._reraise_augmented
File "apache_beam/runners/common.py", line 1418, in apache_beam.runners.common.DoFnRunner.process
File "apache_beam/runners/common.py", line 624, in apache_beam.runners.common.SimpleInvoker.invoke_process
File "apache_beam/runners/common.py", line 1582, in apache_beam.runners.common._OutputHandler.handle_process_outputs
File "apache_beam/runners/common.py", line 1695, in apache_beam.runners.common._OutputHandler._write_value_to_tag
File "apache_beam/runners/worker/operations.py", line 240, in apache_beam.runners.worker.operations.SingletonElementConsumerSet.receive
File "apache_beam/runners/worker/operations.py", line 907, in apache_beam.runners.worker.operations.DoOperation.process
File "apache_beam/runners/worker/operations.py", line 908, in apache_beam.runners.worker.operations.DoOperation.process
File "apache_beam/runners/common.py", line 1420, in apache_beam.runners.common.DoFnRunner.process
File "apache_beam/runners/common.py", line 1508, in apache_beam.runners.common.DoFnRunner._reraise_augmented
File "apache_beam/runners/common.py", line 1418, in apache_beam.runners.common.DoFnRunner.process
File "apache_beam/runners/common.py", line 838, in apache_beam.runners.common.PerWindowInvoker.invoke_process
File "apache_beam/runners/common.py", line 984, in apache_beam.runners.common.PerWindowInvoker._invoke_process_per_window
File "/usr/local/lib/python3.10/site-packages/apache_beam/ml/inference/base.py", line 552, in process
return self._run_inference(batch, inference_args)
File "/usr/local/lib/python3.10/site-packages/apache_beam/ml/inference/base.py", line 521, in _run_inference
raise e
File "/usr/local/lib/python3.10/site-packages/apache_beam/ml/inference/base.py", line 517, in _run_inference
result_generator = self._model_handler.run_inference(
File "/usr/local/lib/python3.10/site-packages/apache_beam/ml/inference/sklearn_inference.py", line 268, in run_inference
predictions, splits = self._model_inference_fn(model, batch, inference_args)
File "/usr/local/lib/python3.10/site-packages/apache_beam/ml/inference/sklearn_inference.py", line 185, in _default_pandas_inference_fn
predictions = model.predict(vectorized_batch)
File "/usr/local/lib/python3.10/site-packages/sklearn/pipeline.py", line 480, in predict
Xt = transform.transform(Xt)
File "/usr/local/lib/python3.10/site-packages/sklearn/utils/_set_output.py", line 140, in wrapped
data_to_wrap = f(self, X, *args, **kwargs)
File "/usr/local/lib/python3.10/site-packages/sklearn/compose/_column_transformer.py", line 800, in transform
Xs = self._fit_transform(
File "/usr/local/lib/python3.10/site-packages/sklearn/compose/_column_transformer.py", line 652, in _fit_transform
transformers = list(
File "/usr/local/lib/python3.10/site-packages/sklearn/compose/_column_transformer.py", line 349, in _iter
transformers = [
File "/usr/local/lib/python3.10/site-packages/sklearn/compose/_column_transformer.py", line 350, in <listcomp>
replace_passthrough(*trans) for trans in self.transformers_
File "/usr/local/lib/python3.10/site-packages/sklearn/compose/_column_transformer.py", line 345, in replace_passthrough
if name not in self._name_to_fitted_passthrough:
AttributeError: 'ColumnTransformer' object has no attribute '_name_to_fitted_passthrough' [while running 'RunInference all_features/BeamML_RunInference-ptransform-155']
[31m===== [31m[1m2 failed[0m, [32m81 passed[0m, [33m39 skipped[0m, [33m616 warnings[0m[31m in 11737.35s (3:15:37)[0m[31m =====[0m
> Task :sdks:python:test-suites:dataflow:py310:postCommitIT FAILED
FAILURE: Build failed with an exception.
* Where:
Script '<https://ci-beam.apache.org/job/beam_PostCommit_Python310/ws/src/sdks/python/test-suites/dataflow/common.gradle'> line: 111
* What went wrong:
Execution failed for task ':sdks:python:test-suites:dataflow:py310:postCommitIT'.
> Process 'command 'sh'' finished with non-zero exit value 1
* Try:
> Run with --stacktrace option to get the stack trace.
> Run with --info or --debug option to get more log output.
* Get more help at https://help.gradle.org
Deprecated Gradle features were used in this build, making it incompatible with Gradle 8.0.
You can use '--warning-mode all' to show the individual deprecation warnings and determine if they come from your own scripts or plugins.
See https://docs.gradle.org/7.5.1/userguide/command_line_interface.html#sec:command_line_warnings
Execution optimizations have been disabled for 1 invalid unit(s) of work during this build to ensure correctness.
Please consult deprecation warnings for more details.
BUILD FAILED in 3h 17m 34s
207 actionable tasks: 142 executed, 59 from cache, 6 up-to-date
Publishing build scan...
https://gradle.com/s/7lhzm3c46ucac
Build step 'Invoke Gradle script' changed build result to FAILURE
Build step 'Invoke Gradle script' marked build as failure
---------------------------------------------------------------------
To unsubscribe, e-mail: builds-unsubscribe@beam.apache.org
For additional commands, e-mail: builds-help@beam.apache.org