You are viewing a plain text version of this content. The canonical link for it is here.
Posted to notifications@maven.apache.org by "GRiD .ORG" <bu...@lists.sonatype.com> on 2010/11/09 09:32:26 UTC

Build failed in Hudson: maven-plugins-ITs » java-5x,ubuntu #545

See <https://grid.sonatype.org/ci/job/maven-plugins-ITs/./jdk=java-5x,label=ubuntu/545/changes>

Changes:

[Dennis Lundberg] [MASSEMBLY-519] Documentation problem: description of how to share assemble descriptors is wrong

[Dennis Lundberg] o Fix link to latest assembly descriptor schema

[Dennis Lundberg] o Remove commented out references to 2.2-beta-6

[Dennis Lundberg] o Replace all references to 2.2-beta-6 with 2.2

------------------------------------------
[...truncated 5374 lines...]
[INFO] Webapp assembled in [1 msecs]
Tests run: 2, Failures: 0, Errors: 0, Skipped: 0, Time elapsed: 0.084 sec
Running org.apache.maven.plugin.war.WarManifestMojoTest
Tests run: 6, Failures: 0, Errors: 0, Skipped: 0, Time elapsed: 0.272 sec
Running org.apache.maven.plugin.war.util.PathSetTest
Tests run: 5, Failures: 0, Errors: 0, Skipped: 0, Time elapsed: 0.006 sec
Running org.apache.maven.plugin.war.util.WarUtilsTest
Tests run: 1, Failures: 0, Errors: 0, Skipped: 0, Time elapsed: 0.002 sec
Running org.apache.maven.plugin.war.overlay.OverlayManagerTest
Tests run: 5, Failures: 0, Errors: 0, Skipped: 0, Time elapsed: 0.156 sec
Running org.apache.maven.plugin.war.WarDependenciesAnalysisTest
[INFO] Exploding webapp
[INFO] Assembling webapp [maven-war-plugin-test] in [/opt/grid/slave/workspace/maven-plugins-ITs/jdk/java-5x/label/ubuntu/trunk/maven-war-plugin/target/test-classes/unit/dependenciesanalysis/test-dir/no-change]
[INFO] Processing war project
[INFO] Copying webapp resources [/opt/grid/slave/workspace/maven-plugins-ITs/jdk/java-5x/label/ubuntu/trunk/maven-war-plugin/target/test-classes/unit/dependenciesanalysis/test-dir/no-change-test-data/source]
[INFO] Webapp assembled in [7 msecs]
[INFO] Exploding webapp
[INFO] Assembling webapp [maven-war-plugin-test] in [/opt/grid/slave/workspace/maven-plugins-ITs/jdk/java-5x/label/ubuntu/trunk/maven-war-plugin/target/test-classes/unit/dependenciesanalysis/test-dir/no-change]
[INFO] Processing war project
[INFO] Copying webapp resources [/opt/grid/slave/workspace/maven-plugins-ITs/jdk/java-5x/label/ubuntu/trunk/maven-war-plugin/target/test-classes/unit/dependenciesanalysis/test-dir/no-change-test-data/source]
[INFO] Webapp assembled in [3 msecs]
[INFO] Exploding webapp
[INFO] Assembling webapp [maven-war-plugin-test] in [/opt/grid/slave/workspace/maven-plugins-ITs/jdk/java-5x/label/ubuntu/trunk/maven-war-plugin/target/test-classes/unit/dependenciesanalysis/test-dir/remove-dependency]
[INFO] Processing war project
[INFO] Copying webapp resources [/opt/grid/slave/workspace/maven-plugins-ITs/jdk/java-5x/label/ubuntu/trunk/maven-war-plugin/target/test-classes/unit/dependenciesanalysis/test-dir/remove-dependency-test-data/source]
[INFO] Webapp assembled in [4 msecs]
[INFO] Exploding webapp
[INFO] Assembling webapp [maven-war-plugin-test] in [/opt/grid/slave/workspace/maven-plugins-ITs/jdk/java-5x/label/ubuntu/trunk/maven-war-plugin/target/test-classes/unit/dependenciesanalysis/test-dir/remove-dependency]
[INFO] Dependency [Dependency {groupId=org.sample.jar, artifactId=lib-test, version=1.0, type=jar}] has been removed from the project.
[INFO] Processing war project
[INFO] Copying webapp resources [/opt/grid/slave/workspace/maven-plugins-ITs/jdk/java-5x/label/ubuntu/trunk/maven-war-plugin/target/test-classes/unit/dependenciesanalysis/test-dir/remove-dependency-test-data/source]
[INFO] Webapp assembled in [2 msecs]
[INFO] Exploding webapp
[INFO] Assembling webapp [maven-war-plugin-test] in [/opt/grid/slave/workspace/maven-plugins-ITs/jdk/java-5x/label/ubuntu/trunk/maven-war-plugin/target/test-classes/unit/dependenciesanalysis/test-dir/dependency-update-version]
[INFO] Processing war project
[INFO] Copying webapp resources [/opt/grid/slave/workspace/maven-plugins-ITs/jdk/java-5x/label/ubuntu/trunk/maven-war-plugin/target/test-classes/unit/dependenciesanalysis/test-dir/dependency-update-version-test-data/source]
[INFO] Webapp assembled in [4 msecs]
[INFO] Exploding webapp
[INFO] Assembling webapp [maven-war-plugin-test] in [/opt/grid/slave/workspace/maven-plugins-ITs/jdk/java-5x/label/ubuntu/trunk/maven-war-plugin/target/test-classes/unit/dependenciesanalysis/test-dir/dependency-update-version]
[INFO] Version of dependency [Dependency {groupId=org.sample.jar, artifactId=lib-test, version=2.0, type=jar}] has changed (1.0 -> 2.0).
[INFO] Processing war project
[INFO] Copying webapp resources [/opt/grid/slave/workspace/maven-plugins-ITs/jdk/java-5x/label/ubuntu/trunk/maven-war-plugin/target/test-classes/unit/dependenciesanalysis/test-dir/dependency-update-version-test-data/source]
[INFO] Webapp assembled in [3 msecs]
[INFO] Exploding webapp
[INFO] Assembling webapp [maven-war-plugin-test] in [/opt/grid/slave/workspace/maven-plugins-ITs/jdk/java-5x/label/ubuntu/trunk/maven-war-plugin/target/test-classes/unit/dependenciesanalysis/test-dir/dependency-now-provided]
[INFO] Processing war project
[INFO] Copying webapp resources [/opt/grid/slave/workspace/maven-plugins-ITs/jdk/java-5x/label/ubuntu/trunk/maven-war-plugin/target/test-classes/unit/dependenciesanalysis/test-dir/dependency-now-provided-test-data/source]
[INFO] Webapp assembled in [5 msecs]
[INFO] Exploding webapp
[INFO] Assembling webapp [maven-war-plugin-test] in [/opt/grid/slave/workspace/maven-plugins-ITs/jdk/java-5x/label/ubuntu/trunk/maven-war-plugin/target/test-classes/unit/dependenciesanalysis/test-dir/dependency-now-provided]
[INFO] Scope of dependency [Dependency {groupId=org.sample.jar, artifactId=lib-test, version=1.0, type=jar}] has changed (runtime -> provided).
[INFO] Processing war project
[INFO] Copying webapp resources [/opt/grid/slave/workspace/maven-plugins-ITs/jdk/java-5x/label/ubuntu/trunk/maven-war-plugin/target/test-classes/unit/dependenciesanalysis/test-dir/dependency-now-provided-test-data/source]
[INFO] Webapp assembled in [2 msecs]
Tests run: 4, Failures: 0, Errors: 0, Skipped: 0, Time elapsed: 0.217 sec

Results :

Tests run: 83, Failures: 0, Errors: 0, Skipped: 0

[INFO] [jar:jar {execution: default-jar}]
[INFO] Building jar: /opt/grid/slave/workspace/maven-plugins-ITs/jdk/java-5x/label/ubuntu/trunk/maven-war-plugin/target/maven-war-plugin-2.2-SNAPSHOT.jar
[INFO] [plugin:addPluginArtifactMetadata {execution: default-addPluginArtifactMetadata}]
[INFO] [invoker:install {execution: integration-test}]
[INFO] Installing /opt/grid/slave/workspace/maven-plugins-ITs/jdk/java-5x/label/ubuntu/trunk/maven-war-plugin/pom.xml to /opt/grid/slave/workspace/maven-plugins-ITs/jdk/java-5x/label/ubuntu/trunk/maven-war-plugin/target/local-repo/org/apache/maven/plugins/maven-war-plugin/2.2-SNAPSHOT/maven-war-plugin-2.2-SNAPSHOT.pom
[INFO] Installing /opt/grid/slave/workspace/maven-plugins-ITs/jdk/java-5x/label/ubuntu/trunk/maven-war-plugin/target/maven-war-plugin-2.2-SNAPSHOT.jar to /opt/grid/slave/workspace/maven-plugins-ITs/jdk/java-5x/label/ubuntu/trunk/maven-war-plugin/target/local-repo/org/apache/maven/plugins/maven-war-plugin/2.2-SNAPSHOT/maven-war-plugin-2.2-SNAPSHOT.jar
[INFO] [invoker:run {execution: integration-test}]
[INFO] Building: MWAR-143/pom.xml
[INFO] ..SUCCESS (24.7 s)
[INFO] Building: scoped-dependency-same-artifact/pom.xml
[INFO] ..SUCCESS (6.1 s)
[INFO] Building: MWAR-96/pom.xml
[INFO] ..SUCCESS (4.4 s)
[INFO] Building: MWAR-62/pom.xml
[INFO] ..SUCCESS (2.8 s)
[INFO] Building: MWAR-129/pom.xml
[INFO] ..SUCCESS (2.9 s)
[INFO] Building: simple-war-no-webxml/pom.xml
[INFO] ..SUCCESS (4.8 s)
[INFO] Building: simple-war-project/pom.xml
[INFO] ..SUCCESS (4.2 s)
[INFO] Building: MWAR-139/pom.xml
[INFO] ..SUCCESS (3.9 s)
[INFO] Building: web-resources-filtering/pom.xml
[INFO] ..SUCCESS (4.5 s)
[INFO] Building: MWAR-131/pom.xml
[INFO] ..SUCCESS (21.6 s)
[INFO] Building: default/pom.xml
[INFO] ..SUCCESS (5.8 s)
[INFO] Building: MWAR-133/pom.xml
[INFO] ..SUCCESS (3.1 s)
[INFO] ---------------------------------------
[INFO] Execution Summary:
[INFO]   Builds Passing: 12
[INFO]   Builds Failing: 0
[INFO]   Builds Skipped: 0
[INFO] ---------------------------------------
[INFO] [install:install {execution: default-install}]
[INFO] Installing /opt/grid/slave/workspace/maven-plugins-ITs/jdk/java-5x/label/ubuntu/trunk/maven-war-plugin/target/maven-war-plugin-2.2-SNAPSHOT.jar to <https://grid.sonatype.org/ci/job/maven-plugins-ITs/./jdk=java-5x,label=ubuntu/ws/.repository/org/apache/maven/plugins/maven-war-plugin/2.2-SNAPSHOT/maven-war-plugin-2.2-SNAPSHOT.jar>
[INFO] [deploy:deploy {execution: default-deploy}]
[INFO] Retrieving previous build number from apache.snapshots.https
Uploading: http://repository.sonatype.org:8081/content/repositories/maven.snapshots/org/apache/maven/plugins/maven-war-plugin/2.2-SNAPSHOT/maven-war-plugin-2.2-20101109.070538-54.jar
75K uploaded  (maven-war-plugin-2.2-20101109.070538-54.jar)
[INFO] Retrieving previous metadata from apache.snapshots.https
[INFO] Uploading repository metadata for: 'artifact org.apache.maven.plugins:maven-war-plugin'
[INFO] Retrieving previous metadata from apache.snapshots.https
[INFO] Uploading repository metadata for: 'org.apache.maven.plugins'
[INFO] Uploading project information for maven-war-plugin 2.2-20101109.070538-54
[INFO] Retrieving previous metadata from apache.snapshots.https
[INFO] Uploading repository metadata for: 'snapshot org.apache.maven.plugins:maven-war-plugin:2.2-SNAPSHOT'
[INFO] ------------------------------------------------------------------------
[INFO] Building Maven Plugins Aggregator
[INFO]    task-segment: [clean, deploy]
[INFO] ------------------------------------------------------------------------
[INFO] [clean:clean {execution: default-clean}]
[INFO] Deleting file set: /opt/grid/slave/workspace/maven-plugins-ITs/jdk/java-5x/label/ubuntu/trunk/target (included: [**], excluded: [])
[INFO] [remote-resources:process {execution: default}]
[INFO] [site:attach-descriptor {execution: default-attach-descriptor}]
[INFO] [install:install {execution: default-install}]
[INFO] Installing /opt/grid/slave/workspace/maven-plugins-ITs/jdk/java-5x/label/ubuntu/trunk/pom.xml to <https://grid.sonatype.org/ci/job/maven-plugins-ITs/./jdk=java-5x,label=ubuntu/ws/.repository/org/apache/maven/plugins/maven-plugins-aggregator/1-SNAPSHOT/maven-plugins-aggregator-1-SNAPSHOT.pom>
[INFO] [deploy:deploy {execution: default-deploy}]
[INFO] Retrieving previous build number from apache.snapshots.https
Uploading: http://repository.sonatype.org:8081/content/repositories/maven.snapshots/org/apache/maven/plugins/maven-plugins-aggregator/1-SNAPSHOT/maven-plugins-aggregator-1-20101109.070538-101.pom
3K uploaded  (maven-plugins-aggregator-1-20101109.070538-101.pom)
[INFO] Retrieving previous metadata from apache.snapshots.https
[INFO] Uploading repository metadata for: 'artifact org.apache.maven.plugins:maven-plugins-aggregator'
[INFO] Retrieving previous metadata from apache.snapshots.https
[INFO] Uploading repository metadata for: 'snapshot org.apache.maven.plugins:maven-plugins-aggregator:1-SNAPSHOT'
[INFO] 
[INFO] 
[INFO] ------------------------------------------------------------------------
[INFO] Reactor Summary:
[INFO] ------------------------------------------------------------------------
[INFO] Maven Plugins ......................................... SUCCESS [25.433s]
[INFO] Maven Invoker Plugin .................................. SUCCESS [5:05.330s]
[INFO] Maven Ant Plugin ...................................... SUCCESS [2:22.107s]
[INFO] Maven AntRun Plugin ................................... SUCCESS [1:22.139s]
[INFO] Maven Eclipse Plugin .................................. SUCCESS [9:26.402s]
[INFO] Maven Changelog Plugin ................................ SUCCESS [37.484s]
[INFO] Maven Changes Report Plugin ........................... SUCCESS [1:13.938s]
[INFO] Maven Checkstyle Plugin ............................... SUCCESS [2:05.298s]
[INFO] Maven Clean Plugin .................................... SUCCESS [24.776s]
[INFO] Maven Compiler Plugin ................................. SUCCESS [32.534s]
[INFO] Maven Dependency Plugin ............................... SUCCESS [4:12.690s]
[INFO] Maven Deploy Plugin ................................... SUCCESS [1:42.357s]
[INFO] Maven DOAP Plugin ..................................... SUCCESS [17.455s]
[INFO] Maven Documentation Checker Plugin .................... SUCCESS [23.724s]
[INFO] Maven EAR Plugin ...................................... FAILED [57.162s]
[INFO] Maven EJB Plugin ...................................... SUCCESS [53.702s]
[INFO] Maven GPG Plugin ...................................... SUCCESS [40.318s]
[INFO] Maven Help Plugin ..................................... SUCCESS [46.226s]
[INFO] Maven IDEA Plugin ..................................... SUCCESS [19.640s]
[INFO] Maven Install Plugin .................................. SUCCESS [1:36.010s]
[INFO] Maven JAR Plugin ...................................... SUCCESS [1:59.934s]
[INFO] Maven Jarsigner Plugin ................................ SUCCESS [1:00.578s]
[INFO] Maven Shade Plugin .................................... SUCCESS [2:48.197s]
[INFO] Maven Javadoc Plugin .................................. FAILED [6:01.321s]
[INFO] Maven Linkcheck Plugin ................................ SUCCESS [24.682s]
[INFO] Maven One Plugin ...................................... SUCCESS [6.128s]
[INFO] Maven Patch Plugin .................................... SUCCESS [26.995s]
[INFO] Maven PDF Plugin ...................................... SUCCESS [1:25.640s]
[INFO] Maven PMD Plugin ...................................... SUCCESS [46.103s]
[INFO] Maven RAR Plugin ...................................... SUCCESS [15.821s]
[INFO] Maven Reactor Plugin .................................. SUCCESS [4.914s]
[INFO] Maven Repository Plugin ............................... SUCCESS [1:26.105s]
[INFO] Maven Resources Plugin ................................ SUCCESS [1:06.251s]
[INFO] Maven Site Plugin ..................................... SUCCESS [30:08.008s]
[INFO] Maven Source Plugin ................................... SUCCESS [46.261s]
[INFO] Maven Stage Plugin .................................... SUCCESS [9.702s]
[INFO] Maven Toolchains Plugin ............................... SUCCESS [6.660s]
[INFO] Maven Verifier Plugin ................................. SUCCESS [17.758s]
[INFO] Maven WAR Plugin ...................................... SUCCESS [2:02.979s]
[INFO] Maven Plugins Aggregator .............................. SUCCESS [4.799s]
[INFO] ------------------------------------------------------------------------
[INFO] Error for project: Maven EAR Plugin (during deploy)
[INFO] ------------------------------------------------------------------------
[INFO] : org.apache.maven.plugin.invoker.InvokerSession@52f6c35f
1 build failed.
[INFO] ------------------------------------------------------------------------
[INFO] Trace
org.apache.maven.BuildFailureException: 1 build failed.
	at org.apache.maven.lifecycle.DefaultLifecycleExecutor.executeGoals(DefaultLifecycleExecutor.java:715)
	at org.apache.maven.lifecycle.DefaultLifecycleExecutor.executeGoalWithLifecycle(DefaultLifecycleExecutor.java:556)
	at org.apache.maven.lifecycle.DefaultLifecycleExecutor.executeGoal(DefaultLifecycleExecutor.java:535)
	at org.apache.maven.lifecycle.DefaultLifecycleExecutor.executeGoalAndHandleFailures(DefaultLifecycleExecutor.java:387)
	at org.apache.maven.lifecycle.DefaultLifecycleExecutor.executeTaskSegments(DefaultLifecycleExecutor.java:348)
	at org.apache.maven.lifecycle.DefaultLifecycleExecutor.execute(DefaultLifecycleExecutor.java:180)
	at org.apache.maven.DefaultMaven.doExecute(DefaultMaven.java:328)
	at org.apache.maven.DefaultMaven.execute(DefaultMaven.java:138)
	at org.apache.maven.cli.MavenCli.main(MavenCli.java:362)
	at org.apache.maven.cli.compat.CompatibleMain.main(CompatibleMain.java:60)
	at sun.reflect.NativeMethodAccessorImpl.invoke0(Native Method)
	at sun.reflect.NativeMethodAccessorImpl.invoke(NativeMethodAccessorImpl.java:39)
	at sun.reflect.DelegatingMethodAccessorImpl.invoke(DelegatingMethodAccessorImpl.java:25)
	at java.lang.reflect.Method.invoke(Method.java:592)
	at org.codehaus.classworlds.Launcher.launchEnhanced(Launcher.java:315)
	at org.codehaus.classworlds.Launcher.launch(Launcher.java:255)
	at org.codehaus.classworlds.Launcher.mainWithExitCode(Launcher.java:430)
	at org.codehaus.classworlds.Launcher.main(Launcher.java:375)
Caused by: org.apache.maven.plugin.MojoFailureException: 1 build failed.
	at org.apache.maven.plugin.invoker.InvokerSession.handleFailures(InvokerSession.java:244)
	at org.apache.maven.plugin.invoker.InvokerMojo.processResults(InvokerMojo.java:58)
	at org.apache.maven.plugin.invoker.AbstractInvokerMojo.execute(AbstractInvokerMojo.java:601)
	at org.apache.maven.plugin.DefaultPluginManager.executeMojo(DefaultPluginManager.java:490)
	at org.apache.maven.lifecycle.DefaultLifecycleExecutor.executeGoals(DefaultLifecycleExecutor.java:694)
	... 17 more
[INFO] ------------------------------------------------------------------------
[INFO] Error for project: Maven Javadoc Plugin (during deploy)
[INFO] ------------------------------------------------------------------------
[INFO] There are test failures.

Please refer to /opt/grid/slave/workspace/maven-plugins-ITs/jdk/java-5x/label/ubuntu/trunk/maven-javadoc-plugin/target/surefire-reports for the individual test results.
[INFO] ------------------------------------------------------------------------
[INFO] Trace
org.apache.maven.BuildFailureException: There are test failures.

Please refer to /opt/grid/slave/workspace/maven-plugins-ITs/jdk/java-5x/label/ubuntu/trunk/maven-javadoc-plugin/target/surefire-reports for the individual test results.
	at org.apache.maven.lifecycle.DefaultLifecycleExecutor.executeGoals(DefaultLifecycleExecutor.java:715)
	at org.apache.maven.lifecycle.DefaultLifecycleExecutor.executeGoalWithLifecycle(DefaultLifecycleExecutor.java:556)
	at org.apache.maven.lifecycle.DefaultLifecycleExecutor.executeGoal(DefaultLifecycleExecutor.java:535)
	at org.apache.maven.lifecycle.DefaultLifecycleExecutor.executeGoalAndHandleFailures(DefaultLifecycleExecutor.java:387)
	at org.apache.maven.lifecycle.DefaultLifecycleExecutor.executeTaskSegments(DefaultLifecycleExecutor.java:348)
	at org.apache.maven.lifecycle.DefaultLifecycleExecutor.execute(DefaultLifecycleExecutor.java:180)
	at org.apache.maven.DefaultMaven.doExecute(DefaultMaven.java:328)
	at org.apache.maven.DefaultMaven.execute(DefaultMaven.java:138)
	at org.apache.maven.cli.MavenCli.main(MavenCli.java:362)
	at org.apache.maven.cli.compat.CompatibleMain.main(CompatibleMain.java:60)
	at sun.reflect.NativeMethodAccessorImpl.invoke0(Native Method)
	at sun.reflect.NativeMethodAccessorImpl.invoke(NativeMethodAccessorImpl.java:39)
	at sun.reflect.DelegatingMethodAccessorImpl.invoke(DelegatingMethodAccessorImpl.java:25)
	at java.lang.reflect.Method.invoke(Method.java:592)
	at org.codehaus.classworlds.Launcher.launchEnhanced(Launcher.java:315)
	at org.codehaus.classworlds.Launcher.launch(Launcher.java:255)
	at org.codehaus.classworlds.Launcher.mainWithExitCode(Launcher.java:430)
	at org.codehaus.classworlds.Launcher.main(Launcher.java:375)
Caused by: org.apache.maven.plugin.MojoFailureException: There are test failures.

Please refer to /opt/grid/slave/workspace/maven-plugins-ITs/jdk/java-5x/label/ubuntu/trunk/maven-javadoc-plugin/target/surefire-reports for the individual test results.
	at org.apache.maven.plugin.surefire.SurefirePlugin.execute(SurefirePlugin.java:575)
	at org.apache.maven.plugin.DefaultPluginManager.executeMojo(DefaultPluginManager.java:490)
	at org.apache.maven.lifecycle.DefaultLifecycleExecutor.executeGoals(DefaultLifecycleExecutor.java:694)
	... 17 more
[INFO] ------------------------------------------------------------------------
[INFO] BUILD ERRORS
[INFO] ------------------------------------------------------------------------
[INFO] Total time: 86 minutes 57 seconds
[INFO] Finished at: Tue Nov 09 02:32:25 CST 2010
[INFO] Final Memory: 107M/189M
[INFO] ------------------------------------------------------------------------


Hudson build is back to normal : maven-plugins-ITs » java-5x,ubuntu #552

Posted by "GRiD .ORG" <bu...@lists.sonatype.com>.
See <https://grid.sonatype.org/ci/job/maven-plugins-ITs/./jdk=java-5x,label=ubuntu/552/changes>



Build failed in Hudson: maven-plugins-ITs » java-5x,ubuntu #551

Posted by "GRiD .ORG" <bu...@lists.sonatype.com>.
See <https://grid.sonatype.org/ci/job/maven-plugins-ITs/./jdk=java-5x,label=ubuntu/551/changes>

Changes:

[Vincent Siveton] MPIR-128: Add a link to a repository location in Project Summary

o added a download section

[Vincent Siveton] MPIR-207: Add a distribution management report

o added new report

[Vincent Siveton] o code simplification

[Vincent Siveton] [MPIR-80] added minimum JDK Rev to project summary

o display JDK rev only if the project seems a Java project

[Vincent Siveton] MPIR-206: Generalize configuration for text reports

o added customBundle which load a customI18N object
o updated documentation

------------------------------------------
[...truncated 5422 lines...]
[INFO] Webapp assembled in [2 msecs]
Tests run: 2, Failures: 0, Errors: 0, Skipped: 0, Time elapsed: 0.073 sec
Running org.apache.maven.plugin.war.WarManifestMojoTest
Tests run: 6, Failures: 0, Errors: 0, Skipped: 0, Time elapsed: 0.195 sec
Running org.apache.maven.plugin.war.util.PathSetTest
Tests run: 5, Failures: 0, Errors: 0, Skipped: 0, Time elapsed: 0.005 sec
Running org.apache.maven.plugin.war.util.WarUtilsTest
Tests run: 1, Failures: 0, Errors: 0, Skipped: 0, Time elapsed: 0.002 sec
Running org.apache.maven.plugin.war.overlay.OverlayManagerTest
Tests run: 5, Failures: 0, Errors: 0, Skipped: 0, Time elapsed: 0.139 sec
Running org.apache.maven.plugin.war.WarDependenciesAnalysisTest
[INFO] Exploding webapp
[INFO] Assembling webapp [maven-war-plugin-test] in [/opt/grid/slave/workspace/maven-plugins-ITs/jdk/java-5x/label/ubuntu/trunk/maven-war-plugin/target/test-classes/unit/dependenciesanalysis/test-dir/no-change]
[INFO] Processing war project
[INFO] Copying webapp resources [/opt/grid/slave/workspace/maven-plugins-ITs/jdk/java-5x/label/ubuntu/trunk/maven-war-plugin/target/test-classes/unit/dependenciesanalysis/test-dir/no-change-test-data/source]
[INFO] Webapp assembled in [6 msecs]
[INFO] Exploding webapp
[INFO] Assembling webapp [maven-war-plugin-test] in [/opt/grid/slave/workspace/maven-plugins-ITs/jdk/java-5x/label/ubuntu/trunk/maven-war-plugin/target/test-classes/unit/dependenciesanalysis/test-dir/no-change]
[INFO] Processing war project
[INFO] Copying webapp resources [/opt/grid/slave/workspace/maven-plugins-ITs/jdk/java-5x/label/ubuntu/trunk/maven-war-plugin/target/test-classes/unit/dependenciesanalysis/test-dir/no-change-test-data/source]
[INFO] Webapp assembled in [2 msecs]
[INFO] Exploding webapp
[INFO] Assembling webapp [maven-war-plugin-test] in [/opt/grid/slave/workspace/maven-plugins-ITs/jdk/java-5x/label/ubuntu/trunk/maven-war-plugin/target/test-classes/unit/dependenciesanalysis/test-dir/remove-dependency]
[INFO] Processing war project
[INFO] Copying webapp resources [/opt/grid/slave/workspace/maven-plugins-ITs/jdk/java-5x/label/ubuntu/trunk/maven-war-plugin/target/test-classes/unit/dependenciesanalysis/test-dir/remove-dependency-test-data/source]
[INFO] Webapp assembled in [5 msecs]
[INFO] Exploding webapp
[INFO] Assembling webapp [maven-war-plugin-test] in [/opt/grid/slave/workspace/maven-plugins-ITs/jdk/java-5x/label/ubuntu/trunk/maven-war-plugin/target/test-classes/unit/dependenciesanalysis/test-dir/remove-dependency]
[INFO] Dependency [Dependency {groupId=org.sample.jar, artifactId=lib-test, version=1.0, type=jar}] has been removed from the project.
[INFO] Processing war project
[INFO] Copying webapp resources [/opt/grid/slave/workspace/maven-plugins-ITs/jdk/java-5x/label/ubuntu/trunk/maven-war-plugin/target/test-classes/unit/dependenciesanalysis/test-dir/remove-dependency-test-data/source]
[INFO] Webapp assembled in [2 msecs]
[INFO] Exploding webapp
[INFO] Assembling webapp [maven-war-plugin-test] in [/opt/grid/slave/workspace/maven-plugins-ITs/jdk/java-5x/label/ubuntu/trunk/maven-war-plugin/target/test-classes/unit/dependenciesanalysis/test-dir/dependency-update-version]
[INFO] Processing war project
[INFO] Copying webapp resources [/opt/grid/slave/workspace/maven-plugins-ITs/jdk/java-5x/label/ubuntu/trunk/maven-war-plugin/target/test-classes/unit/dependenciesanalysis/test-dir/dependency-update-version-test-data/source]
[INFO] Webapp assembled in [4 msecs]
[INFO] Exploding webapp
[INFO] Assembling webapp [maven-war-plugin-test] in [/opt/grid/slave/workspace/maven-plugins-ITs/jdk/java-5x/label/ubuntu/trunk/maven-war-plugin/target/test-classes/unit/dependenciesanalysis/test-dir/dependency-update-version]
[INFO] Version of dependency [Dependency {groupId=org.sample.jar, artifactId=lib-test, version=2.0, type=jar}] has changed (1.0 -> 2.0).
[INFO] Processing war project
[INFO] Copying webapp resources [/opt/grid/slave/workspace/maven-plugins-ITs/jdk/java-5x/label/ubuntu/trunk/maven-war-plugin/target/test-classes/unit/dependenciesanalysis/test-dir/dependency-update-version-test-data/source]
[INFO] Webapp assembled in [3 msecs]
[INFO] Exploding webapp
[INFO] Assembling webapp [maven-war-plugin-test] in [/opt/grid/slave/workspace/maven-plugins-ITs/jdk/java-5x/label/ubuntu/trunk/maven-war-plugin/target/test-classes/unit/dependenciesanalysis/test-dir/dependency-now-provided]
[INFO] Processing war project
[INFO] Copying webapp resources [/opt/grid/slave/workspace/maven-plugins-ITs/jdk/java-5x/label/ubuntu/trunk/maven-war-plugin/target/test-classes/unit/dependenciesanalysis/test-dir/dependency-now-provided-test-data/source]
[INFO] Webapp assembled in [6 msecs]
[INFO] Exploding webapp
[INFO] Assembling webapp [maven-war-plugin-test] in [/opt/grid/slave/workspace/maven-plugins-ITs/jdk/java-5x/label/ubuntu/trunk/maven-war-plugin/target/test-classes/unit/dependenciesanalysis/test-dir/dependency-now-provided]
[INFO] Scope of dependency [Dependency {groupId=org.sample.jar, artifactId=lib-test, version=1.0, type=jar}] has changed (runtime -> provided).
[INFO] Processing war project
[INFO] Copying webapp resources [/opt/grid/slave/workspace/maven-plugins-ITs/jdk/java-5x/label/ubuntu/trunk/maven-war-plugin/target/test-classes/unit/dependenciesanalysis/test-dir/dependency-now-provided-test-data/source]
[INFO] Webapp assembled in [3 msecs]
Tests run: 4, Failures: 0, Errors: 0, Skipped: 0, Time elapsed: 0.25 sec

Results :

Tests run: 83, Failures: 0, Errors: 0, Skipped: 0

[INFO] [jar:jar {execution: default-jar}]
[INFO] Building jar: /opt/grid/slave/workspace/maven-plugins-ITs/jdk/java-5x/label/ubuntu/trunk/maven-war-plugin/target/maven-war-plugin-2.2-SNAPSHOT.jar
[INFO] [plugin:addPluginArtifactMetadata {execution: default-addPluginArtifactMetadata}]
[INFO] [invoker:install {execution: integration-test}]
[INFO] Installing /opt/grid/slave/workspace/maven-plugins-ITs/jdk/java-5x/label/ubuntu/trunk/maven-war-plugin/pom.xml to /opt/grid/slave/workspace/maven-plugins-ITs/jdk/java-5x/label/ubuntu/trunk/maven-war-plugin/target/local-repo/org/apache/maven/plugins/maven-war-plugin/2.2-SNAPSHOT/maven-war-plugin-2.2-SNAPSHOT.pom
[INFO] Installing /opt/grid/slave/workspace/maven-plugins-ITs/jdk/java-5x/label/ubuntu/trunk/maven-war-plugin/target/maven-war-plugin-2.2-SNAPSHOT.jar to /opt/grid/slave/workspace/maven-plugins-ITs/jdk/java-5x/label/ubuntu/trunk/maven-war-plugin/target/local-repo/org/apache/maven/plugins/maven-war-plugin/2.2-SNAPSHOT/maven-war-plugin-2.2-SNAPSHOT.jar
[INFO] [invoker:run {execution: integration-test}]
[INFO] Building: MWAR-143/pom.xml
[INFO] ..SUCCESS (20.1 s)
[INFO] Building: scoped-dependency-same-artifact/pom.xml
[INFO] ..SUCCESS (5.7 s)
[INFO] Building: MWAR-96/pom.xml
[INFO] ..SUCCESS (4.0 s)
[INFO] Building: MWAR-62/pom.xml
[INFO] ..SUCCESS (2.8 s)
[INFO] Building: MWAR-129/pom.xml
[INFO] ..SUCCESS (3.0 s)
[INFO] Building: simple-war-no-webxml/pom.xml
[INFO] ..SUCCESS (4.9 s)
[INFO] Building: simple-war-project/pom.xml
[INFO] ..SUCCESS (3.9 s)
[INFO] Building: MWAR-139/pom.xml
[INFO] ..SUCCESS (3.6 s)
[INFO] Building: web-resources-filtering/pom.xml
[INFO] ..SUCCESS (5.0 s)
[INFO] Building: MWAR-131/pom.xml
[INFO] ..SUCCESS (22.0 s)
[INFO] Building: default/pom.xml
[INFO] ..SUCCESS (6.1 s)
[INFO] Building: MWAR-133/pom.xml
[INFO] ..SUCCESS (2.9 s)
[INFO] ---------------------------------------
[INFO] Execution Summary:
[INFO]   Builds Passing: 12
[INFO]   Builds Failing: 0
[INFO]   Builds Skipped: 0
[INFO] ---------------------------------------
[INFO] [install:install {execution: default-install}]
[INFO] Installing /opt/grid/slave/workspace/maven-plugins-ITs/jdk/java-5x/label/ubuntu/trunk/maven-war-plugin/target/maven-war-plugin-2.2-SNAPSHOT.jar to <https://grid.sonatype.org/ci/job/maven-plugins-ITs/./jdk=java-5x,label=ubuntu/ws/.repository/org/apache/maven/plugins/maven-war-plugin/2.2-SNAPSHOT/maven-war-plugin-2.2-SNAPSHOT.jar>
[INFO] [deploy:deploy {execution: default-deploy}]
[INFO] Retrieving previous build number from apache.snapshots.https
Uploading: http://repository.sonatype.org:8081/content/repositories/maven.snapshots/org/apache/maven/plugins/maven-war-plugin/2.2-SNAPSHOT/maven-war-plugin-2.2-20101118.070352-60.jar
75K uploaded  (maven-war-plugin-2.2-20101118.070352-60.jar)
[INFO] Retrieving previous metadata from apache.snapshots.https
[INFO] Uploading repository metadata for: 'artifact org.apache.maven.plugins:maven-war-plugin'
[INFO] Retrieving previous metadata from apache.snapshots.https
[INFO] Uploading repository metadata for: 'org.apache.maven.plugins'
[INFO] Uploading project information for maven-war-plugin 2.2-20101118.070352-60
[INFO] Retrieving previous metadata from apache.snapshots.https
[INFO] Uploading repository metadata for: 'snapshot org.apache.maven.plugins:maven-war-plugin:2.2-SNAPSHOT'
[INFO] ------------------------------------------------------------------------
[INFO] Building Maven Plugins Aggregator
[INFO]    task-segment: [clean, deploy]
[INFO] ------------------------------------------------------------------------
[INFO] [clean:clean {execution: default-clean}]
[INFO] Deleting file set: /opt/grid/slave/workspace/maven-plugins-ITs/jdk/java-5x/label/ubuntu/trunk/target (included: [**], excluded: [])
[INFO] [remote-resources:process {execution: default}]
[INFO] [site:attach-descriptor {execution: default-attach-descriptor}]
[INFO] [install:install {execution: default-install}]
[INFO] Installing /opt/grid/slave/workspace/maven-plugins-ITs/jdk/java-5x/label/ubuntu/trunk/pom.xml to <https://grid.sonatype.org/ci/job/maven-plugins-ITs/./jdk=java-5x,label=ubuntu/ws/.repository/org/apache/maven/plugins/maven-plugins-aggregator/1-SNAPSHOT/maven-plugins-aggregator-1-SNAPSHOT.pom>
[INFO] [deploy:deploy {execution: default-deploy}]
[INFO] Retrieving previous build number from apache.snapshots.https
Uploading: http://repository.sonatype.org:8081/content/repositories/maven.snapshots/org/apache/maven/plugins/maven-plugins-aggregator/1-SNAPSHOT/maven-plugins-aggregator-1-20101118.070352-107.pom
3K uploaded  (maven-plugins-aggregator-1-20101118.070352-107.pom)
[INFO] Retrieving previous metadata from apache.snapshots.https
[INFO] Uploading repository metadata for: 'artifact org.apache.maven.plugins:maven-plugins-aggregator'
[INFO] Retrieving previous metadata from apache.snapshots.https
[INFO] Uploading repository metadata for: 'snapshot org.apache.maven.plugins:maven-plugins-aggregator:1-SNAPSHOT'
[INFO] 
[INFO] 
[INFO] ------------------------------------------------------------------------
[INFO] Reactor Summary:
[INFO] ------------------------------------------------------------------------
[INFO] Maven Plugins ......................................... SUCCESS [23.380s]
[INFO] Maven Invoker Plugin .................................. SUCCESS [5:44.576s]
[INFO] Maven Ant Plugin ...................................... SUCCESS [2:25.353s]
[INFO] Maven AntRun Plugin ................................... SUCCESS [1:20.054s]
[INFO] Maven Eclipse Plugin .................................. SUCCESS [9:44.406s]
[INFO] Maven Changelog Plugin ................................ SUCCESS [45.808s]
[INFO] Maven Changes Report Plugin ........................... SUCCESS [1:13.757s]
[INFO] Maven Checkstyle Plugin ............................... SUCCESS [2:18.319s]
[INFO] Maven Clean Plugin .................................... SUCCESS [43.526s]
[INFO] Maven Compiler Plugin ................................. SUCCESS [50.453s]
[INFO] Maven Dependency Plugin ............................... SUCCESS [4:18.549s]
[INFO] Maven Deploy Plugin ................................... SUCCESS [1:50.054s]
[INFO] Maven DOAP Plugin ..................................... SUCCESS [25.381s]
[INFO] Maven Documentation Checker Plugin .................... SUCCESS [31.954s]
[INFO] Maven EAR Plugin ...................................... FAILED [1:01.564s]
[INFO] Maven EJB Plugin ...................................... SUCCESS [56.050s]
[INFO] Maven GPG Plugin ...................................... SUCCESS [42.195s]
[INFO] Maven Help Plugin ..................................... SUCCESS [49.663s]
[INFO] Maven IDEA Plugin ..................................... SUCCESS [18.046s]
[INFO] Maven Install Plugin .................................. SUCCESS [1:33.067s]
[INFO] Maven JAR Plugin ...................................... SUCCESS [2:00.420s]
[INFO] Maven Jarsigner Plugin ................................ SUCCESS [1:01.792s]
[INFO] Maven Shade Plugin .................................... SUCCESS [2:49.916s]
[INFO] Maven Javadoc Plugin .................................. FAILED [5:50.357s]
[INFO] Maven Linkcheck Plugin ................................ SUCCESS [5.201s]
[INFO] Maven One Plugin ...................................... SUCCESS [6.002s]
[INFO] Maven Patch Plugin .................................... SUCCESS [20.808s]
[INFO] Maven PDF Plugin ...................................... SUCCESS [1:29.933s]
[INFO] Maven PMD Plugin ...................................... SUCCESS [44.446s]
[INFO] Maven RAR Plugin ...................................... SUCCESS [15.411s]
[INFO] Maven Reactor Plugin .................................. SUCCESS [6.843s]
[INFO] Maven Repository Plugin ............................... SUCCESS [1:11.824s]
[INFO] Maven Resources Plugin ................................ SUCCESS [1:06.451s]
[INFO] Maven Site Plugin ..................................... SUCCESS [25:52.423s]
[INFO] Maven Source Plugin ................................... SUCCESS [47.224s]
[INFO] Maven Stage Plugin .................................... SUCCESS [13.223s]
[INFO] Maven Toolchains Plugin ............................... SUCCESS [4.955s]
[INFO] Maven Verifier Plugin ................................. SUCCESS [13.974s]
[INFO] Maven WAR Plugin ...................................... SUCCESS [1:48.834s]
[INFO] Maven Plugins Aggregator .............................. SUCCESS [3.012s]
[INFO] ------------------------------------------------------------------------
[INFO] Error for project: Maven EAR Plugin (during deploy)
[INFO] ------------------------------------------------------------------------
[INFO] : org.apache.maven.plugin.invoker.InvokerSession@1359808a
1 build failed.
[INFO] ------------------------------------------------------------------------
[INFO] Trace
org.apache.maven.BuildFailureException: 1 build failed.
	at org.apache.maven.lifecycle.DefaultLifecycleExecutor.executeGoals(DefaultLifecycleExecutor.java:715)
	at org.apache.maven.lifecycle.DefaultLifecycleExecutor.executeGoalWithLifecycle(DefaultLifecycleExecutor.java:556)
	at org.apache.maven.lifecycle.DefaultLifecycleExecutor.executeGoal(DefaultLifecycleExecutor.java:535)
	at org.apache.maven.lifecycle.DefaultLifecycleExecutor.executeGoalAndHandleFailures(DefaultLifecycleExecutor.java:387)
	at org.apache.maven.lifecycle.DefaultLifecycleExecutor.executeTaskSegments(DefaultLifecycleExecutor.java:348)
	at org.apache.maven.lifecycle.DefaultLifecycleExecutor.execute(DefaultLifecycleExecutor.java:180)
	at org.apache.maven.DefaultMaven.doExecute(DefaultMaven.java:328)
	at org.apache.maven.DefaultMaven.execute(DefaultMaven.java:138)
	at org.apache.maven.cli.MavenCli.main(MavenCli.java:362)
	at org.apache.maven.cli.compat.CompatibleMain.main(CompatibleMain.java:60)
	at sun.reflect.NativeMethodAccessorImpl.invoke0(Native Method)
	at sun.reflect.NativeMethodAccessorImpl.invoke(NativeMethodAccessorImpl.java:39)
	at sun.reflect.DelegatingMethodAccessorImpl.invoke(DelegatingMethodAccessorImpl.java:25)
	at java.lang.reflect.Method.invoke(Method.java:592)
	at org.codehaus.classworlds.Launcher.launchEnhanced(Launcher.java:315)
	at org.codehaus.classworlds.Launcher.launch(Launcher.java:255)
	at org.codehaus.classworlds.Launcher.mainWithExitCode(Launcher.java:430)
	at org.codehaus.classworlds.Launcher.main(Launcher.java:375)
Caused by: org.apache.maven.plugin.MojoFailureException: 1 build failed.
	at org.apache.maven.plugin.invoker.InvokerSession.handleFailures(InvokerSession.java:244)
	at org.apache.maven.plugin.invoker.InvokerMojo.processResults(InvokerMojo.java:58)
	at org.apache.maven.plugin.invoker.AbstractInvokerMojo.execute(AbstractInvokerMojo.java:601)
	at org.apache.maven.plugin.DefaultPluginManager.executeMojo(DefaultPluginManager.java:490)
	at org.apache.maven.lifecycle.DefaultLifecycleExecutor.executeGoals(DefaultLifecycleExecutor.java:694)
	... 17 more
[INFO] ------------------------------------------------------------------------
[INFO] Error for project: Maven Javadoc Plugin (during deploy)
[INFO] ------------------------------------------------------------------------
[INFO] There are test failures.

Please refer to /opt/grid/slave/workspace/maven-plugins-ITs/jdk/java-5x/label/ubuntu/trunk/maven-javadoc-plugin/target/surefire-reports for the individual test results.
[INFO] ------------------------------------------------------------------------
[INFO] Trace
org.apache.maven.BuildFailureException: There are test failures.

Please refer to /opt/grid/slave/workspace/maven-plugins-ITs/jdk/java-5x/label/ubuntu/trunk/maven-javadoc-plugin/target/surefire-reports for the individual test results.
	at org.apache.maven.lifecycle.DefaultLifecycleExecutor.executeGoals(DefaultLifecycleExecutor.java:715)
	at org.apache.maven.lifecycle.DefaultLifecycleExecutor.executeGoalWithLifecycle(DefaultLifecycleExecutor.java:556)
	at org.apache.maven.lifecycle.DefaultLifecycleExecutor.executeGoal(DefaultLifecycleExecutor.java:535)
	at org.apache.maven.lifecycle.DefaultLifecycleExecutor.executeGoalAndHandleFailures(DefaultLifecycleExecutor.java:387)
	at org.apache.maven.lifecycle.DefaultLifecycleExecutor.executeTaskSegments(DefaultLifecycleExecutor.java:348)
	at org.apache.maven.lifecycle.DefaultLifecycleExecutor.execute(DefaultLifecycleExecutor.java:180)
	at org.apache.maven.DefaultMaven.doExecute(DefaultMaven.java:328)
	at org.apache.maven.DefaultMaven.execute(DefaultMaven.java:138)
	at org.apache.maven.cli.MavenCli.main(MavenCli.java:362)
	at org.apache.maven.cli.compat.CompatibleMain.main(CompatibleMain.java:60)
	at sun.reflect.NativeMethodAccessorImpl.invoke0(Native Method)
	at sun.reflect.NativeMethodAccessorImpl.invoke(NativeMethodAccessorImpl.java:39)
	at sun.reflect.DelegatingMethodAccessorImpl.invoke(DelegatingMethodAccessorImpl.java:25)
	at java.lang.reflect.Method.invoke(Method.java:592)
	at org.codehaus.classworlds.Launcher.launchEnhanced(Launcher.java:315)
	at org.codehaus.classworlds.Launcher.launch(Launcher.java:255)
	at org.codehaus.classworlds.Launcher.mainWithExitCode(Launcher.java:430)
	at org.codehaus.classworlds.Launcher.main(Launcher.java:375)
Caused by: org.apache.maven.plugin.MojoFailureException: There are test failures.

Please refer to /opt/grid/slave/workspace/maven-plugins-ITs/jdk/java-5x/label/ubuntu/trunk/maven-javadoc-plugin/target/surefire-reports for the individual test results.
	at org.apache.maven.plugin.surefire.SurefirePlugin.execute(SurefirePlugin.java:575)
	at org.apache.maven.plugin.DefaultPluginManager.executeMojo(DefaultPluginManager.java:490)
	at org.apache.maven.lifecycle.DefaultLifecycleExecutor.executeGoals(DefaultLifecycleExecutor.java:694)
	... 17 more
[INFO] ------------------------------------------------------------------------
[INFO] BUILD ERRORS
[INFO] ------------------------------------------------------------------------
[INFO] Total time: 84 minutes 12 seconds
[INFO] Finished at: Thu Nov 18 02:27:49 CST 2010
[INFO] Final Memory: 111M/217M
[INFO] ------------------------------------------------------------------------


Build failed in Hudson: maven-plugins-ITs » java-5x,ubuntu #550

Posted by "GRiD .ORG" <bu...@lists.sonatype.com>.
See <https://grid.sonatype.org/ci/job/maven-plugins-ITs/./jdk=java-5x,label=ubuntu/550/changes>

Changes:

[Paul] Revert bad commit

[Paul] repositoryId should

[Olivier Lamy] use last site plugin version for maven 3

[Olivier Lamy] [MCHECKSTYLE-132] Upgrade to Checkstyle 5.3

------------------------------------------
[...truncated 5517 lines...]
[INFO] Assembling webapp [maven-war-plugin-test] in [/opt/grid/slave/workspace/maven-plugins-ITs/jdk/java-5x/label/ubuntu/trunk/maven-war-plugin/target/test-classes/unit/warexplodedmojo/test-dir/ExplodedWar_WithClasses]
[INFO] Processing war project
[INFO] Copying webapp resources [/opt/grid/slave/workspace/maven-plugins-ITs/jdk/java-5x/label/ubuntu/trunk/maven-war-plugin/target/test-classes/unit/warexplodedmojo/test-dir/ExplodedWar_WithClasses-test-data/source]
[INFO] Webapp assembled in [4 msecs]
[INFO] Exploding webapp
[INFO] Assembling webapp [maven-war-plugin-test] in [/opt/grid/slave/workspace/maven-plugins-ITs/jdk/java-5x/label/ubuntu/trunk/maven-war-plugin/target/test-classes/unit/warexplodedmojo/test-dir/ExplodedWar_WithSourceIncludeExclude]
[INFO] Processing war project
[INFO] Copying webapp resources [/opt/grid/slave/workspace/maven-plugins-ITs/jdk/java-5x/label/ubuntu/trunk/maven-war-plugin/target/test-classes/unit/warexplodedmojo/test-dir/ExplodedWar_WithSourceIncludeExclude-test-data/source]
[INFO] Webapp assembled in [2 msecs]
[INFO] Exploding webapp
[INFO] Assembling webapp [maven-war-plugin-test] in [/opt/grid/slave/workspace/maven-plugins-ITs/jdk/java-5x/label/ubuntu/trunk/maven-war-plugin/target/test-classes/unit/warexplodedmojo/test-dir/ExplodedWar_WithWarDependencyIncludeExclude]
[INFO] Processing war project
[INFO] Copying webapp resources [/opt/grid/slave/workspace/maven-plugins-ITs/jdk/java-5x/label/ubuntu/trunk/maven-war-plugin/target/test-classes/unit/warexplodedmojo/test-dir/ExplodedWar_WithWarDependencyIncludeExclude-test-data/source]
[INFO] Processing overlay [ id wartests:war-include-exclude]
[INFO] Webapp assembled in [16 msecs]
[INFO] Exploding webapp
[INFO] Assembling webapp [maven-war-plugin-test] in [/opt/grid/slave/workspace/maven-plugins-ITs/jdk/java-5x/label/ubuntu/trunk/maven-war-plugin/target/test-classes/unit/warexplodedmojo/test-dir/ExplodedWarWithSourceModificationCheck]
[INFO] Processing war project
[INFO] Copying webapp resources [/opt/grid/slave/workspace/maven-plugins-ITs/jdk/java-5x/label/ubuntu/trunk/maven-war-plugin/target/test-classes/unit/warexplodedmojo/test-dir/ExplodedWarWithSourceModificationCheck-test-data/source]
[INFO] Webapp assembled in [3 msecs]
[INFO] Exploding webapp
[INFO] Assembling webapp [maven-war-plugin-test] in [/opt/grid/slave/workspace/maven-plugins-ITs/jdk/java-5x/label/ubuntu/trunk/maven-war-plugin/target/test-classes/unit/warexplodedmojo/test-dir/ExplodedWarWithFileNameMapping]
[INFO] Processing war project
[INFO] Copying webapp resources [/opt/grid/slave/workspace/maven-plugins-ITs/jdk/java-5x/label/ubuntu/trunk/maven-war-plugin/target/test-classes/unit/warexplodedmojo/test-dir/ExplodedWarWithFileNameMapping-test-data/source]
[INFO] Webapp assembled in [12 msecs]
[INFO] Exploding webapp
[INFO] Assembling webapp [maven-war-plugin-test] in [/opt/grid/slave/workspace/maven-plugins-ITs/jdk/java-5x/label/ubuntu/trunk/maven-war-plugin/target/test-classes/unit/warexplodedmojo/test-dir/ExplodedWarWithFileNameMappingAndDuplicateDependencies]
[INFO] Processing war project
[INFO] Copying webapp resources [/opt/grid/slave/workspace/maven-plugins-ITs/jdk/java-5x/label/ubuntu/trunk/maven-war-plugin/target/test-classes/unit/warexplodedmojo/test-dir/ExplodedWarWithFileNameMappingAndDuplicateDependencies-test-data/source]
[INFO] Webapp assembled in [4 msecs]
Tests run: 21, Failures: 0, Errors: 0, Skipped: 0, Time elapsed: 1.611 sec
Running org.apache.maven.plugin.war.WarInPlaceMojoTest
[INFO] Generating webapp in source directory [/opt/grid/slave/workspace/maven-plugins-ITs/jdk/java-5x/label/ubuntu/trunk/maven-war-plugin/target/test-classes/unit/warexplodedinplacemojo/test-dir/SimpleExplodedInplaceWar-test-data/source]
[INFO] Assembling webapp [maven-war-plugin-test] in [/opt/grid/slave/workspace/maven-plugins-ITs/jdk/java-5x/label/ubuntu/trunk/maven-war-plugin/target/test-classes/unit/warexplodedinplacemojo/test-dir/SimpleExplodedInplaceWar-test-data/source]
[INFO] Processing war project
[INFO] Copying webapp webResources [/opt/grid/slave/workspace/maven-plugins-ITs/jdk/java-5x/label/ubuntu/trunk/maven-war-plugin/target/test-classes/unit/warexplodedinplacemojo/test-dir/resources] to [/opt/grid/slave/workspace/maven-plugins-ITs/jdk/java-5x/label/ubuntu/trunk/maven-war-plugin/target/test-classes/unit/warexplodedinplacemojo/test-dir/SimpleExplodedInplaceWar-test-data/source]
[INFO] Webapp assembled in [1 msecs]
Tests run: 2, Failures: 0, Errors: 0, Skipped: 0, Time elapsed: 0.089 sec
Running org.apache.maven.plugin.war.WarManifestMojoTest
Tests run: 6, Failures: 0, Errors: 0, Skipped: 0, Time elapsed: 0.224 sec
Running org.apache.maven.plugin.war.util.PathSetTest
Tests run: 5, Failures: 0, Errors: 0, Skipped: 0, Time elapsed: 0.005 sec
Running org.apache.maven.plugin.war.util.WarUtilsTest
Tests run: 1, Failures: 0, Errors: 0, Skipped: 0, Time elapsed: 0.002 sec
Running org.apache.maven.plugin.war.overlay.OverlayManagerTest
Tests run: 5, Failures: 0, Errors: 0, Skipped: 0, Time elapsed: 0.271 sec
Running org.apache.maven.plugin.war.WarDependenciesAnalysisTest
[INFO] Exploding webapp
[INFO] Assembling webapp [maven-war-plugin-test] in [/opt/grid/slave/workspace/maven-plugins-ITs/jdk/java-5x/label/ubuntu/trunk/maven-war-plugin/target/test-classes/unit/dependenciesanalysis/test-dir/no-change]
[INFO] Processing war project
[INFO] Copying webapp resources [/opt/grid/slave/workspace/maven-plugins-ITs/jdk/java-5x/label/ubuntu/trunk/maven-war-plugin/target/test-classes/unit/dependenciesanalysis/test-dir/no-change-test-data/source]
[INFO] Webapp assembled in [4 msecs]
[INFO] Exploding webapp
[INFO] Assembling webapp [maven-war-plugin-test] in [/opt/grid/slave/workspace/maven-plugins-ITs/jdk/java-5x/label/ubuntu/trunk/maven-war-plugin/target/test-classes/unit/dependenciesanalysis/test-dir/no-change]
[INFO] Processing war project
[INFO] Copying webapp resources [/opt/grid/slave/workspace/maven-plugins-ITs/jdk/java-5x/label/ubuntu/trunk/maven-war-plugin/target/test-classes/unit/dependenciesanalysis/test-dir/no-change-test-data/source]
[INFO] Webapp assembled in [2 msecs]
[INFO] Exploding webapp
[INFO] Assembling webapp [maven-war-plugin-test] in [/opt/grid/slave/workspace/maven-plugins-ITs/jdk/java-5x/label/ubuntu/trunk/maven-war-plugin/target/test-classes/unit/dependenciesanalysis/test-dir/remove-dependency]
[INFO] Processing war project
[INFO] Copying webapp resources [/opt/grid/slave/workspace/maven-plugins-ITs/jdk/java-5x/label/ubuntu/trunk/maven-war-plugin/target/test-classes/unit/dependenciesanalysis/test-dir/remove-dependency-test-data/source]
[INFO] Webapp assembled in [5 msecs]
[INFO] Exploding webapp
[INFO] Assembling webapp [maven-war-plugin-test] in [/opt/grid/slave/workspace/maven-plugins-ITs/jdk/java-5x/label/ubuntu/trunk/maven-war-plugin/target/test-classes/unit/dependenciesanalysis/test-dir/remove-dependency]
[INFO] Dependency [Dependency {groupId=org.sample.jar, artifactId=lib-test, version=1.0, type=jar}] has been removed from the project.
[INFO] Processing war project
[INFO] Copying webapp resources [/opt/grid/slave/workspace/maven-plugins-ITs/jdk/java-5x/label/ubuntu/trunk/maven-war-plugin/target/test-classes/unit/dependenciesanalysis/test-dir/remove-dependency-test-data/source]
[INFO] Webapp assembled in [1 msecs]
[INFO] Exploding webapp
[INFO] Assembling webapp [maven-war-plugin-test] in [/opt/grid/slave/workspace/maven-plugins-ITs/jdk/java-5x/label/ubuntu/trunk/maven-war-plugin/target/test-classes/unit/dependenciesanalysis/test-dir/dependency-update-version]
[INFO] Processing war project
[INFO] Copying webapp resources [/opt/grid/slave/workspace/maven-plugins-ITs/jdk/java-5x/label/ubuntu/trunk/maven-war-plugin/target/test-classes/unit/dependenciesanalysis/test-dir/dependency-update-version-test-data/source]
[INFO] Webapp assembled in [5 msecs]
[INFO] Exploding webapp
[INFO] Assembling webapp [maven-war-plugin-test] in [/opt/grid/slave/workspace/maven-plugins-ITs/jdk/java-5x/label/ubuntu/trunk/maven-war-plugin/target/test-classes/unit/dependenciesanalysis/test-dir/dependency-update-version]
[INFO] Version of dependency [Dependency {groupId=org.sample.jar, artifactId=lib-test, version=2.0, type=jar}] has changed (1.0 -> 2.0).
[INFO] Processing war project
[INFO] Copying webapp resources [/opt/grid/slave/workspace/maven-plugins-ITs/jdk/java-5x/label/ubuntu/trunk/maven-war-plugin/target/test-classes/unit/dependenciesanalysis/test-dir/dependency-update-version-test-data/source]
[INFO] Webapp assembled in [3 msecs]
[INFO] Exploding webapp
[INFO] Assembling webapp [maven-war-plugin-test] in [/opt/grid/slave/workspace/maven-plugins-ITs/jdk/java-5x/label/ubuntu/trunk/maven-war-plugin/target/test-classes/unit/dependenciesanalysis/test-dir/dependency-now-provided]
[INFO] Processing war project
[INFO] Copying webapp resources [/opt/grid/slave/workspace/maven-plugins-ITs/jdk/java-5x/label/ubuntu/trunk/maven-war-plugin/target/test-classes/unit/dependenciesanalysis/test-dir/dependency-now-provided-test-data/source]
[INFO] Webapp assembled in [5 msecs]
[INFO] Exploding webapp
[INFO] Assembling webapp [maven-war-plugin-test] in [/opt/grid/slave/workspace/maven-plugins-ITs/jdk/java-5x/label/ubuntu/trunk/maven-war-plugin/target/test-classes/unit/dependenciesanalysis/test-dir/dependency-now-provided]
[INFO] Scope of dependency [Dependency {groupId=org.sample.jar, artifactId=lib-test, version=1.0, type=jar}] has changed (runtime -> provided).
[INFO] Processing war project
[INFO] Copying webapp resources [/opt/grid/slave/workspace/maven-plugins-ITs/jdk/java-5x/label/ubuntu/trunk/maven-war-plugin/target/test-classes/unit/dependenciesanalysis/test-dir/dependency-now-provided-test-data/source]
[INFO] Webapp assembled in [10 msecs]
Tests run: 4, Failures: 0, Errors: 0, Skipped: 0, Time elapsed: 0.229 sec

Results :

Tests run: 83, Failures: 0, Errors: 0, Skipped: 0

[INFO] [jar:jar {execution: default-jar}]
[INFO] Building jar: /opt/grid/slave/workspace/maven-plugins-ITs/jdk/java-5x/label/ubuntu/trunk/maven-war-plugin/target/maven-war-plugin-2.2-SNAPSHOT.jar
[INFO] [plugin:addPluginArtifactMetadata {execution: default-addPluginArtifactMetadata}]
[INFO] [invoker:install {execution: integration-test}]
[INFO] Installing /opt/grid/slave/workspace/maven-plugins-ITs/jdk/java-5x/label/ubuntu/trunk/maven-war-plugin/pom.xml to /opt/grid/slave/workspace/maven-plugins-ITs/jdk/java-5x/label/ubuntu/trunk/maven-war-plugin/target/local-repo/org/apache/maven/plugins/maven-war-plugin/2.2-SNAPSHOT/maven-war-plugin-2.2-SNAPSHOT.pom
[INFO] Installing /opt/grid/slave/workspace/maven-plugins-ITs/jdk/java-5x/label/ubuntu/trunk/maven-war-plugin/target/maven-war-plugin-2.2-SNAPSHOT.jar to /opt/grid/slave/workspace/maven-plugins-ITs/jdk/java-5x/label/ubuntu/trunk/maven-war-plugin/target/local-repo/org/apache/maven/plugins/maven-war-plugin/2.2-SNAPSHOT/maven-war-plugin-2.2-SNAPSHOT.jar
[INFO] [invoker:run {execution: integration-test}]
[INFO] Building: MWAR-143/pom.xml
[INFO] ..SUCCESS (19.9 s)
[INFO] Building: scoped-dependency-same-artifact/pom.xml
[INFO] ..SUCCESS (5.8 s)
[INFO] Building: MWAR-96/pom.xml
[INFO] ..SUCCESS (3.9 s)
[INFO] Building: MWAR-62/pom.xml
[INFO] ..SUCCESS (2.8 s)
[INFO] Building: MWAR-129/pom.xml
[INFO] ..SUCCESS (2.9 s)
[INFO] Building: simple-war-no-webxml/pom.xml
[INFO] ..SUCCESS (4.5 s)
[INFO] Building: simple-war-project/pom.xml
[INFO] ..SUCCESS (3.6 s)
[INFO] Building: MWAR-139/pom.xml
[INFO] ..SUCCESS (3.8 s)
[INFO] Building: web-resources-filtering/pom.xml
[INFO] ..SUCCESS (5.0 s)
[INFO] Building: MWAR-131/pom.xml
[INFO] ..SUCCESS (21.8 s)
[INFO] Building: default/pom.xml
[INFO] ..SUCCESS (6.1 s)
[INFO] Building: MWAR-133/pom.xml
[INFO] ..SUCCESS (2.8 s)
[INFO] ---------------------------------------
[INFO] Execution Summary:
[INFO]   Builds Passing: 12
[INFO]   Builds Failing: 0
[INFO]   Builds Skipped: 0
[INFO] ---------------------------------------
[INFO] [install:install {execution: default-install}]
[INFO] Installing /opt/grid/slave/workspace/maven-plugins-ITs/jdk/java-5x/label/ubuntu/trunk/maven-war-plugin/target/maven-war-plugin-2.2-SNAPSHOT.jar to <https://grid.sonatype.org/ci/job/maven-plugins-ITs/./jdk=java-5x,label=ubuntu/ws/.repository/org/apache/maven/plugins/maven-war-plugin/2.2-SNAPSHOT/maven-war-plugin-2.2-SNAPSHOT.jar>
[INFO] [deploy:deploy {execution: default-deploy}]
[INFO] Retrieving previous build number from apache.snapshots.https
Uploading: http://repository.sonatype.org:8081/content/repositories/maven.snapshots/org/apache/maven/plugins/maven-war-plugin/2.2-SNAPSHOT/maven-war-plugin-2.2-20101117.070458-59.jar
75K uploaded  (maven-war-plugin-2.2-20101117.070458-59.jar)
[INFO] Retrieving previous metadata from apache.snapshots.https
[INFO] Uploading repository metadata for: 'artifact org.apache.maven.plugins:maven-war-plugin'
[INFO] Retrieving previous metadata from apache.snapshots.https
[INFO] Uploading repository metadata for: 'org.apache.maven.plugins'
[INFO] Uploading project information for maven-war-plugin 2.2-20101117.070458-59
[INFO] Retrieving previous metadata from apache.snapshots.https
[INFO] Uploading repository metadata for: 'snapshot org.apache.maven.plugins:maven-war-plugin:2.2-SNAPSHOT'
[INFO] ------------------------------------------------------------------------
[INFO] Building Maven Plugins Aggregator
[INFO]    task-segment: [clean, deploy]
[INFO] ------------------------------------------------------------------------
[INFO] [clean:clean {execution: default-clean}]
[INFO] Deleting file set: /opt/grid/slave/workspace/maven-plugins-ITs/jdk/java-5x/label/ubuntu/trunk/target (included: [**], excluded: [])
[INFO] [remote-resources:process {execution: default}]
[INFO] [site:attach-descriptor {execution: default-attach-descriptor}]
[INFO] [install:install {execution: default-install}]
[INFO] Installing /opt/grid/slave/workspace/maven-plugins-ITs/jdk/java-5x/label/ubuntu/trunk/pom.xml to <https://grid.sonatype.org/ci/job/maven-plugins-ITs/./jdk=java-5x,label=ubuntu/ws/.repository/org/apache/maven/plugins/maven-plugins-aggregator/1-SNAPSHOT/maven-plugins-aggregator-1-SNAPSHOT.pom>
[INFO] [deploy:deploy {execution: default-deploy}]
[INFO] Retrieving previous build number from apache.snapshots.https
Uploading: http://repository.sonatype.org:8081/content/repositories/maven.snapshots/org/apache/maven/plugins/maven-plugins-aggregator/1-SNAPSHOT/maven-plugins-aggregator-1-20101117.070458-106.pom
3K uploaded  (maven-plugins-aggregator-1-20101117.070458-106.pom)
[INFO] Retrieving previous metadata from apache.snapshots.https
[INFO] Uploading repository metadata for: 'artifact org.apache.maven.plugins:maven-plugins-aggregator'
[INFO] Retrieving previous metadata from apache.snapshots.https
[INFO] Uploading repository metadata for: 'snapshot org.apache.maven.plugins:maven-plugins-aggregator:1-SNAPSHOT'
[INFO] 
[INFO] 
[INFO] ------------------------------------------------------------------------
[INFO] Reactor Summary:
[INFO] ------------------------------------------------------------------------
[INFO] Maven Plugins ......................................... SUCCESS [18.073s]
[INFO] Maven Invoker Plugin .................................. SUCCESS [5:22.817s]
[INFO] Maven Ant Plugin ...................................... SUCCESS [2:16.275s]
[INFO] Maven AntRun Plugin ................................... SUCCESS [1:28.644s]
[INFO] Maven Eclipse Plugin .................................. SUCCESS [9:58.504s]
[INFO] Maven Changelog Plugin ................................ SUCCESS [38.287s]
[INFO] Maven Changes Report Plugin ........................... SUCCESS [1:16.281s]
[INFO] Maven Checkstyle Plugin ............................... SUCCESS [2:19.753s]
[INFO] Maven Clean Plugin .................................... SUCCESS [32.837s]
[INFO] Maven Compiler Plugin ................................. SUCCESS [40.728s]
[INFO] Maven Dependency Plugin ............................... SUCCESS [4:27.011s]
[INFO] Maven Deploy Plugin ................................... SUCCESS [1:44.323s]
[INFO] Maven DOAP Plugin ..................................... SUCCESS [21.967s]
[INFO] Maven Documentation Checker Plugin .................... SUCCESS [26.395s]
[INFO] Maven EAR Plugin ...................................... FAILED [1:03.757s]
[INFO] Maven EJB Plugin ...................................... SUCCESS [1:01.169s]
[INFO] Maven GPG Plugin ...................................... SUCCESS [57.141s]
[INFO] Maven Help Plugin ..................................... SUCCESS [54.204s]
[INFO] Maven IDEA Plugin ..................................... SUCCESS [19.049s]
[INFO] Maven Install Plugin .................................. SUCCESS [1:39.728s]
[INFO] Maven JAR Plugin ...................................... SUCCESS [2:12.560s]
[INFO] Maven Jarsigner Plugin ................................ SUCCESS [1:07.708s]
[INFO] Maven Shade Plugin .................................... SUCCESS [2:59.495s]
[INFO] Maven Javadoc Plugin .................................. SUCCESS [14:29.958s]
[INFO] Maven Linkcheck Plugin ................................ SUCCESS [14.861s]
[INFO] Maven One Plugin ...................................... SUCCESS [5.926s]
[INFO] Maven Patch Plugin .................................... SUCCESS [24.276s]
[INFO] Maven PDF Plugin ...................................... SUCCESS [1:25.628s]
[INFO] Maven PMD Plugin ...................................... SUCCESS [54.464s]
[INFO] Maven RAR Plugin ...................................... SUCCESS [20.594s]
[INFO] Maven Reactor Plugin .................................. SUCCESS [19.224s]
[INFO] Maven Repository Plugin ............................... SUCCESS [1:44.702s]
[INFO] Maven Resources Plugin ................................ SUCCESS [1:14.315s]
[INFO] Maven Site Plugin ..................................... SUCCESS [8:41.351s]
[INFO] Maven Source Plugin ................................... SUCCESS [54.386s]
[INFO] Maven Stage Plugin .................................... SUCCESS [31.385s]
[INFO] Maven Toolchains Plugin ............................... SUCCESS [12.327s]
[INFO] Maven Verifier Plugin ................................. SUCCESS [17.122s]
[INFO] Maven WAR Plugin ...................................... SUCCESS [1:59.783s]
[INFO] Maven Plugins Aggregator .............................. SUCCESS [2.572s]
[INFO] ------------------------------------------------------------------------
[INFO] Error for project: Maven EAR Plugin (during deploy)
[INFO] ------------------------------------------------------------------------
[INFO] : org.apache.maven.plugin.invoker.InvokerSession@68bca541
1 build failed.
[INFO] ------------------------------------------------------------------------
[INFO] Trace
org.apache.maven.BuildFailureException: 1 build failed.
	at org.apache.maven.lifecycle.DefaultLifecycleExecutor.executeGoals(DefaultLifecycleExecutor.java:715)
	at org.apache.maven.lifecycle.DefaultLifecycleExecutor.executeGoalWithLifecycle(DefaultLifecycleExecutor.java:556)
	at org.apache.maven.lifecycle.DefaultLifecycleExecutor.executeGoal(DefaultLifecycleExecutor.java:535)
	at org.apache.maven.lifecycle.DefaultLifecycleExecutor.executeGoalAndHandleFailures(DefaultLifecycleExecutor.java:387)
	at org.apache.maven.lifecycle.DefaultLifecycleExecutor.executeTaskSegments(DefaultLifecycleExecutor.java:348)
	at org.apache.maven.lifecycle.DefaultLifecycleExecutor.execute(DefaultLifecycleExecutor.java:180)
	at org.apache.maven.DefaultMaven.doExecute(DefaultMaven.java:328)
	at org.apache.maven.DefaultMaven.execute(DefaultMaven.java:138)
	at org.apache.maven.cli.MavenCli.main(MavenCli.java:362)
	at org.apache.maven.cli.compat.CompatibleMain.main(CompatibleMain.java:60)
	at sun.reflect.NativeMethodAccessorImpl.invoke0(Native Method)
	at sun.reflect.NativeMethodAccessorImpl.invoke(NativeMethodAccessorImpl.java:39)
	at sun.reflect.DelegatingMethodAccessorImpl.invoke(DelegatingMethodAccessorImpl.java:25)
	at java.lang.reflect.Method.invoke(Method.java:592)
	at org.codehaus.classworlds.Launcher.launchEnhanced(Launcher.java:315)
	at org.codehaus.classworlds.Launcher.launch(Launcher.java:255)
	at org.codehaus.classworlds.Launcher.mainWithExitCode(Launcher.java:430)
	at org.codehaus.classworlds.Launcher.main(Launcher.java:375)
Caused by: org.apache.maven.plugin.MojoFailureException: 1 build failed.
	at org.apache.maven.plugin.invoker.InvokerSession.handleFailures(InvokerSession.java:244)
	at org.apache.maven.plugin.invoker.InvokerMojo.processResults(InvokerMojo.java:58)
	at org.apache.maven.plugin.invoker.AbstractInvokerMojo.execute(AbstractInvokerMojo.java:601)
	at org.apache.maven.plugin.DefaultPluginManager.executeMojo(DefaultPluginManager.java:490)
	at org.apache.maven.lifecycle.DefaultLifecycleExecutor.executeGoals(DefaultLifecycleExecutor.java:694)
	... 17 more
[INFO] ------------------------------------------------------------------------
[INFO] BUILD ERRORS
[INFO] ------------------------------------------------------------------------
[INFO] Total time: 78 minutes 7 seconds
[INFO] Finished at: Wed Nov 17 02:22:49 CST 2010
[INFO] Final Memory: 110M/207M
[INFO] ------------------------------------------------------------------------


Build failed in Hudson: maven-plugins-ITs » java-5x,ubuntu #549

Posted by "GRiD .ORG" <bu...@lists.sonatype.com>.
See <https://grid.sonatype.org/ci/job/maven-plugins-ITs/./jdk=java-5x,label=ubuntu/549/changes>

Changes:

[Olivier Lamy] [MRAR-27] Add @threadSafe support for maven3

[Olivier Lamy] upgrade parent version
some other librairies p-u maven-archiver to prepare to add  @threadSafe

[Olivier Lamy] upgrade invoker plugin version

[Olivier Lamy] upgrade to last maven-parent version 17

------------------------------------------
[...truncated 5704 lines...]
Tests run: 6, Failures: 0, Errors: 0, Skipped: 0, Time elapsed: 0.209 sec
Running org.apache.maven.plugin.war.util.PathSetTest
Tests run: 5, Failures: 0, Errors: 0, Skipped: 0, Time elapsed: 0.005 sec
Running org.apache.maven.plugin.war.util.WarUtilsTest
Tests run: 1, Failures: 0, Errors: 0, Skipped: 0, Time elapsed: 0.002 sec
Running org.apache.maven.plugin.war.overlay.OverlayManagerTest
Tests run: 5, Failures: 0, Errors: 0, Skipped: 0, Time elapsed: 0.177 sec
Running org.apache.maven.plugin.war.WarDependenciesAnalysisTest
[INFO] Exploding webapp
[INFO] Assembling webapp [maven-war-plugin-test] in [/opt/grid/slave/workspace/maven-plugins-ITs/jdk/java-5x/label/ubuntu/trunk/maven-war-plugin/target/test-classes/unit/dependenciesanalysis/test-dir/no-change]
[INFO] Processing war project
[INFO] Copying webapp resources [/opt/grid/slave/workspace/maven-plugins-ITs/jdk/java-5x/label/ubuntu/trunk/maven-war-plugin/target/test-classes/unit/dependenciesanalysis/test-dir/no-change-test-data/source]
[INFO] Webapp assembled in [5 msecs]
[INFO] Exploding webapp
[INFO] Assembling webapp [maven-war-plugin-test] in [/opt/grid/slave/workspace/maven-plugins-ITs/jdk/java-5x/label/ubuntu/trunk/maven-war-plugin/target/test-classes/unit/dependenciesanalysis/test-dir/no-change]
[INFO] Processing war project
[INFO] Copying webapp resources [/opt/grid/slave/workspace/maven-plugins-ITs/jdk/java-5x/label/ubuntu/trunk/maven-war-plugin/target/test-classes/unit/dependenciesanalysis/test-dir/no-change-test-data/source]
[INFO] Webapp assembled in [8 msecs]
[INFO] Exploding webapp
[INFO] Assembling webapp [maven-war-plugin-test] in [/opt/grid/slave/workspace/maven-plugins-ITs/jdk/java-5x/label/ubuntu/trunk/maven-war-plugin/target/test-classes/unit/dependenciesanalysis/test-dir/remove-dependency]
[INFO] Processing war project
[INFO] Copying webapp resources [/opt/grid/slave/workspace/maven-plugins-ITs/jdk/java-5x/label/ubuntu/trunk/maven-war-plugin/target/test-classes/unit/dependenciesanalysis/test-dir/remove-dependency-test-data/source]
[INFO] Webapp assembled in [5 msecs]
[INFO] Exploding webapp
[INFO] Assembling webapp [maven-war-plugin-test] in [/opt/grid/slave/workspace/maven-plugins-ITs/jdk/java-5x/label/ubuntu/trunk/maven-war-plugin/target/test-classes/unit/dependenciesanalysis/test-dir/remove-dependency]
[INFO] Dependency [Dependency {groupId=org.sample.jar, artifactId=lib-test, version=1.0, type=jar}] has been removed from the project.
[INFO] Processing war project
[INFO] Copying webapp resources [/opt/grid/slave/workspace/maven-plugins-ITs/jdk/java-5x/label/ubuntu/trunk/maven-war-plugin/target/test-classes/unit/dependenciesanalysis/test-dir/remove-dependency-test-data/source]
[INFO] Webapp assembled in [2 msecs]
[INFO] Exploding webapp
[INFO] Assembling webapp [maven-war-plugin-test] in [/opt/grid/slave/workspace/maven-plugins-ITs/jdk/java-5x/label/ubuntu/trunk/maven-war-plugin/target/test-classes/unit/dependenciesanalysis/test-dir/dependency-update-version]
[INFO] Processing war project
[INFO] Copying webapp resources [/opt/grid/slave/workspace/maven-plugins-ITs/jdk/java-5x/label/ubuntu/trunk/maven-war-plugin/target/test-classes/unit/dependenciesanalysis/test-dir/dependency-update-version-test-data/source]
[INFO] Webapp assembled in [4 msecs]
[INFO] Exploding webapp
[INFO] Assembling webapp [maven-war-plugin-test] in [/opt/grid/slave/workspace/maven-plugins-ITs/jdk/java-5x/label/ubuntu/trunk/maven-war-plugin/target/test-classes/unit/dependenciesanalysis/test-dir/dependency-update-version]
[INFO] Version of dependency [Dependency {groupId=org.sample.jar, artifactId=lib-test, version=2.0, type=jar}] has changed (1.0 -> 2.0).
[INFO] Processing war project
[INFO] Copying webapp resources [/opt/grid/slave/workspace/maven-plugins-ITs/jdk/java-5x/label/ubuntu/trunk/maven-war-plugin/target/test-classes/unit/dependenciesanalysis/test-dir/dependency-update-version-test-data/source]
[INFO] Webapp assembled in [4 msecs]
[INFO] Exploding webapp
[INFO] Assembling webapp [maven-war-plugin-test] in [/opt/grid/slave/workspace/maven-plugins-ITs/jdk/java-5x/label/ubuntu/trunk/maven-war-plugin/target/test-classes/unit/dependenciesanalysis/test-dir/dependency-now-provided]
[INFO] Processing war project
[INFO] Copying webapp resources [/opt/grid/slave/workspace/maven-plugins-ITs/jdk/java-5x/label/ubuntu/trunk/maven-war-plugin/target/test-classes/unit/dependenciesanalysis/test-dir/dependency-now-provided-test-data/source]
[INFO] Webapp assembled in [6 msecs]
[INFO] Exploding webapp
[INFO] Assembling webapp [maven-war-plugin-test] in [/opt/grid/slave/workspace/maven-plugins-ITs/jdk/java-5x/label/ubuntu/trunk/maven-war-plugin/target/test-classes/unit/dependenciesanalysis/test-dir/dependency-now-provided]
[INFO] Scope of dependency [Dependency {groupId=org.sample.jar, artifactId=lib-test, version=1.0, type=jar}] has changed (runtime -> provided).
[INFO] Processing war project
[INFO] Copying webapp resources [/opt/grid/slave/workspace/maven-plugins-ITs/jdk/java-5x/label/ubuntu/trunk/maven-war-plugin/target/test-classes/unit/dependenciesanalysis/test-dir/dependency-now-provided-test-data/source]
[INFO] Webapp assembled in [2 msecs]
Tests run: 4, Failures: 0, Errors: 0, Skipped: 0, Time elapsed: 0.284 sec

Results :

Tests run: 83, Failures: 0, Errors: 0, Skipped: 0

[INFO] [jar:jar {execution: default-jar}]
[INFO] Building jar: /opt/grid/slave/workspace/maven-plugins-ITs/jdk/java-5x/label/ubuntu/trunk/maven-war-plugin/target/maven-war-plugin-2.2-SNAPSHOT.jar
[INFO] [plugin:addPluginArtifactMetadata {execution: default-addPluginArtifactMetadata}]
[INFO] [invoker:install {execution: integration-test}]
[INFO] Installing /opt/grid/slave/workspace/maven-plugins-ITs/jdk/java-5x/label/ubuntu/trunk/maven-war-plugin/pom.xml to /opt/grid/slave/workspace/maven-plugins-ITs/jdk/java-5x/label/ubuntu/trunk/maven-war-plugin/target/local-repo/org/apache/maven/plugins/maven-war-plugin/2.2-SNAPSHOT/maven-war-plugin-2.2-SNAPSHOT.pom
[INFO] Installing /opt/grid/slave/workspace/maven-plugins-ITs/jdk/java-5x/label/ubuntu/trunk/maven-war-plugin/target/maven-war-plugin-2.2-SNAPSHOT.jar to /opt/grid/slave/workspace/maven-plugins-ITs/jdk/java-5x/label/ubuntu/trunk/maven-war-plugin/target/local-repo/org/apache/maven/plugins/maven-war-plugin/2.2-SNAPSHOT/maven-war-plugin-2.2-SNAPSHOT.jar
[INFO] [invoker:run {execution: integration-test}]
[INFO] Building: MWAR-143/pom.xml
[INFO] ..SUCCESS (19.6 s)
[INFO] Building: scoped-dependency-same-artifact/pom.xml
[INFO] ..SUCCESS (5.5 s)
[INFO] Building: MWAR-96/pom.xml
[INFO] ..SUCCESS (3.7 s)
[INFO] Building: MWAR-62/pom.xml
[INFO] ..SUCCESS (2.7 s)
[INFO] Building: MWAR-129/pom.xml
[INFO] ..SUCCESS (2.7 s)
[INFO] Building: simple-war-no-webxml/pom.xml
[INFO] ..SUCCESS (4.6 s)
[INFO] Building: simple-war-project/pom.xml
[INFO] ..SUCCESS (3.5 s)
[INFO] Building: MWAR-139/pom.xml
[INFO] ..SUCCESS (3.7 s)
[INFO] Building: web-resources-filtering/pom.xml
[INFO] ..SUCCESS (5.3 s)
[INFO] Building: MWAR-131/pom.xml
[INFO] ..SUCCESS (21.2 s)
[INFO] Building: default/pom.xml
[INFO] ..SUCCESS (6.2 s)
[INFO] Building: MWAR-133/pom.xml
[INFO] ..SUCCESS (2.7 s)
[INFO] ---------------------------------------
[INFO] Execution Summary:
[INFO]   Builds Passing: 12
[INFO]   Builds Failing: 0
[INFO]   Builds Skipped: 0
[INFO] ---------------------------------------
[INFO] [install:install {execution: default-install}]
[INFO] Installing /opt/grid/slave/workspace/maven-plugins-ITs/jdk/java-5x/label/ubuntu/trunk/maven-war-plugin/target/maven-war-plugin-2.2-SNAPSHOT.jar to <https://grid.sonatype.org/ci/job/maven-plugins-ITs/./jdk=java-5x,label=ubuntu/ws/.repository/org/apache/maven/plugins/maven-war-plugin/2.2-SNAPSHOT/maven-war-plugin-2.2-SNAPSHOT.jar>
[INFO] [deploy:deploy {execution: default-deploy}]
[INFO] Retrieving previous build number from apache.snapshots.https
Uploading: http://repository.sonatype.org:8081/content/repositories/maven.snapshots/org/apache/maven/plugins/maven-war-plugin/2.2-SNAPSHOT/maven-war-plugin-2.2-20101114.070559-58.jar
75K uploaded  (maven-war-plugin-2.2-20101114.070559-58.jar)
[INFO] Retrieving previous metadata from apache.snapshots.https
[INFO] Uploading repository metadata for: 'artifact org.apache.maven.plugins:maven-war-plugin'
[INFO] Retrieving previous metadata from apache.snapshots.https
[INFO] Uploading repository metadata for: 'org.apache.maven.plugins'
[INFO] Uploading project information for maven-war-plugin 2.2-20101114.070559-58
[INFO] Retrieving previous metadata from apache.snapshots.https
[INFO] Uploading repository metadata for: 'snapshot org.apache.maven.plugins:maven-war-plugin:2.2-SNAPSHOT'
[INFO] ------------------------------------------------------------------------
[INFO] Building Maven Plugins Aggregator
[INFO]    task-segment: [clean, deploy]
[INFO] ------------------------------------------------------------------------
[INFO] [clean:clean {execution: default-clean}]
[INFO] Deleting file set: /opt/grid/slave/workspace/maven-plugins-ITs/jdk/java-5x/label/ubuntu/trunk/target (included: [**], excluded: [])
[INFO] [remote-resources:process {execution: default}]
[INFO] [site:attach-descriptor {execution: default-attach-descriptor}]
[INFO] [install:install {execution: default-install}]
[INFO] Installing /opt/grid/slave/workspace/maven-plugins-ITs/jdk/java-5x/label/ubuntu/trunk/pom.xml to <https://grid.sonatype.org/ci/job/maven-plugins-ITs/./jdk=java-5x,label=ubuntu/ws/.repository/org/apache/maven/plugins/maven-plugins-aggregator/1-SNAPSHOT/maven-plugins-aggregator-1-SNAPSHOT.pom>
[INFO] [deploy:deploy {execution: default-deploy}]
[INFO] Retrieving previous build number from apache.snapshots.https
Uploading: http://repository.sonatype.org:8081/content/repositories/maven.snapshots/org/apache/maven/plugins/maven-plugins-aggregator/1-SNAPSHOT/maven-plugins-aggregator-1-20101114.070559-105.pom
3K uploaded  (maven-plugins-aggregator-1-20101114.070559-105.pom)
[INFO] Retrieving previous metadata from apache.snapshots.https
[INFO] Uploading repository metadata for: 'artifact org.apache.maven.plugins:maven-plugins-aggregator'
[INFO] Retrieving previous metadata from apache.snapshots.https
[INFO] Uploading repository metadata for: 'snapshot org.apache.maven.plugins:maven-plugins-aggregator:1-SNAPSHOT'
[INFO] 
[INFO] 
[INFO] ------------------------------------------------------------------------
[INFO] Reactor Summary:
[INFO] ------------------------------------------------------------------------
[INFO] Maven Plugins ......................................... SUCCESS [5:47.195s]
[INFO] Maven Invoker Plugin .................................. SUCCESS [5:02.367s]
[INFO] Maven Ant Plugin ...................................... SUCCESS [2:07.641s]
[INFO] Maven AntRun Plugin ................................... SUCCESS [1:19.511s]
[INFO] Maven Eclipse Plugin .................................. SUCCESS [7:18.318s]
[INFO] Maven Changelog Plugin ................................ SUCCESS [34.593s]
[INFO] Maven Changes Report Plugin ........................... SUCCESS [1:06.754s]
[INFO] Maven Checkstyle Plugin ............................... SUCCESS [1:57.127s]
[INFO] Maven Clean Plugin .................................... SUCCESS [18.690s]
[INFO] Maven Compiler Plugin ................................. SUCCESS [28.268s]
[INFO] Maven Dependency Plugin ............................... SUCCESS [4:06.845s]
[INFO] Maven Deploy Plugin ................................... SUCCESS [1:42.057s]
[INFO] Maven DOAP Plugin ..................................... SUCCESS [16.231s]
[INFO] Maven Documentation Checker Plugin .................... SUCCESS [24.268s]
[INFO] Maven EAR Plugin ...................................... FAILED [5:42.261s]
[INFO] Maven EJB Plugin ...................................... SUCCESS [54.724s]
[INFO] Maven GPG Plugin ...................................... SUCCESS [43.077s]
[INFO] Maven Help Plugin ..................................... SUCCESS [50.861s]
[INFO] Maven IDEA Plugin ..................................... SUCCESS [17.934s]
[INFO] Maven Install Plugin .................................. SUCCESS [1:33.083s]
[INFO] Maven JAR Plugin ...................................... SUCCESS [1:58.515s]
[INFO] Maven Jarsigner Plugin ................................ SUCCESS [58.151s]
[INFO] Maven Shade Plugin .................................... SUCCESS [2:42.577s]
[INFO] Maven Javadoc Plugin .................................. FAILED [4:53.111s]
[INFO] Maven Linkcheck Plugin ................................ SUCCESS [4.571s]
[INFO] Maven One Plugin ...................................... SUCCESS [3.133s]
[INFO] Maven Patch Plugin .................................... SUCCESS [19.986s]
[INFO] Maven PDF Plugin ...................................... SUCCESS [11:01.288s]
[INFO] Maven PMD Plugin ...................................... SUCCESS [44.580s]
[INFO] Maven RAR Plugin ...................................... SUCCESS [16.284s]
[INFO] Maven Reactor Plugin .................................. SUCCESS [4.325s]
[INFO] Maven Repository Plugin ............................... SUCCESS [1:10.880s]
[INFO] Maven Resources Plugin ................................ SUCCESS [1:05.922s]
[INFO] Maven Site Plugin ..................................... SUCCESS [6:14.120s]
[INFO] Maven Source Plugin ................................... SUCCESS [45.603s]
[INFO] Maven Stage Plugin .................................... SUCCESS [3.508s]
[INFO] Maven Toolchains Plugin ............................... SUCCESS [4.206s]
[INFO] Maven Verifier Plugin ................................. SUCCESS [12.940s]
[INFO] Maven WAR Plugin ...................................... SUCCESS [1:44.436s]
[INFO] Maven Plugins Aggregator .............................. SUCCESS [1.086s]
[INFO] ------------------------------------------------------------------------
[INFO] Error for project: Maven EAR Plugin (during deploy)
[INFO] ------------------------------------------------------------------------
[INFO] There are test failures.

Please refer to /opt/grid/slave/workspace/maven-plugins-ITs/jdk/java-5x/label/ubuntu/trunk/maven-ear-plugin/target/surefire-reports for the individual test results.
[INFO] ------------------------------------------------------------------------
[INFO] Trace
org.apache.maven.BuildFailureException: There are test failures.

Please refer to /opt/grid/slave/workspace/maven-plugins-ITs/jdk/java-5x/label/ubuntu/trunk/maven-ear-plugin/target/surefire-reports for the individual test results.
	at org.apache.maven.lifecycle.DefaultLifecycleExecutor.executeGoals(DefaultLifecycleExecutor.java:715)
	at org.apache.maven.lifecycle.DefaultLifecycleExecutor.executeGoalWithLifecycle(DefaultLifecycleExecutor.java:556)
	at org.apache.maven.lifecycle.DefaultLifecycleExecutor.executeGoal(DefaultLifecycleExecutor.java:535)
	at org.apache.maven.lifecycle.DefaultLifecycleExecutor.executeGoalAndHandleFailures(DefaultLifecycleExecutor.java:387)
	at org.apache.maven.lifecycle.DefaultLifecycleExecutor.executeTaskSegments(DefaultLifecycleExecutor.java:348)
	at org.apache.maven.lifecycle.DefaultLifecycleExecutor.execute(DefaultLifecycleExecutor.java:180)
	at org.apache.maven.DefaultMaven.doExecute(DefaultMaven.java:328)
	at org.apache.maven.DefaultMaven.execute(DefaultMaven.java:138)
	at org.apache.maven.cli.MavenCli.main(MavenCli.java:362)
	at org.apache.maven.cli.compat.CompatibleMain.main(CompatibleMain.java:60)
	at sun.reflect.NativeMethodAccessorImpl.invoke0(Native Method)
	at sun.reflect.NativeMethodAccessorImpl.invoke(NativeMethodAccessorImpl.java:39)
	at sun.reflect.DelegatingMethodAccessorImpl.invoke(DelegatingMethodAccessorImpl.java:25)
	at java.lang.reflect.Method.invoke(Method.java:592)
	at org.codehaus.classworlds.Launcher.launchEnhanced(Launcher.java:315)
	at org.codehaus.classworlds.Launcher.launch(Launcher.java:255)
	at org.codehaus.classworlds.Launcher.mainWithExitCode(Launcher.java:430)
	at org.codehaus.classworlds.Launcher.main(Launcher.java:375)
Caused by: org.apache.maven.plugin.MojoFailureException: There are test failures.

Please refer to /opt/grid/slave/workspace/maven-plugins-ITs/jdk/java-5x/label/ubuntu/trunk/maven-ear-plugin/target/surefire-reports for the individual test results.
	at org.apache.maven.plugin.surefire.SurefirePlugin.execute(SurefirePlugin.java:575)
	at org.apache.maven.plugin.DefaultPluginManager.executeMojo(DefaultPluginManager.java:490)
	at org.apache.maven.lifecycle.DefaultLifecycleExecutor.executeGoals(DefaultLifecycleExecutor.java:694)
	... 17 more
[INFO] ------------------------------------------------------------------------
[INFO] Error for project: Maven Javadoc Plugin (during deploy)
[INFO] ------------------------------------------------------------------------
[INFO] There are test failures.

Please refer to /opt/grid/slave/workspace/maven-plugins-ITs/jdk/java-5x/label/ubuntu/trunk/maven-javadoc-plugin/target/surefire-reports for the individual test results.
[INFO] ------------------------------------------------------------------------
[INFO] Trace
org.apache.maven.BuildFailureException: There are test failures.

Please refer to /opt/grid/slave/workspace/maven-plugins-ITs/jdk/java-5x/label/ubuntu/trunk/maven-javadoc-plugin/target/surefire-reports for the individual test results.
	at org.apache.maven.lifecycle.DefaultLifecycleExecutor.executeGoals(DefaultLifecycleExecutor.java:715)
	at org.apache.maven.lifecycle.DefaultLifecycleExecutor.executeGoalWithLifecycle(DefaultLifecycleExecutor.java:556)
	at org.apache.maven.lifecycle.DefaultLifecycleExecutor.executeGoal(DefaultLifecycleExecutor.java:535)
	at org.apache.maven.lifecycle.DefaultLifecycleExecutor.executeGoalAndHandleFailures(DefaultLifecycleExecutor.java:387)
	at org.apache.maven.lifecycle.DefaultLifecycleExecutor.executeTaskSegments(DefaultLifecycleExecutor.java:348)
	at org.apache.maven.lifecycle.DefaultLifecycleExecutor.execute(DefaultLifecycleExecutor.java:180)
	at org.apache.maven.DefaultMaven.doExecute(DefaultMaven.java:328)
	at org.apache.maven.DefaultMaven.execute(DefaultMaven.java:138)
	at org.apache.maven.cli.MavenCli.main(MavenCli.java:362)
	at org.apache.maven.cli.compat.CompatibleMain.main(CompatibleMain.java:60)
	at sun.reflect.NativeMethodAccessorImpl.invoke0(Native Method)
	at sun.reflect.NativeMethodAccessorImpl.invoke(NativeMethodAccessorImpl.java:39)
	at sun.reflect.DelegatingMethodAccessorImpl.invoke(DelegatingMethodAccessorImpl.java:25)
	at java.lang.reflect.Method.invoke(Method.java:592)
	at org.codehaus.classworlds.Launcher.launchEnhanced(Launcher.java:315)
	at org.codehaus.classworlds.Launcher.launch(Launcher.java:255)
	at org.codehaus.classworlds.Launcher.mainWithExitCode(Launcher.java:430)
	at org.codehaus.classworlds.Launcher.main(Launcher.java:375)
Caused by: org.apache.maven.plugin.MojoFailureException: There are test failures.

Please refer to /opt/grid/slave/workspace/maven-plugins-ITs/jdk/java-5x/label/ubuntu/trunk/maven-javadoc-plugin/target/surefire-reports for the individual test results.
	at org.apache.maven.plugin.surefire.SurefirePlugin.execute(SurefirePlugin.java:575)
	at org.apache.maven.plugin.DefaultPluginManager.executeMojo(DefaultPluginManager.java:490)
	at org.apache.maven.lifecycle.DefaultLifecycleExecutor.executeGoals(DefaultLifecycleExecutor.java:694)
	... 17 more
[INFO] ------------------------------------------------------------------------
[INFO] BUILD ERRORS
[INFO] ------------------------------------------------------------------------
[INFO] Total time: 77 minutes 3 seconds
[INFO] Finished at: Sun Nov 14 02:22:53 CST 2010
[INFO] Final Memory: 111M/208M
[INFO] ------------------------------------------------------------------------


Build failed in Hudson: maven-plugins-ITs » java-5x,ubuntu #548

Posted by "GRiD .ORG" <bu...@lists.sonatype.com>.
See <https://grid.sonatype.org/ci/job/maven-plugins-ITs/./jdk=java-5x,label=ubuntu/548/changes>

Changes:

[Dennis Lundberg] [MASSEMBLY-516] Fix documentation for shared descriptors.

o Add notes for users who have used previous versions of this example

------------------------------------------
[...truncated 6135 lines...]
[INFO] Webapp assembled in [3 msecs]
[INFO] Exploding webapp
[INFO] Assembling webapp [maven-war-plugin-test] in [/opt/grid/slave/workspace/maven-plugins-ITs/jdk/java-5x/label/ubuntu/trunk/maven-war-plugin/target/test-classes/unit/warexplodedmojo/test-dir/ExplodedWar_WithSourceIncludeExclude]
[INFO] Processing war project
[INFO] Copying webapp resources [/opt/grid/slave/workspace/maven-plugins-ITs/jdk/java-5x/label/ubuntu/trunk/maven-war-plugin/target/test-classes/unit/warexplodedmojo/test-dir/ExplodedWar_WithSourceIncludeExclude-test-data/source]
[INFO] Webapp assembled in [8 msecs]
[INFO] Exploding webapp
[INFO] Assembling webapp [maven-war-plugin-test] in [/opt/grid/slave/workspace/maven-plugins-ITs/jdk/java-5x/label/ubuntu/trunk/maven-war-plugin/target/test-classes/unit/warexplodedmojo/test-dir/ExplodedWar_WithWarDependencyIncludeExclude]
[INFO] Processing war project
[INFO] Copying webapp resources [/opt/grid/slave/workspace/maven-plugins-ITs/jdk/java-5x/label/ubuntu/trunk/maven-war-plugin/target/test-classes/unit/warexplodedmojo/test-dir/ExplodedWar_WithWarDependencyIncludeExclude-test-data/source]
[INFO] Processing overlay [ id wartests:war-include-exclude]
[INFO] Webapp assembled in [10 msecs]
[INFO] Exploding webapp
[INFO] Assembling webapp [maven-war-plugin-test] in [/opt/grid/slave/workspace/maven-plugins-ITs/jdk/java-5x/label/ubuntu/trunk/maven-war-plugin/target/test-classes/unit/warexplodedmojo/test-dir/ExplodedWarWithSourceModificationCheck]
[INFO] Processing war project
[INFO] Copying webapp resources [/opt/grid/slave/workspace/maven-plugins-ITs/jdk/java-5x/label/ubuntu/trunk/maven-war-plugin/target/test-classes/unit/warexplodedmojo/test-dir/ExplodedWarWithSourceModificationCheck-test-data/source]
[INFO] Webapp assembled in [3 msecs]
[INFO] Exploding webapp
[INFO] Assembling webapp [maven-war-plugin-test] in [/opt/grid/slave/workspace/maven-plugins-ITs/jdk/java-5x/label/ubuntu/trunk/maven-war-plugin/target/test-classes/unit/warexplodedmojo/test-dir/ExplodedWarWithFileNameMapping]
[INFO] Processing war project
[INFO] Copying webapp resources [/opt/grid/slave/workspace/maven-plugins-ITs/jdk/java-5x/label/ubuntu/trunk/maven-war-plugin/target/test-classes/unit/warexplodedmojo/test-dir/ExplodedWarWithFileNameMapping-test-data/source]
[INFO] Webapp assembled in [3 msecs]
[INFO] Exploding webapp
[INFO] Assembling webapp [maven-war-plugin-test] in [/opt/grid/slave/workspace/maven-plugins-ITs/jdk/java-5x/label/ubuntu/trunk/maven-war-plugin/target/test-classes/unit/warexplodedmojo/test-dir/ExplodedWarWithFileNameMappingAndDuplicateDependencies]
[INFO] Processing war project
[INFO] Copying webapp resources [/opt/grid/slave/workspace/maven-plugins-ITs/jdk/java-5x/label/ubuntu/trunk/maven-war-plugin/target/test-classes/unit/warexplodedmojo/test-dir/ExplodedWarWithFileNameMappingAndDuplicateDependencies-test-data/source]
[INFO] Webapp assembled in [3 msecs]
Tests run: 21, Failures: 0, Errors: 0, Skipped: 0, Time elapsed: 1.75 sec
Running org.apache.maven.plugin.war.WarInPlaceMojoTest
[INFO] Generating webapp in source directory [/opt/grid/slave/workspace/maven-plugins-ITs/jdk/java-5x/label/ubuntu/trunk/maven-war-plugin/target/test-classes/unit/warexplodedinplacemojo/test-dir/SimpleExplodedInplaceWar-test-data/source]
[INFO] Assembling webapp [maven-war-plugin-test] in [/opt/grid/slave/workspace/maven-plugins-ITs/jdk/java-5x/label/ubuntu/trunk/maven-war-plugin/target/test-classes/unit/warexplodedinplacemojo/test-dir/SimpleExplodedInplaceWar-test-data/source]
[INFO] Processing war project
[INFO] Copying webapp webResources [/opt/grid/slave/workspace/maven-plugins-ITs/jdk/java-5x/label/ubuntu/trunk/maven-war-plugin/target/test-classes/unit/warexplodedinplacemojo/test-dir/resources] to [/opt/grid/slave/workspace/maven-plugins-ITs/jdk/java-5x/label/ubuntu/trunk/maven-war-plugin/target/test-classes/unit/warexplodedinplacemojo/test-dir/SimpleExplodedInplaceWar-test-data/source]
[INFO] Webapp assembled in [1 msecs]
Tests run: 2, Failures: 0, Errors: 0, Skipped: 0, Time elapsed: 0.064 sec
Running org.apache.maven.plugin.war.WarManifestMojoTest
Tests run: 6, Failures: 0, Errors: 0, Skipped: 0, Time elapsed: 0.193 sec
Running org.apache.maven.plugin.war.util.PathSetTest
Tests run: 5, Failures: 0, Errors: 0, Skipped: 0, Time elapsed: 0.006 sec
Running org.apache.maven.plugin.war.util.WarUtilsTest
Tests run: 1, Failures: 0, Errors: 0, Skipped: 0, Time elapsed: 0.002 sec
Running org.apache.maven.plugin.war.overlay.OverlayManagerTest
Tests run: 5, Failures: 0, Errors: 0, Skipped: 0, Time elapsed: 0.145 sec
Running org.apache.maven.plugin.war.WarDependenciesAnalysisTest
[INFO] Exploding webapp
[INFO] Assembling webapp [maven-war-plugin-test] in [/opt/grid/slave/workspace/maven-plugins-ITs/jdk/java-5x/label/ubuntu/trunk/maven-war-plugin/target/test-classes/unit/dependenciesanalysis/test-dir/no-change]
[INFO] Processing war project
[INFO] Copying webapp resources [/opt/grid/slave/workspace/maven-plugins-ITs/jdk/java-5x/label/ubuntu/trunk/maven-war-plugin/target/test-classes/unit/dependenciesanalysis/test-dir/no-change-test-data/source]
[INFO] Webapp assembled in [4 msecs]
[INFO] Exploding webapp
[INFO] Assembling webapp [maven-war-plugin-test] in [/opt/grid/slave/workspace/maven-plugins-ITs/jdk/java-5x/label/ubuntu/trunk/maven-war-plugin/target/test-classes/unit/dependenciesanalysis/test-dir/no-change]
[INFO] Processing war project
[INFO] Copying webapp resources [/opt/grid/slave/workspace/maven-plugins-ITs/jdk/java-5x/label/ubuntu/trunk/maven-war-plugin/target/test-classes/unit/dependenciesanalysis/test-dir/no-change-test-data/source]
[INFO] Webapp assembled in [3 msecs]
[INFO] Exploding webapp
[INFO] Assembling webapp [maven-war-plugin-test] in [/opt/grid/slave/workspace/maven-plugins-ITs/jdk/java-5x/label/ubuntu/trunk/maven-war-plugin/target/test-classes/unit/dependenciesanalysis/test-dir/remove-dependency]
[INFO] Processing war project
[INFO] Copying webapp resources [/opt/grid/slave/workspace/maven-plugins-ITs/jdk/java-5x/label/ubuntu/trunk/maven-war-plugin/target/test-classes/unit/dependenciesanalysis/test-dir/remove-dependency-test-data/source]
[INFO] Webapp assembled in [4 msecs]
[INFO] Exploding webapp
[INFO] Assembling webapp [maven-war-plugin-test] in [/opt/grid/slave/workspace/maven-plugins-ITs/jdk/java-5x/label/ubuntu/trunk/maven-war-plugin/target/test-classes/unit/dependenciesanalysis/test-dir/remove-dependency]
[INFO] Dependency [Dependency {groupId=org.sample.jar, artifactId=lib-test, version=1.0, type=jar}] has been removed from the project.
[INFO] Processing war project
[INFO] Copying webapp resources [/opt/grid/slave/workspace/maven-plugins-ITs/jdk/java-5x/label/ubuntu/trunk/maven-war-plugin/target/test-classes/unit/dependenciesanalysis/test-dir/remove-dependency-test-data/source]
[INFO] Webapp assembled in [2 msecs]
[INFO] Exploding webapp
[INFO] Assembling webapp [maven-war-plugin-test] in [/opt/grid/slave/workspace/maven-plugins-ITs/jdk/java-5x/label/ubuntu/trunk/maven-war-plugin/target/test-classes/unit/dependenciesanalysis/test-dir/dependency-update-version]
[INFO] Processing war project
[INFO] Copying webapp resources [/opt/grid/slave/workspace/maven-plugins-ITs/jdk/java-5x/label/ubuntu/trunk/maven-war-plugin/target/test-classes/unit/dependenciesanalysis/test-dir/dependency-update-version-test-data/source]
[INFO] Webapp assembled in [4 msecs]
[INFO] Exploding webapp
[INFO] Assembling webapp [maven-war-plugin-test] in [/opt/grid/slave/workspace/maven-plugins-ITs/jdk/java-5x/label/ubuntu/trunk/maven-war-plugin/target/test-classes/unit/dependenciesanalysis/test-dir/dependency-update-version]
[INFO] Version of dependency [Dependency {groupId=org.sample.jar, artifactId=lib-test, version=2.0, type=jar}] has changed (1.0 -> 2.0).
[INFO] Processing war project
[INFO] Copying webapp resources [/opt/grid/slave/workspace/maven-plugins-ITs/jdk/java-5x/label/ubuntu/trunk/maven-war-plugin/target/test-classes/unit/dependenciesanalysis/test-dir/dependency-update-version-test-data/source]
[INFO] Webapp assembled in [3 msecs]
[INFO] Exploding webapp
[INFO] Assembling webapp [maven-war-plugin-test] in [/opt/grid/slave/workspace/maven-plugins-ITs/jdk/java-5x/label/ubuntu/trunk/maven-war-plugin/target/test-classes/unit/dependenciesanalysis/test-dir/dependency-now-provided]
[INFO] Processing war project
[INFO] Copying webapp resources [/opt/grid/slave/workspace/maven-plugins-ITs/jdk/java-5x/label/ubuntu/trunk/maven-war-plugin/target/test-classes/unit/dependenciesanalysis/test-dir/dependency-now-provided-test-data/source]
[INFO] Webapp assembled in [10 msecs]
[INFO] Exploding webapp
[INFO] Assembling webapp [maven-war-plugin-test] in [/opt/grid/slave/workspace/maven-plugins-ITs/jdk/java-5x/label/ubuntu/trunk/maven-war-plugin/target/test-classes/unit/dependenciesanalysis/test-dir/dependency-now-provided]
[INFO] Scope of dependency [Dependency {groupId=org.sample.jar, artifactId=lib-test, version=1.0, type=jar}] has changed (runtime -> provided).
[INFO] Processing war project
[INFO] Copying webapp resources [/opt/grid/slave/workspace/maven-plugins-ITs/jdk/java-5x/label/ubuntu/trunk/maven-war-plugin/target/test-classes/unit/dependenciesanalysis/test-dir/dependency-now-provided-test-data/source]
[INFO] Webapp assembled in [3 msecs]
Tests run: 4, Failures: 0, Errors: 0, Skipped: 0, Time elapsed: 0.191 sec

Results :

Tests run: 83, Failures: 0, Errors: 0, Skipped: 0

[INFO] [jar:jar {execution: default-jar}]
[INFO] Building jar: /opt/grid/slave/workspace/maven-plugins-ITs/jdk/java-5x/label/ubuntu/trunk/maven-war-plugin/target/maven-war-plugin-2.2-SNAPSHOT.jar
[INFO] [plugin:addPluginArtifactMetadata {execution: default-addPluginArtifactMetadata}]
[INFO] [invoker:install {execution: integration-test}]
[INFO] Installing /opt/grid/slave/workspace/maven-plugins-ITs/jdk/java-5x/label/ubuntu/trunk/maven-war-plugin/pom.xml to /opt/grid/slave/workspace/maven-plugins-ITs/jdk/java-5x/label/ubuntu/trunk/maven-war-plugin/target/local-repo/org/apache/maven/plugins/maven-war-plugin/2.2-SNAPSHOT/maven-war-plugin-2.2-SNAPSHOT.pom
[INFO] Installing /opt/grid/slave/workspace/maven-plugins-ITs/jdk/java-5x/label/ubuntu/trunk/maven-war-plugin/target/maven-war-plugin-2.2-SNAPSHOT.jar to /opt/grid/slave/workspace/maven-plugins-ITs/jdk/java-5x/label/ubuntu/trunk/maven-war-plugin/target/local-repo/org/apache/maven/plugins/maven-war-plugin/2.2-SNAPSHOT/maven-war-plugin-2.2-SNAPSHOT.jar
[INFO] [invoker:run {execution: integration-test}]
[INFO] Building: MWAR-143/pom.xml
[INFO] ..SUCCESS (20.1 s)
[INFO] Building: scoped-dependency-same-artifact/pom.xml
[INFO] ..SUCCESS (5.6 s)
[INFO] Building: MWAR-96/pom.xml
[INFO] ..SUCCESS (3.9 s)
[INFO] Building: MWAR-62/pom.xml
[INFO] ..SUCCESS (2.8 s)
[INFO] Building: MWAR-129/pom.xml
[INFO] ..SUCCESS (3.2 s)
[INFO] Building: simple-war-no-webxml/pom.xml
[INFO] ..SUCCESS (4.7 s)
[INFO] Building: simple-war-project/pom.xml
[INFO] ..SUCCESS (3.7 s)
[INFO] Building: MWAR-139/pom.xml
[INFO] ..SUCCESS (3.9 s)
[INFO] Building: web-resources-filtering/pom.xml
[INFO] ..SUCCESS (5.3 s)
[INFO] Building: MWAR-131/pom.xml
[INFO] ..SUCCESS (22.4 s)
[INFO] Building: default/pom.xml
[INFO] ..SUCCESS (10.7 s)
[INFO] Building: MWAR-133/pom.xml
[INFO] ..SUCCESS (3.2 s)
[INFO] ---------------------------------------
[INFO] Execution Summary:
[INFO]   Builds Passing: 12
[INFO]   Builds Failing: 0
[INFO]   Builds Skipped: 0
[INFO] ---------------------------------------
[INFO] [install:install {execution: default-install}]
[INFO] Installing /opt/grid/slave/workspace/maven-plugins-ITs/jdk/java-5x/label/ubuntu/trunk/maven-war-plugin/target/maven-war-plugin-2.2-SNAPSHOT.jar to <https://grid.sonatype.org/ci/job/maven-plugins-ITs/./jdk=java-5x,label=ubuntu/ws/.repository/org/apache/maven/plugins/maven-war-plugin/2.2-SNAPSHOT/maven-war-plugin-2.2-SNAPSHOT.jar>
[INFO] [deploy:deploy {execution: default-deploy}]
[INFO] Retrieving previous build number from apache.snapshots.https
Uploading: http://repository.sonatype.org:8081/content/repositories/maven.snapshots/org/apache/maven/plugins/maven-war-plugin/2.2-SNAPSHOT/maven-war-plugin-2.2-20101112.070556-57.jar
75K uploaded  (maven-war-plugin-2.2-20101112.070556-57.jar)
[INFO] Retrieving previous metadata from apache.snapshots.https
[INFO] Uploading repository metadata for: 'artifact org.apache.maven.plugins:maven-war-plugin'
[INFO] Retrieving previous metadata from apache.snapshots.https
[INFO] Uploading repository metadata for: 'org.apache.maven.plugins'
[INFO] Uploading project information for maven-war-plugin 2.2-20101112.070556-57
[INFO] Retrieving previous metadata from apache.snapshots.https
[INFO] Uploading repository metadata for: 'snapshot org.apache.maven.plugins:maven-war-plugin:2.2-SNAPSHOT'
[INFO] ------------------------------------------------------------------------
[INFO] Building Maven Plugins Aggregator
[INFO]    task-segment: [clean, deploy]
[INFO] ------------------------------------------------------------------------
[INFO] [clean:clean {execution: default-clean}]
[INFO] Deleting file set: /opt/grid/slave/workspace/maven-plugins-ITs/jdk/java-5x/label/ubuntu/trunk/target (included: [**], excluded: [])
[INFO] [remote-resources:process {execution: default}]
[INFO] [site:attach-descriptor {execution: default-attach-descriptor}]
[INFO] [install:install {execution: default-install}]
[INFO] Installing /opt/grid/slave/workspace/maven-plugins-ITs/jdk/java-5x/label/ubuntu/trunk/pom.xml to <https://grid.sonatype.org/ci/job/maven-plugins-ITs/./jdk=java-5x,label=ubuntu/ws/.repository/org/apache/maven/plugins/maven-plugins-aggregator/1-SNAPSHOT/maven-plugins-aggregator-1-SNAPSHOT.pom>
[INFO] [deploy:deploy {execution: default-deploy}]
[INFO] Retrieving previous build number from apache.snapshots.https
Uploading: http://repository.sonatype.org:8081/content/repositories/maven.snapshots/org/apache/maven/plugins/maven-plugins-aggregator/1-SNAPSHOT/maven-plugins-aggregator-1-20101112.070556-104.pom
3K uploaded  (maven-plugins-aggregator-1-20101112.070556-104.pom)
[INFO] Retrieving previous metadata from apache.snapshots.https
[INFO] Uploading repository metadata for: 'artifact org.apache.maven.plugins:maven-plugins-aggregator'
[INFO] Retrieving previous metadata from apache.snapshots.https
[INFO] Uploading repository metadata for: 'snapshot org.apache.maven.plugins:maven-plugins-aggregator:1-SNAPSHOT'
[INFO] 
[INFO] 
[INFO] ------------------------------------------------------------------------
[INFO] Reactor Summary:
[INFO] ------------------------------------------------------------------------
[INFO] Maven Plugins ......................................... SUCCESS [23.072s]
[INFO] Maven Invoker Plugin .................................. SUCCESS [4:59.848s]
[INFO] Maven Ant Plugin ...................................... SUCCESS [2:08.809s]
[INFO] Maven AntRun Plugin ................................... SUCCESS [1:37.648s]
[INFO] Maven Eclipse Plugin .................................. SUCCESS [8:43.970s]
[INFO] Maven Changelog Plugin ................................ SUCCESS [37.010s]
[INFO] Maven Changes Report Plugin ........................... SUCCESS [1:06.602s]
[INFO] Maven Checkstyle Plugin ............................... SUCCESS [2:03.423s]
[INFO] Maven Clean Plugin .................................... SUCCESS [24.366s]
[INFO] Maven Compiler Plugin ................................. SUCCESS [33.017s]
[INFO] Maven Dependency Plugin ............................... SUCCESS [4:11.000s]
[INFO] Maven Deploy Plugin ................................... SUCCESS [1:54.409s]
[INFO] Maven DOAP Plugin ..................................... SUCCESS [26.745s]
[INFO] Maven Documentation Checker Plugin .................... SUCCESS [29.045s]
[INFO] Maven EAR Plugin ...................................... FAILED [7:47.958s]
[INFO] Maven EJB Plugin ...................................... SUCCESS [58.746s]
[INFO] Maven GPG Plugin ...................................... SUCCESS [42.408s]
[INFO] Maven Help Plugin ..................................... SUCCESS [47.125s]
[INFO] Maven IDEA Plugin ..................................... SUCCESS [18.300s]
[INFO] Maven Install Plugin .................................. SUCCESS [1:30.662s]
[INFO] Maven JAR Plugin ...................................... SUCCESS [2:01.348s]
[INFO] Maven Jarsigner Plugin ................................ SUCCESS [59.303s]
[INFO] Maven Shade Plugin .................................... SUCCESS [2:45.813s]
[INFO] Maven Javadoc Plugin .................................. SUCCESS [22:51.694s]
[INFO] Maven Linkcheck Plugin ................................ SUCCESS [7.495s]
[INFO] Maven One Plugin ...................................... SUCCESS [8.236s]
[INFO] Maven Patch Plugin .................................... SUCCESS [27.466s]
[INFO] Maven PDF Plugin ...................................... SUCCESS [1:18.984s]
[INFO] Maven PMD Plugin ...................................... SUCCESS [2:15.577s]
[INFO] Maven RAR Plugin ...................................... SUCCESS [2:29.441s]
[INFO] Maven Reactor Plugin .................................. SUCCESS [1:54.359s]
[INFO] Maven Repository Plugin ............................... SUCCESS [1:17.885s]
[INFO] Maven Resources Plugin ................................ SUCCESS [1:03.740s]
[INFO] Maven Site Plugin ..................................... SUCCESS [8:36.331s]
[INFO] Maven Source Plugin ................................... SUCCESS [41.941s]
[INFO] Maven Stage Plugin .................................... SUCCESS [3.384s]
[INFO] Maven Toolchains Plugin ............................... SUCCESS [4.297s]
[INFO] Maven Verifier Plugin ................................. SUCCESS [13.157s]
[INFO] Maven WAR Plugin ...................................... SUCCESS [1:52.573s]
[INFO] Maven Plugins Aggregator .............................. SUCCESS [2.616s]
[INFO] ------------------------------------------------------------------------
[INFO] Error for project: Maven EAR Plugin (during deploy)
[INFO] ------------------------------------------------------------------------
[INFO] There are test failures.

Please refer to /opt/grid/slave/workspace/maven-plugins-ITs/jdk/java-5x/label/ubuntu/trunk/maven-ear-plugin/target/surefire-reports for the individual test results.
[INFO] ------------------------------------------------------------------------
[INFO] Trace
org.apache.maven.BuildFailureException: There are test failures.

Please refer to /opt/grid/slave/workspace/maven-plugins-ITs/jdk/java-5x/label/ubuntu/trunk/maven-ear-plugin/target/surefire-reports for the individual test results.
	at org.apache.maven.lifecycle.DefaultLifecycleExecutor.executeGoals(DefaultLifecycleExecutor.java:715)
	at org.apache.maven.lifecycle.DefaultLifecycleExecutor.executeGoalWithLifecycle(DefaultLifecycleExecutor.java:556)
	at org.apache.maven.lifecycle.DefaultLifecycleExecutor.executeGoal(DefaultLifecycleExecutor.java:535)
	at org.apache.maven.lifecycle.DefaultLifecycleExecutor.executeGoalAndHandleFailures(DefaultLifecycleExecutor.java:387)
	at org.apache.maven.lifecycle.DefaultLifecycleExecutor.executeTaskSegments(DefaultLifecycleExecutor.java:348)
	at org.apache.maven.lifecycle.DefaultLifecycleExecutor.execute(DefaultLifecycleExecutor.java:180)
	at org.apache.maven.DefaultMaven.doExecute(DefaultMaven.java:328)
	at org.apache.maven.DefaultMaven.execute(DefaultMaven.java:138)
	at org.apache.maven.cli.MavenCli.main(MavenCli.java:362)
	at org.apache.maven.cli.compat.CompatibleMain.main(CompatibleMain.java:60)
	at sun.reflect.NativeMethodAccessorImpl.invoke0(Native Method)
	at sun.reflect.NativeMethodAccessorImpl.invoke(NativeMethodAccessorImpl.java:39)
	at sun.reflect.DelegatingMethodAccessorImpl.invoke(DelegatingMethodAccessorImpl.java:25)
	at java.lang.reflect.Method.invoke(Method.java:592)
	at org.codehaus.classworlds.Launcher.launchEnhanced(Launcher.java:315)
	at org.codehaus.classworlds.Launcher.launch(Launcher.java:255)
	at org.codehaus.classworlds.Launcher.mainWithExitCode(Launcher.java:430)
	at org.codehaus.classworlds.Launcher.main(Launcher.java:375)
Caused by: org.apache.maven.plugin.MojoFailureException: There are test failures.

Please refer to /opt/grid/slave/workspace/maven-plugins-ITs/jdk/java-5x/label/ubuntu/trunk/maven-ear-plugin/target/surefire-reports for the individual test results.
	at org.apache.maven.plugin.surefire.SurefirePlugin.execute(SurefirePlugin.java:575)
	at org.apache.maven.plugin.DefaultPluginManager.executeMojo(DefaultPluginManager.java:490)
	at org.apache.maven.lifecycle.DefaultLifecycleExecutor.executeGoals(DefaultLifecycleExecutor.java:694)
	... 17 more
[INFO] ------------------------------------------------------------------------
[INFO] BUILD ERRORS
[INFO] ------------------------------------------------------------------------
[INFO] Total time: 93 minutes 1 second
[INFO] Finished at: Fri Nov 12 02:38:50 CST 2010
[INFO] Final Memory: 104M/199M
[INFO] ------------------------------------------------------------------------


Build failed in Hudson: maven-plugins-ITs » java-5x,ubuntu #547

Posted by "GRiD .ORG" <bu...@lists.sonatype.com>.
See <https://grid.sonatype.org/ci/job/maven-plugins-ITs/./jdk=java-5x,label=ubuntu/547/changes>

Changes:

[John Casey] Adding FAQ entries for MASSEMBLY-517 and MASSEMBLY-516/-519/-527

[John Casey] [MASSEMBLY-516] Fixing documentation on shared descriptors.

[Dennis Lundberg] [MSITE-522] Update to Doxia 1.1.4

------------------------------------------
[...truncated 5545 lines...]
[INFO] Assembling webapp [maven-war-plugin-test] in [/opt/grid/slave/workspace/maven-plugins-ITs/jdk/java-5x/label/ubuntu/trunk/maven-war-plugin/target/test-classes/unit/warexplodedmojo/test-dir/ExplodedWar_WithClasses]
[INFO] Processing war project
[INFO] Copying webapp resources [/opt/grid/slave/workspace/maven-plugins-ITs/jdk/java-5x/label/ubuntu/trunk/maven-war-plugin/target/test-classes/unit/warexplodedmojo/test-dir/ExplodedWar_WithClasses-test-data/source]
[INFO] Webapp assembled in [3 msecs]
[INFO] Exploding webapp
[INFO] Assembling webapp [maven-war-plugin-test] in [/opt/grid/slave/workspace/maven-plugins-ITs/jdk/java-5x/label/ubuntu/trunk/maven-war-plugin/target/test-classes/unit/warexplodedmojo/test-dir/ExplodedWar_WithSourceIncludeExclude]
[INFO] Processing war project
[INFO] Copying webapp resources [/opt/grid/slave/workspace/maven-plugins-ITs/jdk/java-5x/label/ubuntu/trunk/maven-war-plugin/target/test-classes/unit/warexplodedmojo/test-dir/ExplodedWar_WithSourceIncludeExclude-test-data/source]
[INFO] Webapp assembled in [2 msecs]
[INFO] Exploding webapp
[INFO] Assembling webapp [maven-war-plugin-test] in [/opt/grid/slave/workspace/maven-plugins-ITs/jdk/java-5x/label/ubuntu/trunk/maven-war-plugin/target/test-classes/unit/warexplodedmojo/test-dir/ExplodedWar_WithWarDependencyIncludeExclude]
[INFO] Processing war project
[INFO] Copying webapp resources [/opt/grid/slave/workspace/maven-plugins-ITs/jdk/java-5x/label/ubuntu/trunk/maven-war-plugin/target/test-classes/unit/warexplodedmojo/test-dir/ExplodedWar_WithWarDependencyIncludeExclude-test-data/source]
[INFO] Processing overlay [ id wartests:war-include-exclude]
[INFO] Webapp assembled in [10 msecs]
[INFO] Exploding webapp
[INFO] Assembling webapp [maven-war-plugin-test] in [/opt/grid/slave/workspace/maven-plugins-ITs/jdk/java-5x/label/ubuntu/trunk/maven-war-plugin/target/test-classes/unit/warexplodedmojo/test-dir/ExplodedWarWithSourceModificationCheck]
[INFO] Processing war project
[INFO] Copying webapp resources [/opt/grid/slave/workspace/maven-plugins-ITs/jdk/java-5x/label/ubuntu/trunk/maven-war-plugin/target/test-classes/unit/warexplodedmojo/test-dir/ExplodedWarWithSourceModificationCheck-test-data/source]
[INFO] Webapp assembled in [5 msecs]
[INFO] Exploding webapp
[INFO] Assembling webapp [maven-war-plugin-test] in [/opt/grid/slave/workspace/maven-plugins-ITs/jdk/java-5x/label/ubuntu/trunk/maven-war-plugin/target/test-classes/unit/warexplodedmojo/test-dir/ExplodedWarWithFileNameMapping]
[INFO] Processing war project
[INFO] Copying webapp resources [/opt/grid/slave/workspace/maven-plugins-ITs/jdk/java-5x/label/ubuntu/trunk/maven-war-plugin/target/test-classes/unit/warexplodedmojo/test-dir/ExplodedWarWithFileNameMapping-test-data/source]
[INFO] Webapp assembled in [3 msecs]
[INFO] Exploding webapp
[INFO] Assembling webapp [maven-war-plugin-test] in [/opt/grid/slave/workspace/maven-plugins-ITs/jdk/java-5x/label/ubuntu/trunk/maven-war-plugin/target/test-classes/unit/warexplodedmojo/test-dir/ExplodedWarWithFileNameMappingAndDuplicateDependencies]
[INFO] Processing war project
[INFO] Copying webapp resources [/opt/grid/slave/workspace/maven-plugins-ITs/jdk/java-5x/label/ubuntu/trunk/maven-war-plugin/target/test-classes/unit/warexplodedmojo/test-dir/ExplodedWarWithFileNameMappingAndDuplicateDependencies-test-data/source]
[INFO] Webapp assembled in [3 msecs]
Tests run: 21, Failures: 0, Errors: 0, Skipped: 0, Time elapsed: 1.606 sec
Running org.apache.maven.plugin.war.WarInPlaceMojoTest
[INFO] Generating webapp in source directory [/opt/grid/slave/workspace/maven-plugins-ITs/jdk/java-5x/label/ubuntu/trunk/maven-war-plugin/target/test-classes/unit/warexplodedinplacemojo/test-dir/SimpleExplodedInplaceWar-test-data/source]
[INFO] Assembling webapp [maven-war-plugin-test] in [/opt/grid/slave/workspace/maven-plugins-ITs/jdk/java-5x/label/ubuntu/trunk/maven-war-plugin/target/test-classes/unit/warexplodedinplacemojo/test-dir/SimpleExplodedInplaceWar-test-data/source]
[INFO] Processing war project
[INFO] Copying webapp webResources [/opt/grid/slave/workspace/maven-plugins-ITs/jdk/java-5x/label/ubuntu/trunk/maven-war-plugin/target/test-classes/unit/warexplodedinplacemojo/test-dir/resources] to [/opt/grid/slave/workspace/maven-plugins-ITs/jdk/java-5x/label/ubuntu/trunk/maven-war-plugin/target/test-classes/unit/warexplodedinplacemojo/test-dir/SimpleExplodedInplaceWar-test-data/source]
[INFO] Webapp assembled in [1 msecs]
Tests run: 2, Failures: 0, Errors: 0, Skipped: 0, Time elapsed: 0.073 sec
Running org.apache.maven.plugin.war.WarManifestMojoTest
Tests run: 6, Failures: 0, Errors: 0, Skipped: 0, Time elapsed: 0.194 sec
Running org.apache.maven.plugin.war.util.PathSetTest
Tests run: 5, Failures: 0, Errors: 0, Skipped: 0, Time elapsed: 0.004 sec
Running org.apache.maven.plugin.war.util.WarUtilsTest
Tests run: 1, Failures: 0, Errors: 0, Skipped: 0, Time elapsed: 0.002 sec
Running org.apache.maven.plugin.war.overlay.OverlayManagerTest
Tests run: 5, Failures: 0, Errors: 0, Skipped: 0, Time elapsed: 0.225 sec
Running org.apache.maven.plugin.war.WarDependenciesAnalysisTest
[INFO] Exploding webapp
[INFO] Assembling webapp [maven-war-plugin-test] in [/opt/grid/slave/workspace/maven-plugins-ITs/jdk/java-5x/label/ubuntu/trunk/maven-war-plugin/target/test-classes/unit/dependenciesanalysis/test-dir/no-change]
[INFO] Processing war project
[INFO] Copying webapp resources [/opt/grid/slave/workspace/maven-plugins-ITs/jdk/java-5x/label/ubuntu/trunk/maven-war-plugin/target/test-classes/unit/dependenciesanalysis/test-dir/no-change-test-data/source]
[INFO] Webapp assembled in [5 msecs]
[INFO] Exploding webapp
[INFO] Assembling webapp [maven-war-plugin-test] in [/opt/grid/slave/workspace/maven-plugins-ITs/jdk/java-5x/label/ubuntu/trunk/maven-war-plugin/target/test-classes/unit/dependenciesanalysis/test-dir/no-change]
[INFO] Processing war project
[INFO] Copying webapp resources [/opt/grid/slave/workspace/maven-plugins-ITs/jdk/java-5x/label/ubuntu/trunk/maven-war-plugin/target/test-classes/unit/dependenciesanalysis/test-dir/no-change-test-data/source]
[INFO] Webapp assembled in [3 msecs]
[INFO] Exploding webapp
[INFO] Assembling webapp [maven-war-plugin-test] in [/opt/grid/slave/workspace/maven-plugins-ITs/jdk/java-5x/label/ubuntu/trunk/maven-war-plugin/target/test-classes/unit/dependenciesanalysis/test-dir/remove-dependency]
[INFO] Processing war project
[INFO] Copying webapp resources [/opt/grid/slave/workspace/maven-plugins-ITs/jdk/java-5x/label/ubuntu/trunk/maven-war-plugin/target/test-classes/unit/dependenciesanalysis/test-dir/remove-dependency-test-data/source]
[INFO] Webapp assembled in [4 msecs]
[INFO] Exploding webapp
[INFO] Assembling webapp [maven-war-plugin-test] in [/opt/grid/slave/workspace/maven-plugins-ITs/jdk/java-5x/label/ubuntu/trunk/maven-war-plugin/target/test-classes/unit/dependenciesanalysis/test-dir/remove-dependency]
[INFO] Dependency [Dependency {groupId=org.sample.jar, artifactId=lib-test, version=1.0, type=jar}] has been removed from the project.
[INFO] Processing war project
[INFO] Copying webapp resources [/opt/grid/slave/workspace/maven-plugins-ITs/jdk/java-5x/label/ubuntu/trunk/maven-war-plugin/target/test-classes/unit/dependenciesanalysis/test-dir/remove-dependency-test-data/source]
[INFO] Webapp assembled in [2 msecs]
[INFO] Exploding webapp
[INFO] Assembling webapp [maven-war-plugin-test] in [/opt/grid/slave/workspace/maven-plugins-ITs/jdk/java-5x/label/ubuntu/trunk/maven-war-plugin/target/test-classes/unit/dependenciesanalysis/test-dir/dependency-update-version]
[INFO] Processing war project
[INFO] Copying webapp resources [/opt/grid/slave/workspace/maven-plugins-ITs/jdk/java-5x/label/ubuntu/trunk/maven-war-plugin/target/test-classes/unit/dependenciesanalysis/test-dir/dependency-update-version-test-data/source]
[INFO] Webapp assembled in [3 msecs]
[INFO] Exploding webapp
[INFO] Assembling webapp [maven-war-plugin-test] in [/opt/grid/slave/workspace/maven-plugins-ITs/jdk/java-5x/label/ubuntu/trunk/maven-war-plugin/target/test-classes/unit/dependenciesanalysis/test-dir/dependency-update-version]
[INFO] Version of dependency [Dependency {groupId=org.sample.jar, artifactId=lib-test, version=2.0, type=jar}] has changed (1.0 -> 2.0).
[INFO] Processing war project
[INFO] Copying webapp resources [/opt/grid/slave/workspace/maven-plugins-ITs/jdk/java-5x/label/ubuntu/trunk/maven-war-plugin/target/test-classes/unit/dependenciesanalysis/test-dir/dependency-update-version-test-data/source]
[INFO] Webapp assembled in [3 msecs]
[INFO] Exploding webapp
[INFO] Assembling webapp [maven-war-plugin-test] in [/opt/grid/slave/workspace/maven-plugins-ITs/jdk/java-5x/label/ubuntu/trunk/maven-war-plugin/target/test-classes/unit/dependenciesanalysis/test-dir/dependency-now-provided]
[INFO] Processing war project
[INFO] Copying webapp resources [/opt/grid/slave/workspace/maven-plugins-ITs/jdk/java-5x/label/ubuntu/trunk/maven-war-plugin/target/test-classes/unit/dependenciesanalysis/test-dir/dependency-now-provided-test-data/source]
[INFO] Webapp assembled in [5 msecs]
[INFO] Exploding webapp
[INFO] Assembling webapp [maven-war-plugin-test] in [/opt/grid/slave/workspace/maven-plugins-ITs/jdk/java-5x/label/ubuntu/trunk/maven-war-plugin/target/test-classes/unit/dependenciesanalysis/test-dir/dependency-now-provided]
[INFO] Scope of dependency [Dependency {groupId=org.sample.jar, artifactId=lib-test, version=1.0, type=jar}] has changed (runtime -> provided).
[INFO] Processing war project
[INFO] Copying webapp resources [/opt/grid/slave/workspace/maven-plugins-ITs/jdk/java-5x/label/ubuntu/trunk/maven-war-plugin/target/test-classes/unit/dependenciesanalysis/test-dir/dependency-now-provided-test-data/source]
[INFO] Webapp assembled in [4 msecs]
Tests run: 4, Failures: 0, Errors: 0, Skipped: 0, Time elapsed: 0.184 sec

Results :

Tests run: 83, Failures: 0, Errors: 0, Skipped: 0

[INFO] [jar:jar {execution: default-jar}]
[INFO] Building jar: /opt/grid/slave/workspace/maven-plugins-ITs/jdk/java-5x/label/ubuntu/trunk/maven-war-plugin/target/maven-war-plugin-2.2-SNAPSHOT.jar
[INFO] [plugin:addPluginArtifactMetadata {execution: default-addPluginArtifactMetadata}]
[INFO] [invoker:install {execution: integration-test}]
[INFO] Installing /opt/grid/slave/workspace/maven-plugins-ITs/jdk/java-5x/label/ubuntu/trunk/maven-war-plugin/pom.xml to /opt/grid/slave/workspace/maven-plugins-ITs/jdk/java-5x/label/ubuntu/trunk/maven-war-plugin/target/local-repo/org/apache/maven/plugins/maven-war-plugin/2.2-SNAPSHOT/maven-war-plugin-2.2-SNAPSHOT.pom
[INFO] Installing /opt/grid/slave/workspace/maven-plugins-ITs/jdk/java-5x/label/ubuntu/trunk/maven-war-plugin/target/maven-war-plugin-2.2-SNAPSHOT.jar to /opt/grid/slave/workspace/maven-plugins-ITs/jdk/java-5x/label/ubuntu/trunk/maven-war-plugin/target/local-repo/org/apache/maven/plugins/maven-war-plugin/2.2-SNAPSHOT/maven-war-plugin-2.2-SNAPSHOT.jar
[INFO] [invoker:run {execution: integration-test}]
[INFO] Building: MWAR-143/pom.xml
[INFO] ..SUCCESS (19.7 s)
[INFO] Building: scoped-dependency-same-artifact/pom.xml
[INFO] ..SUCCESS (5.6 s)
[INFO] Building: MWAR-96/pom.xml
[INFO] ..SUCCESS (3.8 s)
[INFO] Building: MWAR-62/pom.xml
[INFO] ..SUCCESS (2.8 s)
[INFO] Building: MWAR-129/pom.xml
[INFO] ..SUCCESS (2.8 s)
[INFO] Building: simple-war-no-webxml/pom.xml
[INFO] ..SUCCESS (4.4 s)
[INFO] Building: simple-war-project/pom.xml
[INFO] ..SUCCESS (3.7 s)
[INFO] Building: MWAR-139/pom.xml
[INFO] ..SUCCESS (3.9 s)
[INFO] Building: web-resources-filtering/pom.xml
[INFO] ..SUCCESS (4.9 s)
[INFO] Building: MWAR-131/pom.xml
[INFO] ..SUCCESS (21.3 s)
[INFO] Building: default/pom.xml
[INFO] ..SUCCESS (6.0 s)
[INFO] Building: MWAR-133/pom.xml
[INFO] ..SUCCESS (2.7 s)
[INFO] ---------------------------------------
[INFO] Execution Summary:
[INFO]   Builds Passing: 12
[INFO]   Builds Failing: 0
[INFO]   Builds Skipped: 0
[INFO] ---------------------------------------
[INFO] [install:install {execution: default-install}]
[INFO] Installing /opt/grid/slave/workspace/maven-plugins-ITs/jdk/java-5x/label/ubuntu/trunk/maven-war-plugin/target/maven-war-plugin-2.2-SNAPSHOT.jar to <https://grid.sonatype.org/ci/job/maven-plugins-ITs/./jdk=java-5x,label=ubuntu/ws/.repository/org/apache/maven/plugins/maven-war-plugin/2.2-SNAPSHOT/maven-war-plugin-2.2-SNAPSHOT.jar>
[INFO] [deploy:deploy {execution: default-deploy}]
[INFO] Retrieving previous build number from apache.snapshots.https
Uploading: http://repository.sonatype.org:8081/content/repositories/maven.snapshots/org/apache/maven/plugins/maven-war-plugin/2.2-SNAPSHOT/maven-war-plugin-2.2-20101111.070554-56.jar
75K uploaded  (maven-war-plugin-2.2-20101111.070554-56.jar)
[INFO] Retrieving previous metadata from apache.snapshots.https
[INFO] Uploading repository metadata for: 'artifact org.apache.maven.plugins:maven-war-plugin'
[INFO] Retrieving previous metadata from apache.snapshots.https
[INFO] Uploading repository metadata for: 'org.apache.maven.plugins'
[INFO] Uploading project information for maven-war-plugin 2.2-20101111.070554-56
[INFO] Retrieving previous metadata from apache.snapshots.https
[INFO] Uploading repository metadata for: 'snapshot org.apache.maven.plugins:maven-war-plugin:2.2-SNAPSHOT'
[INFO] ------------------------------------------------------------------------
[INFO] Building Maven Plugins Aggregator
[INFO]    task-segment: [clean, deploy]
[INFO] ------------------------------------------------------------------------
[INFO] [clean:clean {execution: default-clean}]
[INFO] Deleting file set: /opt/grid/slave/workspace/maven-plugins-ITs/jdk/java-5x/label/ubuntu/trunk/target (included: [**], excluded: [])
[INFO] [remote-resources:process {execution: default}]
[INFO] [site:attach-descriptor {execution: default-attach-descriptor}]
[INFO] [install:install {execution: default-install}]
[INFO] Installing /opt/grid/slave/workspace/maven-plugins-ITs/jdk/java-5x/label/ubuntu/trunk/pom.xml to <https://grid.sonatype.org/ci/job/maven-plugins-ITs/./jdk=java-5x,label=ubuntu/ws/.repository/org/apache/maven/plugins/maven-plugins-aggregator/1-SNAPSHOT/maven-plugins-aggregator-1-SNAPSHOT.pom>
[INFO] [deploy:deploy {execution: default-deploy}]
[INFO] Retrieving previous build number from apache.snapshots.https
Uploading: http://repository.sonatype.org:8081/content/repositories/maven.snapshots/org/apache/maven/plugins/maven-plugins-aggregator/1-SNAPSHOT/maven-plugins-aggregator-1-20101111.070554-103.pom
3K uploaded  (maven-plugins-aggregator-1-20101111.070554-103.pom)
[INFO] Retrieving previous metadata from apache.snapshots.https
[INFO] Uploading repository metadata for: 'artifact org.apache.maven.plugins:maven-plugins-aggregator'
[INFO] Retrieving previous metadata from apache.snapshots.https
[INFO] Uploading repository metadata for: 'snapshot org.apache.maven.plugins:maven-plugins-aggregator:1-SNAPSHOT'
[INFO] 
[INFO] 
[INFO] ------------------------------------------------------------------------
[INFO] Reactor Summary:
[INFO] ------------------------------------------------------------------------
[INFO] Maven Plugins ......................................... SUCCESS [26.489s]
[INFO] Maven Invoker Plugin .................................. SUCCESS [5:16.493s]
[INFO] Maven Ant Plugin ...................................... SUCCESS [2:11.179s]
[INFO] Maven AntRun Plugin ................................... SUCCESS [1:27.160s]
[INFO] Maven Eclipse Plugin .................................. SUCCESS [10:09.930s]
[INFO] Maven Changelog Plugin ................................ SUCCESS [38.022s]
[INFO] Maven Changes Report Plugin ........................... SUCCESS [1:08.998s]
[INFO] Maven Checkstyle Plugin ............................... SUCCESS [2:27.912s]
[INFO] Maven Clean Plugin .................................... SUCCESS [23.248s]
[INFO] Maven Compiler Plugin ................................. SUCCESS [29.651s]
[INFO] Maven Dependency Plugin ............................... SUCCESS [3:59.538s]
[INFO] Maven Deploy Plugin ................................... SUCCESS [1:48.157s]
[INFO] Maven DOAP Plugin ..................................... SUCCESS [17.260s]
[INFO] Maven Documentation Checker Plugin .................... SUCCESS [23.634s]
[INFO] Maven EAR Plugin ...................................... FAILED [57.692s]
[INFO] Maven EJB Plugin ...................................... SUCCESS [50.371s]
[INFO] Maven GPG Plugin ...................................... SUCCESS [38.227s]
[INFO] Maven Help Plugin ..................................... SUCCESS [45.647s]
[INFO] Maven IDEA Plugin ..................................... SUCCESS [15.600s]
[INFO] Maven Install Plugin .................................. SUCCESS [1:30.856s]
[INFO] Maven JAR Plugin ...................................... SUCCESS [2:03.972s]
[INFO] Maven Jarsigner Plugin ................................ SUCCESS [58.830s]
[INFO] Maven Shade Plugin .................................... SUCCESS [2:45.726s]
[INFO] Maven Javadoc Plugin .................................. SUCCESS [15:34.804s]
[INFO] Maven Linkcheck Plugin ................................ SUCCESS [8.733s]
[INFO] Maven One Plugin ...................................... SUCCESS [5.827s]
[INFO] Maven Patch Plugin .................................... SUCCESS [24.605s]
[INFO] Maven PDF Plugin ...................................... SUCCESS [1:24.436s]
[INFO] Maven PMD Plugin ...................................... SUCCESS [46.079s]
[INFO] Maven RAR Plugin ...................................... SUCCESS [17.056s]
[INFO] Maven Reactor Plugin .................................. SUCCESS [4.850s]
[INFO] Maven Repository Plugin ............................... SUCCESS [1:33.782s]
[INFO] Maven Resources Plugin ................................ SUCCESS [1:11.576s]
[INFO] Maven Site Plugin ..................................... SUCCESS [7:07.191s]
[INFO] Maven Source Plugin ................................... SUCCESS [49.270s]
[INFO] Maven Stage Plugin .................................... SUCCESS [7.322s]
[INFO] Maven Toolchains Plugin ............................... SUCCESS [12.209s]
[INFO] Maven Verifier Plugin ................................. SUCCESS [13.996s]
[INFO] Maven WAR Plugin ...................................... SUCCESS [1:47.953s]
[INFO] Maven Plugins Aggregator .............................. SUCCESS [1.893s]
[INFO] ------------------------------------------------------------------------
[INFO] Error for project: Maven EAR Plugin (during deploy)
[INFO] ------------------------------------------------------------------------
[INFO] : org.apache.maven.plugin.invoker.InvokerSession@5e5d0fb4
1 build failed.
[INFO] ------------------------------------------------------------------------
[INFO] Trace
org.apache.maven.BuildFailureException: 1 build failed.
	at org.apache.maven.lifecycle.DefaultLifecycleExecutor.executeGoals(DefaultLifecycleExecutor.java:715)
	at org.apache.maven.lifecycle.DefaultLifecycleExecutor.executeGoalWithLifecycle(DefaultLifecycleExecutor.java:556)
	at org.apache.maven.lifecycle.DefaultLifecycleExecutor.executeGoal(DefaultLifecycleExecutor.java:535)
	at org.apache.maven.lifecycle.DefaultLifecycleExecutor.executeGoalAndHandleFailures(DefaultLifecycleExecutor.java:387)
	at org.apache.maven.lifecycle.DefaultLifecycleExecutor.executeTaskSegments(DefaultLifecycleExecutor.java:348)
	at org.apache.maven.lifecycle.DefaultLifecycleExecutor.execute(DefaultLifecycleExecutor.java:180)
	at org.apache.maven.DefaultMaven.doExecute(DefaultMaven.java:328)
	at org.apache.maven.DefaultMaven.execute(DefaultMaven.java:138)
	at org.apache.maven.cli.MavenCli.main(MavenCli.java:362)
	at org.apache.maven.cli.compat.CompatibleMain.main(CompatibleMain.java:60)
	at sun.reflect.NativeMethodAccessorImpl.invoke0(Native Method)
	at sun.reflect.NativeMethodAccessorImpl.invoke(NativeMethodAccessorImpl.java:39)
	at sun.reflect.DelegatingMethodAccessorImpl.invoke(DelegatingMethodAccessorImpl.java:25)
	at java.lang.reflect.Method.invoke(Method.java:592)
	at org.codehaus.classworlds.Launcher.launchEnhanced(Launcher.java:315)
	at org.codehaus.classworlds.Launcher.launch(Launcher.java:255)
	at org.codehaus.classworlds.Launcher.mainWithExitCode(Launcher.java:430)
	at org.codehaus.classworlds.Launcher.main(Launcher.java:375)
Caused by: org.apache.maven.plugin.MojoFailureException: 1 build failed.
	at org.apache.maven.plugin.invoker.InvokerSession.handleFailures(InvokerSession.java:244)
	at org.apache.maven.plugin.invoker.InvokerMojo.processResults(InvokerMojo.java:58)
	at org.apache.maven.plugin.invoker.AbstractInvokerMojo.execute(AbstractInvokerMojo.java:601)
	at org.apache.maven.plugin.DefaultPluginManager.executeMojo(DefaultPluginManager.java:490)
	at org.apache.maven.lifecycle.DefaultLifecycleExecutor.executeGoals(DefaultLifecycleExecutor.java:694)
	... 17 more
[INFO] ------------------------------------------------------------------------
[INFO] BUILD ERRORS
[INFO] ------------------------------------------------------------------------
[INFO] Total time: 73 minutes 48 seconds
[INFO] Finished at: Thu Nov 11 02:19:32 CST 2010
[INFO] Final Memory: 110M/207M
[INFO] ------------------------------------------------------------------------


Build failed in Hudson: maven-plugins-ITs » java-5x,ubuntu #546

Posted by "GRiD .ORG" <bu...@lists.sonatype.com>.
See <https://grid.sonatype.org/ci/job/maven-plugins-ITs/./jdk=java-5x,label=ubuntu/546/changes>

Changes:

[Dennis Lundberg] [maven-release-plugin] prepare for next development iteration

[Dennis Lundberg] [maven-release-plugin] prepare release maven-linkcheck-plugin-1.1

[Dennis Lundberg] o Use staged version 1.2 of doxia-linkcheck.

------------------------------------------
[...truncated 5864 lines...]
[INFO] Webapp assembled in [3 msecs]
[INFO] Exploding webapp
[INFO] Assembling webapp [maven-war-plugin-test] in [/opt/grid/slave/workspace/maven-plugins-ITs/jdk/java-5x/label/ubuntu/trunk/maven-war-plugin/target/test-classes/unit/warexplodedmojo/test-dir/ExplodedWar_WithSourceIncludeExclude]
[INFO] Processing war project
[INFO] Copying webapp resources [/opt/grid/slave/workspace/maven-plugins-ITs/jdk/java-5x/label/ubuntu/trunk/maven-war-plugin/target/test-classes/unit/warexplodedmojo/test-dir/ExplodedWar_WithSourceIncludeExclude-test-data/source]
[INFO] Webapp assembled in [4 msecs]
[INFO] Exploding webapp
[INFO] Assembling webapp [maven-war-plugin-test] in [/opt/grid/slave/workspace/maven-plugins-ITs/jdk/java-5x/label/ubuntu/trunk/maven-war-plugin/target/test-classes/unit/warexplodedmojo/test-dir/ExplodedWar_WithWarDependencyIncludeExclude]
[INFO] Processing war project
[INFO] Copying webapp resources [/opt/grid/slave/workspace/maven-plugins-ITs/jdk/java-5x/label/ubuntu/trunk/maven-war-plugin/target/test-classes/unit/warexplodedmojo/test-dir/ExplodedWar_WithWarDependencyIncludeExclude-test-data/source]
[INFO] Processing overlay [ id wartests:war-include-exclude]
[INFO] Webapp assembled in [20 msecs]
[INFO] Exploding webapp
[INFO] Assembling webapp [maven-war-plugin-test] in [/opt/grid/slave/workspace/maven-plugins-ITs/jdk/java-5x/label/ubuntu/trunk/maven-war-plugin/target/test-classes/unit/warexplodedmojo/test-dir/ExplodedWarWithSourceModificationCheck]
[INFO] Processing war project
[INFO] Copying webapp resources [/opt/grid/slave/workspace/maven-plugins-ITs/jdk/java-5x/label/ubuntu/trunk/maven-war-plugin/target/test-classes/unit/warexplodedmojo/test-dir/ExplodedWarWithSourceModificationCheck-test-data/source]
[INFO] Webapp assembled in [5 msecs]
[INFO] Exploding webapp
[INFO] Assembling webapp [maven-war-plugin-test] in [/opt/grid/slave/workspace/maven-plugins-ITs/jdk/java-5x/label/ubuntu/trunk/maven-war-plugin/target/test-classes/unit/warexplodedmojo/test-dir/ExplodedWarWithFileNameMapping]
[INFO] Processing war project
[INFO] Copying webapp resources [/opt/grid/slave/workspace/maven-plugins-ITs/jdk/java-5x/label/ubuntu/trunk/maven-war-plugin/target/test-classes/unit/warexplodedmojo/test-dir/ExplodedWarWithFileNameMapping-test-data/source]
[INFO] Webapp assembled in [8 msecs]
[INFO] Exploding webapp
[INFO] Assembling webapp [maven-war-plugin-test] in [/opt/grid/slave/workspace/maven-plugins-ITs/jdk/java-5x/label/ubuntu/trunk/maven-war-plugin/target/test-classes/unit/warexplodedmojo/test-dir/ExplodedWarWithFileNameMappingAndDuplicateDependencies]
[INFO] Processing war project
[INFO] Copying webapp resources [/opt/grid/slave/workspace/maven-plugins-ITs/jdk/java-5x/label/ubuntu/trunk/maven-war-plugin/target/test-classes/unit/warexplodedmojo/test-dir/ExplodedWarWithFileNameMappingAndDuplicateDependencies-test-data/source]
[INFO] Webapp assembled in [3 msecs]
Tests run: 21, Failures: 0, Errors: 0, Skipped: 0, Time elapsed: 1.936 sec
Running org.apache.maven.plugin.war.WarInPlaceMojoTest
[INFO] Generating webapp in source directory [/opt/grid/slave/workspace/maven-plugins-ITs/jdk/java-5x/label/ubuntu/trunk/maven-war-plugin/target/test-classes/unit/warexplodedinplacemojo/test-dir/SimpleExplodedInplaceWar-test-data/source]
[INFO] Assembling webapp [maven-war-plugin-test] in [/opt/grid/slave/workspace/maven-plugins-ITs/jdk/java-5x/label/ubuntu/trunk/maven-war-plugin/target/test-classes/unit/warexplodedinplacemojo/test-dir/SimpleExplodedInplaceWar-test-data/source]
[INFO] Processing war project
[INFO] Copying webapp webResources [/opt/grid/slave/workspace/maven-plugins-ITs/jdk/java-5x/label/ubuntu/trunk/maven-war-plugin/target/test-classes/unit/warexplodedinplacemojo/test-dir/resources] to [/opt/grid/slave/workspace/maven-plugins-ITs/jdk/java-5x/label/ubuntu/trunk/maven-war-plugin/target/test-classes/unit/warexplodedinplacemojo/test-dir/SimpleExplodedInplaceWar-test-data/source]
[INFO] Webapp assembled in [1 msecs]
Tests run: 2, Failures: 0, Errors: 0, Skipped: 0, Time elapsed: 0.086 sec
Running org.apache.maven.plugin.war.WarManifestMojoTest
Tests run: 6, Failures: 0, Errors: 0, Skipped: 0, Time elapsed: 0.237 sec
Running org.apache.maven.plugin.war.util.PathSetTest
Tests run: 5, Failures: 0, Errors: 0, Skipped: 0, Time elapsed: 0.007 sec
Running org.apache.maven.plugin.war.util.WarUtilsTest
Tests run: 1, Failures: 0, Errors: 0, Skipped: 0, Time elapsed: 0.002 sec
Running org.apache.maven.plugin.war.overlay.OverlayManagerTest
Tests run: 5, Failures: 0, Errors: 0, Skipped: 0, Time elapsed: 0.175 sec
Running org.apache.maven.plugin.war.WarDependenciesAnalysisTest
[INFO] Exploding webapp
[INFO] Assembling webapp [maven-war-plugin-test] in [/opt/grid/slave/workspace/maven-plugins-ITs/jdk/java-5x/label/ubuntu/trunk/maven-war-plugin/target/test-classes/unit/dependenciesanalysis/test-dir/no-change]
[INFO] Processing war project
[INFO] Copying webapp resources [/opt/grid/slave/workspace/maven-plugins-ITs/jdk/java-5x/label/ubuntu/trunk/maven-war-plugin/target/test-classes/unit/dependenciesanalysis/test-dir/no-change-test-data/source]
[INFO] Webapp assembled in [5 msecs]
[INFO] Exploding webapp
[INFO] Assembling webapp [maven-war-plugin-test] in [/opt/grid/slave/workspace/maven-plugins-ITs/jdk/java-5x/label/ubuntu/trunk/maven-war-plugin/target/test-classes/unit/dependenciesanalysis/test-dir/no-change]
[INFO] Processing war project
[INFO] Copying webapp resources [/opt/grid/slave/workspace/maven-plugins-ITs/jdk/java-5x/label/ubuntu/trunk/maven-war-plugin/target/test-classes/unit/dependenciesanalysis/test-dir/no-change-test-data/source]
[INFO] Webapp assembled in [3 msecs]
[INFO] Exploding webapp
[INFO] Assembling webapp [maven-war-plugin-test] in [/opt/grid/slave/workspace/maven-plugins-ITs/jdk/java-5x/label/ubuntu/trunk/maven-war-plugin/target/test-classes/unit/dependenciesanalysis/test-dir/remove-dependency]
[INFO] Processing war project
[INFO] Copying webapp resources [/opt/grid/slave/workspace/maven-plugins-ITs/jdk/java-5x/label/ubuntu/trunk/maven-war-plugin/target/test-classes/unit/dependenciesanalysis/test-dir/remove-dependency-test-data/source]
[INFO] Webapp assembled in [4 msecs]
[INFO] Exploding webapp
[INFO] Assembling webapp [maven-war-plugin-test] in [/opt/grid/slave/workspace/maven-plugins-ITs/jdk/java-5x/label/ubuntu/trunk/maven-war-plugin/target/test-classes/unit/dependenciesanalysis/test-dir/remove-dependency]
[INFO] Dependency [Dependency {groupId=org.sample.jar, artifactId=lib-test, version=1.0, type=jar}] has been removed from the project.
[INFO] Processing war project
[INFO] Copying webapp resources [/opt/grid/slave/workspace/maven-plugins-ITs/jdk/java-5x/label/ubuntu/trunk/maven-war-plugin/target/test-classes/unit/dependenciesanalysis/test-dir/remove-dependency-test-data/source]
[INFO] Webapp assembled in [2 msecs]
[INFO] Exploding webapp
[INFO] Assembling webapp [maven-war-plugin-test] in [/opt/grid/slave/workspace/maven-plugins-ITs/jdk/java-5x/label/ubuntu/trunk/maven-war-plugin/target/test-classes/unit/dependenciesanalysis/test-dir/dependency-update-version]
[INFO] Processing war project
[INFO] Copying webapp resources [/opt/grid/slave/workspace/maven-plugins-ITs/jdk/java-5x/label/ubuntu/trunk/maven-war-plugin/target/test-classes/unit/dependenciesanalysis/test-dir/dependency-update-version-test-data/source]
[INFO] Webapp assembled in [4 msecs]
[INFO] Exploding webapp
[INFO] Assembling webapp [maven-war-plugin-test] in [/opt/grid/slave/workspace/maven-plugins-ITs/jdk/java-5x/label/ubuntu/trunk/maven-war-plugin/target/test-classes/unit/dependenciesanalysis/test-dir/dependency-update-version]
[INFO] Version of dependency [Dependency {groupId=org.sample.jar, artifactId=lib-test, version=2.0, type=jar}] has changed (1.0 -> 2.0).
[INFO] Processing war project
[INFO] Copying webapp resources [/opt/grid/slave/workspace/maven-plugins-ITs/jdk/java-5x/label/ubuntu/trunk/maven-war-plugin/target/test-classes/unit/dependenciesanalysis/test-dir/dependency-update-version-test-data/source]
[INFO] Webapp assembled in [3 msecs]
[INFO] Exploding webapp
[INFO] Assembling webapp [maven-war-plugin-test] in [/opt/grid/slave/workspace/maven-plugins-ITs/jdk/java-5x/label/ubuntu/trunk/maven-war-plugin/target/test-classes/unit/dependenciesanalysis/test-dir/dependency-now-provided]
[INFO] Processing war project
[INFO] Copying webapp resources [/opt/grid/slave/workspace/maven-plugins-ITs/jdk/java-5x/label/ubuntu/trunk/maven-war-plugin/target/test-classes/unit/dependenciesanalysis/test-dir/dependency-now-provided-test-data/source]
[INFO] Webapp assembled in [7 msecs]
[INFO] Exploding webapp
[INFO] Assembling webapp [maven-war-plugin-test] in [/opt/grid/slave/workspace/maven-plugins-ITs/jdk/java-5x/label/ubuntu/trunk/maven-war-plugin/target/test-classes/unit/dependenciesanalysis/test-dir/dependency-now-provided]
[INFO] Scope of dependency [Dependency {groupId=org.sample.jar, artifactId=lib-test, version=1.0, type=jar}] has changed (runtime -> provided).
[INFO] Processing war project
[INFO] Copying webapp resources [/opt/grid/slave/workspace/maven-plugins-ITs/jdk/java-5x/label/ubuntu/trunk/maven-war-plugin/target/test-classes/unit/dependenciesanalysis/test-dir/dependency-now-provided-test-data/source]
[INFO] Webapp assembled in [2 msecs]
Tests run: 4, Failures: 0, Errors: 0, Skipped: 0, Time elapsed: 0.195 sec

Results :

Tests run: 83, Failures: 0, Errors: 0, Skipped: 0

[INFO] [jar:jar {execution: default-jar}]
[INFO] Building jar: /opt/grid/slave/workspace/maven-plugins-ITs/jdk/java-5x/label/ubuntu/trunk/maven-war-plugin/target/maven-war-plugin-2.2-SNAPSHOT.jar
[INFO] [plugin:addPluginArtifactMetadata {execution: default-addPluginArtifactMetadata}]
[INFO] [invoker:install {execution: integration-test}]
[INFO] Installing /opt/grid/slave/workspace/maven-plugins-ITs/jdk/java-5x/label/ubuntu/trunk/maven-war-plugin/pom.xml to /opt/grid/slave/workspace/maven-plugins-ITs/jdk/java-5x/label/ubuntu/trunk/maven-war-plugin/target/local-repo/org/apache/maven/plugins/maven-war-plugin/2.2-SNAPSHOT/maven-war-plugin-2.2-SNAPSHOT.pom
[INFO] Installing /opt/grid/slave/workspace/maven-plugins-ITs/jdk/java-5x/label/ubuntu/trunk/maven-war-plugin/target/maven-war-plugin-2.2-SNAPSHOT.jar to /opt/grid/slave/workspace/maven-plugins-ITs/jdk/java-5x/label/ubuntu/trunk/maven-war-plugin/target/local-repo/org/apache/maven/plugins/maven-war-plugin/2.2-SNAPSHOT/maven-war-plugin-2.2-SNAPSHOT.jar
[INFO] [invoker:run {execution: integration-test}]
[INFO] Building: MWAR-143/pom.xml
[INFO] ..SUCCESS (20.1 s)
[INFO] Building: scoped-dependency-same-artifact/pom.xml
[INFO] ..SUCCESS (5.5 s)
[INFO] Building: MWAR-96/pom.xml
[INFO] ..SUCCESS (4.1 s)
[INFO] Building: MWAR-62/pom.xml
[INFO] ..SUCCESS (2.8 s)
[INFO] Building: MWAR-129/pom.xml
[INFO] ..SUCCESS (3.1 s)
[INFO] Building: simple-war-no-webxml/pom.xml
[INFO] ..SUCCESS (4.7 s)
[INFO] Building: simple-war-project/pom.xml
[INFO] ..SUCCESS (4.2 s)
[INFO] Building: MWAR-139/pom.xml
[INFO] ..SUCCESS (3.6 s)
[INFO] Building: web-resources-filtering/pom.xml
[INFO] ..SUCCESS (5.0 s)
[INFO] Building: MWAR-131/pom.xml
[INFO] ..SUCCESS (23.1 s)
[INFO] Building: default/pom.xml
[INFO] ..SUCCESS (5.8 s)
[INFO] Building: MWAR-133/pom.xml
[INFO] ..SUCCESS (2.9 s)
[INFO] ---------------------------------------
[INFO] Execution Summary:
[INFO]   Builds Passing: 12
[INFO]   Builds Failing: 0
[INFO]   Builds Skipped: 0
[INFO] ---------------------------------------
[INFO] [install:install {execution: default-install}]
[INFO] Installing /opt/grid/slave/workspace/maven-plugins-ITs/jdk/java-5x/label/ubuntu/trunk/maven-war-plugin/target/maven-war-plugin-2.2-SNAPSHOT.jar to <https://grid.sonatype.org/ci/job/maven-plugins-ITs/./jdk=java-5x,label=ubuntu/ws/.repository/org/apache/maven/plugins/maven-war-plugin/2.2-SNAPSHOT/maven-war-plugin-2.2-SNAPSHOT.jar>
[INFO] [deploy:deploy {execution: default-deploy}]
[INFO] Retrieving previous build number from apache.snapshots.https
Uploading: http://repository.sonatype.org:8081/content/repositories/maven.snapshots/org/apache/maven/plugins/maven-war-plugin/2.2-SNAPSHOT/maven-war-plugin-2.2-20101110.070649-55.jar
75K uploaded  (maven-war-plugin-2.2-20101110.070649-55.jar)
[INFO] Retrieving previous metadata from apache.snapshots.https
[INFO] Uploading repository metadata for: 'artifact org.apache.maven.plugins:maven-war-plugin'
[INFO] Retrieving previous metadata from apache.snapshots.https
[INFO] Uploading repository metadata for: 'org.apache.maven.plugins'
[INFO] Uploading project information for maven-war-plugin 2.2-20101110.070649-55
[INFO] Retrieving previous metadata from apache.snapshots.https
[INFO] Uploading repository metadata for: 'snapshot org.apache.maven.plugins:maven-war-plugin:2.2-SNAPSHOT'
[INFO] ------------------------------------------------------------------------
[INFO] Building Maven Plugins Aggregator
[INFO]    task-segment: [clean, deploy]
[INFO] ------------------------------------------------------------------------
[INFO] [clean:clean {execution: default-clean}]
[INFO] Deleting file set: /opt/grid/slave/workspace/maven-plugins-ITs/jdk/java-5x/label/ubuntu/trunk/target (included: [**], excluded: [])
[INFO] [remote-resources:process {execution: default}]
[INFO] [site:attach-descriptor {execution: default-attach-descriptor}]
[INFO] [install:install {execution: default-install}]
[INFO] Installing /opt/grid/slave/workspace/maven-plugins-ITs/jdk/java-5x/label/ubuntu/trunk/pom.xml to <https://grid.sonatype.org/ci/job/maven-plugins-ITs/./jdk=java-5x,label=ubuntu/ws/.repository/org/apache/maven/plugins/maven-plugins-aggregator/1-SNAPSHOT/maven-plugins-aggregator-1-SNAPSHOT.pom>
[INFO] [deploy:deploy {execution: default-deploy}]
[INFO] Retrieving previous build number from apache.snapshots.https
Uploading: http://repository.sonatype.org:8081/content/repositories/maven.snapshots/org/apache/maven/plugins/maven-plugins-aggregator/1-SNAPSHOT/maven-plugins-aggregator-1-20101110.070649-102.pom
3K uploaded  (maven-plugins-aggregator-1-20101110.070649-102.pom)
[INFO] Retrieving previous metadata from apache.snapshots.https
[INFO] Uploading repository metadata for: 'artifact org.apache.maven.plugins:maven-plugins-aggregator'
[INFO] Retrieving previous metadata from apache.snapshots.https
[INFO] Uploading repository metadata for: 'snapshot org.apache.maven.plugins:maven-plugins-aggregator:1-SNAPSHOT'
[INFO] 
[INFO] 
[INFO] ------------------------------------------------------------------------
[INFO] Reactor Summary:
[INFO] ------------------------------------------------------------------------
[INFO] Maven Plugins ......................................... SUCCESS [27.206s]
[INFO] Maven Invoker Plugin .................................. SUCCESS [7:40.652s]
[INFO] Maven Ant Plugin ...................................... SUCCESS [2:30.728s]
[INFO] Maven AntRun Plugin ................................... SUCCESS [1:38.989s]
[INFO] Maven Eclipse Plugin .................................. SUCCESS [8:26.719s]
[INFO] Maven Changelog Plugin ................................ SUCCESS [39.725s]
[INFO] Maven Changes Report Plugin ........................... SUCCESS [1:08.628s]
[INFO] Maven Checkstyle Plugin ............................... SUCCESS [2:03.339s]
[INFO] Maven Clean Plugin .................................... SUCCESS [25.969s]
[INFO] Maven Compiler Plugin ................................. SUCCESS [32.376s]
[INFO] Maven Dependency Plugin ............................... SUCCESS [4:22.319s]
[INFO] Maven Deploy Plugin ................................... SUCCESS [1:45.867s]
[INFO] Maven DOAP Plugin ..................................... SUCCESS [18.303s]
[INFO] Maven Documentation Checker Plugin .................... SUCCESS [24.770s]
[INFO] Maven EAR Plugin ...................................... FAILED [6:40.486s]
[INFO] Maven EJB Plugin ...................................... SUCCESS [1:07.522s]
[INFO] Maven GPG Plugin ...................................... SUCCESS [44.005s]
[INFO] Maven Help Plugin ..................................... SUCCESS [52.519s]
[INFO] Maven IDEA Plugin ..................................... SUCCESS [17.711s]
[INFO] Maven Install Plugin .................................. SUCCESS [1:37.511s]
[INFO] Maven JAR Plugin ...................................... SUCCESS [2:01.102s]
[INFO] Maven Jarsigner Plugin ................................ SUCCESS [1:06.122s]
[INFO] Maven Shade Plugin .................................... SUCCESS [2:53.841s]
[INFO] Maven Javadoc Plugin .................................. SUCCESS [26:40.774s]
[INFO] Maven Linkcheck Plugin ................................ SUCCESS [10.862s]
[INFO] Maven One Plugin ...................................... SUCCESS [11.174s]
[INFO] Maven Patch Plugin .................................... SUCCESS [40.505s]
[INFO] Maven PDF Plugin ...................................... SUCCESS [1:45.464s]
[INFO] Maven PMD Plugin ...................................... SUCCESS [52.673s]
[INFO] Maven RAR Plugin ...................................... SUCCESS [18.969s]
[INFO] Maven Reactor Plugin .................................. SUCCESS [8.397s]
[INFO] Maven Repository Plugin ............................... SUCCESS [1:31.243s]
[INFO] Maven Resources Plugin ................................ SUCCESS [1:06.610s]
[INFO] Maven Site Plugin ..................................... SUCCESS [5:37.979s]
[INFO] Maven Source Plugin ................................... SUCCESS [41.633s]
[INFO] Maven Stage Plugin .................................... SUCCESS [4.012s]
[INFO] Maven Toolchains Plugin ............................... SUCCESS [5.765s]
[INFO] Maven Verifier Plugin ................................. SUCCESS [16.101s]
[INFO] Maven WAR Plugin ...................................... SUCCESS [1:53.407s]
[INFO] Maven Plugins Aggregator .............................. SUCCESS [1.754s]
[INFO] ------------------------------------------------------------------------
[INFO] Error for project: Maven EAR Plugin (during deploy)
[INFO] ------------------------------------------------------------------------
[INFO] There are test failures.

Please refer to /opt/grid/slave/workspace/maven-plugins-ITs/jdk/java-5x/label/ubuntu/trunk/maven-ear-plugin/target/surefire-reports for the individual test results.
[INFO] ------------------------------------------------------------------------
[INFO] Trace
org.apache.maven.BuildFailureException: There are test failures.

Please refer to /opt/grid/slave/workspace/maven-plugins-ITs/jdk/java-5x/label/ubuntu/trunk/maven-ear-plugin/target/surefire-reports for the individual test results.
	at org.apache.maven.lifecycle.DefaultLifecycleExecutor.executeGoals(DefaultLifecycleExecutor.java:715)
	at org.apache.maven.lifecycle.DefaultLifecycleExecutor.executeGoalWithLifecycle(DefaultLifecycleExecutor.java:556)
	at org.apache.maven.lifecycle.DefaultLifecycleExecutor.executeGoal(DefaultLifecycleExecutor.java:535)
	at org.apache.maven.lifecycle.DefaultLifecycleExecutor.executeGoalAndHandleFailures(DefaultLifecycleExecutor.java:387)
	at org.apache.maven.lifecycle.DefaultLifecycleExecutor.executeTaskSegments(DefaultLifecycleExecutor.java:348)
	at org.apache.maven.lifecycle.DefaultLifecycleExecutor.execute(DefaultLifecycleExecutor.java:180)
	at org.apache.maven.DefaultMaven.doExecute(DefaultMaven.java:328)
	at org.apache.maven.DefaultMaven.execute(DefaultMaven.java:138)
	at org.apache.maven.cli.MavenCli.main(MavenCli.java:362)
	at org.apache.maven.cli.compat.CompatibleMain.main(CompatibleMain.java:60)
	at sun.reflect.NativeMethodAccessorImpl.invoke0(Native Method)
	at sun.reflect.NativeMethodAccessorImpl.invoke(NativeMethodAccessorImpl.java:39)
	at sun.reflect.DelegatingMethodAccessorImpl.invoke(DelegatingMethodAccessorImpl.java:25)
	at java.lang.reflect.Method.invoke(Method.java:592)
	at org.codehaus.classworlds.Launcher.launchEnhanced(Launcher.java:315)
	at org.codehaus.classworlds.Launcher.launch(Launcher.java:255)
	at org.codehaus.classworlds.Launcher.mainWithExitCode(Launcher.java:430)
	at org.codehaus.classworlds.Launcher.main(Launcher.java:375)
Caused by: org.apache.maven.plugin.MojoFailureException: There are test failures.

Please refer to /opt/grid/slave/workspace/maven-plugins-ITs/jdk/java-5x/label/ubuntu/trunk/maven-ear-plugin/target/surefire-reports for the individual test results.
	at org.apache.maven.plugin.surefire.SurefirePlugin.execute(SurefirePlugin.java:575)
	at org.apache.maven.plugin.DefaultPluginManager.executeMojo(DefaultPluginManager.java:490)
	at org.apache.maven.lifecycle.DefaultLifecycleExecutor.executeGoals(DefaultLifecycleExecutor.java:694)
	... 17 more
[INFO] ------------------------------------------------------------------------
[INFO] BUILD ERRORS
[INFO] ------------------------------------------------------------------------
[INFO] Total time: 91 minutes 55 seconds
[INFO] Finished at: Wed Nov 10 02:38:24 CST 2010
[INFO] Final Memory: 107M/203M
[INFO] ------------------------------------------------------------------------