You are viewing a plain text version of this content. The canonical link for it is here.
Posted to dev@knox.apache.org by Apache Jenkins Server <je...@builds.apache.org> on 2014/10/17 07:24:31 UTC
Build failed in Jenkins: Knox-0.5.0 » gateway-spi #13
See <https://builds.apache.org/job/Knox-0.5.0/org.apache.knox$gateway-spi/13/changes>
Changes:
[lmccay] KNOX-422 - provide support for IBM JVM - via Pascal Oliva
------------------------------------------
[INFO] ------------------------------------------------------------------------
[INFO] Building gateway-spi
[INFO] task-segment: [clean, install]
[INFO] ------------------------------------------------------------------------
[INFO] [clean:clean {execution: default-clean}]
[INFO] Deleting directory <https://builds.apache.org/job/Knox-0.5.0/org.apache.knox$gateway-spi/ws/target>
[INFO] [buildnumber:create {execution: default}]
[INFO] Checking for local modifications: skipped.
[INFO] Updating project files from SCM: skipped.
[INFO] Executing: /bin/sh -c cd <https://builds.apache.org/job/Knox-0.5.0/org.apache.knox$gateway-spi/ws/> && git rev-parse --verify HEAD
[INFO] Working directory: <https://builds.apache.org/job/Knox-0.5.0/org.apache.knox$gateway-spi/ws/>
[INFO] Storing buildNumber: 3fe0a8b23a2e4e9d26aaa6de8e325987054526bf at timestamp: 1413523444491
[INFO] Executing: /bin/sh -c cd <https://builds.apache.org/job/Knox-0.5.0/org.apache.knox$gateway-spi/ws/> && git rev-parse --verify HEAD
[INFO] Working directory: <https://builds.apache.org/job/Knox-0.5.0/org.apache.knox$gateway-spi/ws/>
[INFO] Storing buildScmBranch: UNKNOWN
[INFO] [resources:resources {execution: default-resources}]
[INFO] Using 'UTF-8' encoding to copy filtered resources.
[INFO] Copying 4 resources
[INFO] [compiler:compile {execution: default-compile}]
[INFO] Changes detected - recompiling the module!
[INFO] Compiling 73 source files to <https://builds.apache.org/job/Knox-0.5.0/org.apache.knox$gateway-spi/ws/target/classes>
[INFO] -------------------------------------------------------------
[WARNING] COMPILATION WARNING :
[INFO] -------------------------------------------------------------
[WARNING] Note: <https://builds.apache.org/job/Knox-0.5.0/org.apache.knox$gateway-spi/ws/src/main/java/org/apache/hadoop/gateway/dispatch/CappedBufferHttpEntity.java> uses or overrides a deprecated API.
[WARNING] Note: Recompile with -Xlint:deprecation for details.
[INFO] 2 warnings
[INFO] -------------------------------------------------------------
[INFO] -------------------------------------------------------------
[ERROR] COMPILATION ERROR :
[INFO] -------------------------------------------------------------
[ERROR] <https://builds.apache.org/job/Knox-0.5.0/org.apache.knox$gateway-spi/ws/src/main/java/org/apache/hadoop/gateway/services/security/impl/X509CertificateUtil.java>:[252,32] cannot find symbol
symbol : class ReflectiveOperationException
location: class org.apache.hadoop.gateway.services.security.impl.X509CertificateUtil
[ERROR] <https://builds.apache.org/job/Knox-0.5.0/org.apache.knox$gateway-spi/ws/src/main/java/org/apache/hadoop/gateway/services/security/impl/X509CertificateUtil.java>:[184,16] cannot find symbol
symbol : class ReflectiveOperationException
location: class org.apache.hadoop.gateway.services.security.impl.X509CertificateUtil
[INFO] 2 errors
[INFO] -------------------------------------------------------------
[INFO] ------------------------------------------------------------------------
[ERROR] BUILD FAILURE
[INFO] ------------------------------------------------------------------------
[INFO] Compilation failure
<https://builds.apache.org/job/Knox-0.5.0/org.apache.knox$gateway-spi/ws/src/main/java/org/apache/hadoop/gateway/services/security/impl/X509CertificateUtil.java>:[252,32] cannot find symbol
symbol : class ReflectiveOperationException
location: class org.apache.hadoop.gateway.services.security.impl.X509CertificateUtil
<https://builds.apache.org/job/Knox-0.5.0/org.apache.knox$gateway-spi/ws/src/main/java/org/apache/hadoop/gateway/services/security/impl/X509CertificateUtil.java>:[184,16] cannot find symbol
symbol : class ReflectiveOperationException
location: class org.apache.hadoop.gateway.services.security.impl.X509CertificateUtil
[INFO] ------------------------------------------------------------------------
[INFO] For more information, run Maven with the -e switch
[INFO] ------------------------------------------------------------------------
[INFO] Total time: 1 minute 17 seconds
[INFO] Finished at: Fri Oct 17 05:24:07 UTC 2014
[INFO] Final Memory: 68M/312M
[INFO] ------------------------------------------------------------------------
Jenkins build is back to normal : Knox-0.5.0 » gateway-spi #14
Posted by Apache Jenkins Server <je...@builds.apache.org>.
See <https://builds.apache.org/job/Knox-0.5.0/org.apache.knox$gateway-spi/14/changes>