You are viewing a plain text version of this content. The canonical link for it is here.
Posted to dev@lucene.apache.org by Policeman Jenkins Server <je...@thetaphi.de> on 2015/01/05 10:43:27 UTC
[JENKINS] Lucene-Solr-5.x-Linux (32bit/ibm-j9-jdk7) - Build # 11681
- Failure!
Build: http://jenkins.thetaphi.de/job/Lucene-Solr-5.x-Linux/11681/
Java: 32bit/ibm-j9-jdk7 -Xjit:exclude={org/apache/lucene/util/fst/FST.pack(IIF)Lorg/apache/lucene/util/fst/FST;} (asserts: true)
1 tests failed.
FAILED: org.apache.solr.update.HardAutoCommitTest.testCommitWithin
Error Message:
Exception during query
Stack Trace:
java.lang.RuntimeException: Exception during query
at __randomizedtesting.SeedInfo.seed([DA701C4449010A69:60A2733CCA2FE47C]:0)
at org.apache.solr.SolrTestCaseJ4.assertQ(SolrTestCaseJ4.java:730)
at org.apache.solr.update.HardAutoCommitTest.testCommitWithin(HardAutoCommitTest.java:79)
at sun.reflect.NativeMethodAccessorImpl.invoke0(Native Method)
at sun.reflect.NativeMethodAccessorImpl.invoke(NativeMethodAccessorImpl.java:94)
at sun.reflect.DelegatingMethodAccessorImpl.invoke(DelegatingMethodAccessorImpl.java:55)
at java.lang.reflect.Method.invoke(Method.java:619)
at com.carrotsearch.randomizedtesting.RandomizedRunner.invoke(RandomizedRunner.java:1618)
at com.carrotsearch.randomizedtesting.RandomizedRunner$6.evaluate(RandomizedRunner.java:827)
at com.carrotsearch.randomizedtesting.RandomizedRunner$7.evaluate(RandomizedRunner.java:863)
at com.carrotsearch.randomizedtesting.RandomizedRunner$8.evaluate(RandomizedRunner.java:877)
at com.carrotsearch.randomizedtesting.rules.SystemPropertiesRestoreRule$1.evaluate(SystemPropertiesRestoreRule.java:53)
at org.apache.lucene.util.TestRuleSetupTeardownChained$1.evaluate(TestRuleSetupTeardownChained.java:50)
at org.apache.lucene.util.AbstractBeforeAfterRule$1.evaluate(AbstractBeforeAfterRule.java:46)
at com.carrotsearch.randomizedtesting.rules.SystemPropertiesInvariantRule$1.evaluate(SystemPropertiesInvariantRule.java:55)
at org.apache.lucene.util.TestRuleThreadAndTestName$1.evaluate(TestRuleThreadAndTestName.java:49)
at org.apache.lucene.util.TestRuleIgnoreAfterMaxFailures$1.evaluate(TestRuleIgnoreAfterMaxFailures.java:65)
at org.apache.lucene.util.TestRuleMarkFailure$1.evaluate(TestRuleMarkFailure.java:48)
at com.carrotsearch.randomizedtesting.rules.StatementAdapter.evaluate(StatementAdapter.java:36)
at com.carrotsearch.randomizedtesting.ThreadLeakControl$StatementRunner.run(ThreadLeakControl.java:365)
at com.carrotsearch.randomizedtesting.ThreadLeakControl.forkTimeoutingTask(ThreadLeakControl.java:798)
at com.carrotsearch.randomizedtesting.ThreadLeakControl$3.evaluate(ThreadLeakControl.java:458)
at com.carrotsearch.randomizedtesting.RandomizedRunner.runSingleTest(RandomizedRunner.java:836)
at com.carrotsearch.randomizedtesting.RandomizedRunner$3.evaluate(RandomizedRunner.java:738)
at com.carrotsearch.randomizedtesting.RandomizedRunner$4.evaluate(RandomizedRunner.java:772)
at com.carrotsearch.randomizedtesting.RandomizedRunner$5.evaluate(RandomizedRunner.java:783)
at com.carrotsearch.randomizedtesting.rules.StatementAdapter.evaluate(StatementAdapter.java:36)
at com.carrotsearch.randomizedtesting.rules.SystemPropertiesRestoreRule$1.evaluate(SystemPropertiesRestoreRule.java:53)
at org.apache.lucene.util.AbstractBeforeAfterRule$1.evaluate(AbstractBeforeAfterRule.java:46)
at org.apache.lucene.util.TestRuleStoreClassName$1.evaluate(TestRuleStoreClassName.java:42)
at com.carrotsearch.randomizedtesting.rules.SystemPropertiesInvariantRule$1.evaluate(SystemPropertiesInvariantRule.java:55)
at com.carrotsearch.randomizedtesting.rules.NoShadowingOrOverridesOnMethodsRule$1.evaluate(NoShadowingOrOverridesOnMethodsRule.java:39)
at com.carrotsearch.randomizedtesting.rules.NoShadowingOrOverridesOnMethodsRule$1.evaluate(NoShadowingOrOverridesOnMethodsRule.java:39)
at com.carrotsearch.randomizedtesting.rules.StatementAdapter.evaluate(StatementAdapter.java:36)
at com.carrotsearch.randomizedtesting.rules.StatementAdapter.evaluate(StatementAdapter.java:36)
at com.carrotsearch.randomizedtesting.rules.StatementAdapter.evaluate(StatementAdapter.java:36)
at org.apache.lucene.util.TestRuleAssertionsRequired$1.evaluate(TestRuleAssertionsRequired.java:54)
at org.apache.lucene.util.TestRuleMarkFailure$1.evaluate(TestRuleMarkFailure.java:48)
at org.apache.lucene.util.TestRuleIgnoreAfterMaxFailures$1.evaluate(TestRuleIgnoreAfterMaxFailures.java:65)
at org.apache.lucene.util.TestRuleIgnoreTestSuites$1.evaluate(TestRuleIgnoreTestSuites.java:55)
at com.carrotsearch.randomizedtesting.rules.StatementAdapter.evaluate(StatementAdapter.java:36)
at com.carrotsearch.randomizedtesting.ThreadLeakControl$StatementRunner.run(ThreadLeakControl.java:365)
at java.lang.Thread.run(Thread.java:853)
Caused by: java.lang.RuntimeException: REQUEST FAILED: xpath=//result[@numFound=0]
xml response was: <?xml version="1.0" encoding="UTF-8"?>
<response>
<lst name="responseHeader"><int name="status">0</int><int name="QTime">2381</int></lst><result name="response" numFound="1" start="0"><doc><int name="id">529</int><arr name="range_facet_l"><long>529</long></arr><arr name="field_t"><str>what's inside?</str></arr><arr name="subject"><str>info</str></arr><long name="_version_">1489449191332642816</long><date name="timestamp">2015-01-05T09:17:19.366Z</date><int name="intDefault">42</int><arr name="multiDefault"><str>muLti-Default</str></arr></doc></result>
</response>
request was:start=0&rows=20&qt=standard&version=2.2&q=id:529
at org.apache.solr.SolrTestCaseJ4.assertQ(SolrTestCaseJ4.java:723)
... 41 more
Build Log:
[...truncated 9571 lines...]
[junit4] Suite: org.apache.solr.update.HardAutoCommitTest
[junit4] 2> Creating dataDir: /mnt/ssd/jenkins/workspace/Lucene-Solr-5.x-Linux/solr/build/solr-core/test/J0/temp/solr.update.HardAutoCommitTest-DA701C4449010A69-001/init-core-data-001
[junit4] 2> 771575 T4316 oas.SolrTestCaseJ4.buildSSLConfig Randomized ssl (false) and clientAuth (false)
[junit4] 2> 771576 T4316 oas.SolrTestCaseJ4.initCore ####initCore
[junit4] 2> 771576 T4316 oasc.SolrResourceLoader.<init> new SolrResourceLoader for directory: '/mnt/ssd/jenkins/workspace/Lucene-Solr-5.x-Linux/solr/core/src/test-files/solr/collection1/'
[junit4] 2> 771577 T4316 oasc.SolrResourceLoader.replaceClassLoader Adding 'file:/mnt/ssd/jenkins/workspace/Lucene-Solr-5.x-Linux/solr/core/src/test-files/solr/collection1/lib/.svn/' to classloader
[junit4] 2> 771577 T4316 oasc.SolrResourceLoader.replaceClassLoader Adding 'file:/mnt/ssd/jenkins/workspace/Lucene-Solr-5.x-Linux/solr/core/src/test-files/solr/collection1/lib/classes/' to classloader
[junit4] 2> 771578 T4316 oasc.SolrResourceLoader.replaceClassLoader Adding 'file:/mnt/ssd/jenkins/workspace/Lucene-Solr-5.x-Linux/solr/core/src/test-files/solr/collection1/lib/README' to classloader
[junit4] 2> 771591 T4316 oasc.SolrConfig.refreshRequestParams current version of requestparams : -1
[junit4] 2> 771628 T4316 oasc.SolrConfig.<init> Using Lucene MatchVersion: 5.0.0
[junit4] 2> 771685 T4316 oasc.SolrConfig.<init> Loaded SolrConfig: solrconfig.xml
[junit4] 2> 771685 T4316 oass.IndexSchema.readSchema Reading Solr Schema from /mnt/ssd/jenkins/workspace/Lucene-Solr-5.x-Linux/solr/core/src/test-files/solr/collection1/conf/schema.xml
[junit4] 2> 771691 T4316 oass.IndexSchema.readSchema [null] Schema name=test
[junit4] 2> 772037 T4316 oass.OpenExchangeRatesOrgProvider.init Initialized with rates=open-exchange-rates.json, refreshInterval=1440.
[junit4] 2> 772043 T4316 oass.IndexSchema.readSchema default search field in schema is text
[junit4] 2> 772045 T4316 oass.IndexSchema.readSchema unique key field: id
[junit4] 2> 772053 T4316 oass.FileExchangeRateProvider.reload Reloading exchange rates from file currency.xml
[junit4] 2> 772056 T4316 oass.FileExchangeRateProvider.reload Reloading exchange rates from file currency.xml
[junit4] 2> 772060 T4316 oass.OpenExchangeRatesOrgProvider.reload Reloading exchange rates from open-exchange-rates.json
[junit4] 2> 772060 T4316 oass.OpenExchangeRatesOrgProvider$OpenExchangeRates.<init> WARN Unknown key IMPORTANT NOTE
[junit4] 2> 772061 T4316 oass.OpenExchangeRatesOrgProvider$OpenExchangeRates.<init> WARN Expected key, got STRING
[junit4] 2> 772061 T4316 oass.OpenExchangeRatesOrgProvider.reload Reloading exchange rates from open-exchange-rates.json
[junit4] 2> 772062 T4316 oass.OpenExchangeRatesOrgProvider$OpenExchangeRates.<init> WARN Unknown key IMPORTANT NOTE
[junit4] 2> 772062 T4316 oass.OpenExchangeRatesOrgProvider$OpenExchangeRates.<init> WARN Expected key, got STRING
[junit4] 2> 772062 T4316 oasc.SolrResourceLoader.locateSolrHome JNDI not configured for solr (NoInitialContextEx)
[junit4] 2> 772063 T4316 oasc.SolrResourceLoader.locateSolrHome using system property solr.solr.home: /mnt/ssd/jenkins/workspace/Lucene-Solr-5.x-Linux/solr/core/src/test-files/solr
[junit4] 2> 772063 T4316 oasc.SolrResourceLoader.<init> new SolrResourceLoader for directory: '/mnt/ssd/jenkins/workspace/Lucene-Solr-5.x-Linux/solr/core/src/test-files/solr/'
[junit4] 2> 772106 T4316 oasc.CoreContainer.<init> New CoreContainer -2120515417
[junit4] 2> 772107 T4316 oasc.CoreContainer.load Loading cores into CoreContainer [instanceDir=/mnt/ssd/jenkins/workspace/Lucene-Solr-5.x-Linux/solr/core/src/test-files/solr/]
[junit4] 2> 772108 T4316 oashc.HttpShardHandlerFactory.getParameter Setting socketTimeout to: 0
[junit4] 2> 772108 T4316 oashc.HttpShardHandlerFactory.getParameter Setting urlScheme to: null
[junit4] 2> 772108 T4316 oashc.HttpShardHandlerFactory.getParameter Setting connTimeout to: 0
[junit4] 2> 772109 T4316 oashc.HttpShardHandlerFactory.getParameter Setting maxConnectionsPerHost to: 20
[junit4] 2> 772109 T4316 oashc.HttpShardHandlerFactory.getParameter Setting maxConnections to: 10000
[junit4] 2> 772109 T4316 oashc.HttpShardHandlerFactory.getParameter Setting corePoolSize to: 0
[junit4] 2> 772110 T4316 oashc.HttpShardHandlerFactory.getParameter Setting maximumPoolSize to: 2147483647
[junit4] 2> 772110 T4316 oashc.HttpShardHandlerFactory.getParameter Setting maxThreadIdleTime to: 5
[junit4] 2> 772110 T4316 oashc.HttpShardHandlerFactory.getParameter Setting sizeOfQueue to: -1
[junit4] 2> 772111 T4316 oashc.HttpShardHandlerFactory.getParameter Setting fairnessPolicy to: false
[junit4] 2> 772111 T4316 oasu.UpdateShardHandler.<init> Creating UpdateShardHandler HTTP client with params: socketTimeout=30000&connTimeout=30000&retry=false
[junit4] 2> 772112 T4316 oasl.LogWatcher.createWatcher SLF4J impl is org.slf4j.impl.Log4jLoggerFactory
[junit4] 2> 772112 T4316 oasl.LogWatcher.newRegisteredLogWatcher Registering Log Listener [Log4j (org.slf4j.impl.Log4jLoggerFactory)]
[junit4] 2> 772112 T4316 oasc.CoreContainer.load Host Name:
[junit4] 2> 772115 T4317 oasc.SolrResourceLoader.<init> new SolrResourceLoader for directory: '/mnt/ssd/jenkins/workspace/Lucene-Solr-5.x-Linux/solr/core/src/test-files/solr/collection1/'
[junit4] 2> 772116 T4317 oasc.SolrResourceLoader.replaceClassLoader Adding 'file:/mnt/ssd/jenkins/workspace/Lucene-Solr-5.x-Linux/solr/core/src/test-files/solr/collection1/lib/.svn/' to classloader
[junit4] 2> 772116 T4317 oasc.SolrResourceLoader.replaceClassLoader Adding 'file:/mnt/ssd/jenkins/workspace/Lucene-Solr-5.x-Linux/solr/core/src/test-files/solr/collection1/lib/classes/' to classloader
[junit4] 2> 772117 T4317 oasc.SolrResourceLoader.replaceClassLoader Adding 'file:/mnt/ssd/jenkins/workspace/Lucene-Solr-5.x-Linux/solr/core/src/test-files/solr/collection1/lib/README' to classloader
[junit4] 2> 772130 T4317 oasc.SolrConfig.refreshRequestParams current version of requestparams : -1
[junit4] 2> 772154 T4317 oasc.SolrConfig.<init> Using Lucene MatchVersion: 5.0.0
[junit4] 2> 772218 T4317 oasc.SolrConfig.<init> Loaded SolrConfig: solrconfig.xml
[junit4] 2> 772218 T4317 oass.IndexSchema.readSchema Reading Solr Schema from /mnt/ssd/jenkins/workspace/Lucene-Solr-5.x-Linux/solr/core/src/test-files/solr/collection1/conf/schema.xml
[junit4] 2> 772225 T4317 oass.IndexSchema.readSchema [collection1] Schema name=test
[junit4] 2> 772531 T4317 oass.OpenExchangeRatesOrgProvider.init Initialized with rates=open-exchange-rates.json, refreshInterval=1440.
[junit4] 2> 772536 T4317 oass.IndexSchema.readSchema default search field in schema is text
[junit4] 2> 772538 T4317 oass.IndexSchema.readSchema unique key field: id
[junit4] 2> 772544 T4317 oass.FileExchangeRateProvider.reload Reloading exchange rates from file currency.xml
[junit4] 2> 772547 T4317 oass.FileExchangeRateProvider.reload Reloading exchange rates from file currency.xml
[junit4] 2> 772550 T4317 oass.OpenExchangeRatesOrgProvider.reload Reloading exchange rates from open-exchange-rates.json
[junit4] 2> 772550 T4317 oass.OpenExchangeRatesOrgProvider$OpenExchangeRates.<init> WARN Unknown key IMPORTANT NOTE
[junit4] 2> 772551 T4317 oass.OpenExchangeRatesOrgProvider$OpenExchangeRates.<init> WARN Expected key, got STRING
[junit4] 2> 772551 T4317 oass.OpenExchangeRatesOrgProvider.reload Reloading exchange rates from open-exchange-rates.json
[junit4] 2> 772551 T4317 oass.OpenExchangeRatesOrgProvider$OpenExchangeRates.<init> WARN Unknown key IMPORTANT NOTE
[junit4] 2> 772552 T4317 oass.OpenExchangeRatesOrgProvider$OpenExchangeRates.<init> WARN Expected key, got STRING
[junit4] 2> 772552 T4317 oasc.CoreContainer.create Creating SolrCore 'collection1' using configuration from instancedir /mnt/ssd/jenkins/workspace/Lucene-Solr-5.x-Linux/solr/core/src/test-files/solr/collection1/
[junit4] 2> 772552 T4317 oasc.SolrCore.initDirectoryFactory org.apache.solr.core.MockDirectoryFactory
[junit4] 2> 772553 T4317 oasc.SolrCore.<init> [collection1] Opening new SolrCore at /mnt/ssd/jenkins/workspace/Lucene-Solr-5.x-Linux/solr/core/src/test-files/solr/collection1/, dataDir=/mnt/ssd/jenkins/workspace/Lucene-Solr-5.x-Linux/solr/build/solr-core/test/J0/temp/solr.update.HardAutoCommitTest-DA701C4449010A69-001/init-core-data-001/
[junit4] 2> 772553 T4317 oasc.JmxMonitoredMap.<init> JMX monitoring is enabled. Adding Solr mbeans to JMX Server: com.sun.jmx.mbeanserver.JmxMBeanServer@e075f9bc
[junit4] 2> 772554 T4317 oasc.CachingDirectoryFactory.get return new directory for /mnt/ssd/jenkins/workspace/Lucene-Solr-5.x-Linux/solr/build/solr-core/test/J0/temp/solr.update.HardAutoCommitTest-DA701C4449010A69-001/init-core-data-001
[junit4] 2> 772554 T4317 oasc.SolrCore.getNewIndexDir New index directory detected: old=null new=/mnt/ssd/jenkins/workspace/Lucene-Solr-5.x-Linux/solr/build/solr-core/test/J0/temp/solr.update.HardAutoCommitTest-DA701C4449010A69-001/init-core-data-001/index/
[junit4] 2> 772554 T4317 oasc.SolrCore.initIndex WARN [collection1] Solr index directory '/mnt/ssd/jenkins/workspace/Lucene-Solr-5.x-Linux/solr/build/solr-core/test/J0/temp/solr.update.HardAutoCommitTest-DA701C4449010A69-001/init-core-data-001/index' doesn't exist. Creating new index...
[junit4] 2> 772554 T4317 oasc.CachingDirectoryFactory.get return new directory for /mnt/ssd/jenkins/workspace/Lucene-Solr-5.x-Linux/solr/build/solr-core/test/J0/temp/solr.update.HardAutoCommitTest-DA701C4449010A69-001/init-core-data-001/index
[junit4] 2> 772555 T4317 oasu.RandomMergePolicy.<init> RandomMergePolicy wrapping class org.apache.lucene.index.TieredMergePolicy: [TieredMergePolicy: maxMergeAtOnce=37, maxMergeAtOnceExplicit=35, maxMergedSegmentMB=67.9208984375, floorSegmentMB=0.6416015625, forceMergeDeletesPctAllowed=10.229818797964885, segmentsPerTier=39.0, maxCFSSegmentSizeMB=8.796093022207999E12, noCFSRatio=0.0
[junit4] 2> 772555 T4317 oasc.SolrDeletionPolicy.onCommit SolrDeletionPolicy.onCommit: commits: num=1
[junit4] 2> commit{dir=RateLimitedDirectoryWrapper(MockDirectoryWrapper(RAMDirectory@962cd10c lockFactory=org.apache.lucene.store.SingleInstanceLockFactory@3728244f)),segFN=segments_1,generation=1}
[junit4] 2> 772556 T4317 oasc.SolrDeletionPolicy.updateCommits newest commit generation = 1
[junit4] 2> 772556 T4317 oasc.SolrCore.initWriters created xml: solr.XMLResponseWriter
[junit4] 2> 772558 T4317 oasup.UpdateRequestProcessorChain.init creating updateRequestProcessorChain "dedupe"
[junit4] 2> 772558 T4317 oasup.UpdateRequestProcessorChain.init inserting DistributedUpdateProcessorFactory into updateRequestProcessorChain "dedupe"
[junit4] 2> 772558 T4317 oasup.UpdateRequestProcessorChain.init creating updateRequestProcessorChain "dedupe-allfields"
[junit4] 2> 772559 T4317 oasup.UpdateRequestProcessorChain.init inserting DistributedUpdateProcessorFactory into updateRequestProcessorChain "dedupe-allfields"
[junit4] 2> 772559 T4317 oasup.UpdateRequestProcessorChain.init creating updateRequestProcessorChain "stored_sig"
[junit4] 2> 772559 T4317 oasup.UpdateRequestProcessorChain.init inserting DistributedUpdateProcessorFactory into updateRequestProcessorChain "stored_sig"
[junit4] 2> 772559 T4317 oasup.UpdateRequestProcessorChain.init creating updateRequestProcessorChain "uniq-fields"
[junit4] 2> 772560 T4317 oasup.UpdateRequestProcessorChain.init inserting DistributedUpdateProcessorFactory into updateRequestProcessorChain "uniq-fields"
[junit4] 2> 772560 T4317 oasup.UpdateRequestProcessorChain.init creating updateRequestProcessorChain "distrib-dup-test-chain-explicit"
[junit4] 2> 772560 T4317 oasup.UpdateRequestProcessorChain.init creating updateRequestProcessorChain "distrib-dup-test-chain-implicit"
[junit4] 2> 772561 T4317 oasup.UpdateRequestProcessorChain.init inserting DistributedUpdateProcessorFactory into updateRequestProcessorChain "distrib-dup-test-chain-implicit"
[junit4] 2> 772561 T4317 oasc.SolrCore.loadUpdateProcessorChains no updateRequestProcessorChain defined as default, creating implicit default
[junit4] 2> 772561 T4317 oasc.RequestHandlers.initHandlersFromConfig created /update: org.apache.solr.handler.UpdateRequestHandler
[junit4] 2> 772562 T4317 oasc.RequestHandlers.initHandlersFromConfig created /update/json: org.apache.solr.handler.UpdateRequestHandler
[junit4] 2> 772562 T4317 oasc.RequestHandlers.initHandlersFromConfig created /update/csv: org.apache.solr.handler.UpdateRequestHandler
[junit4] 2> 772562 T4317 oasc.RequestHandlers.initHandlersFromConfig created /update/json/docs: org.apache.solr.handler.UpdateRequestHandler
[junit4] 2> 772563 T4317 oasc.RequestHandlers.initHandlersFromConfig created /config: org.apache.solr.handler.SolrConfigHandler
[junit4] 2> 772563 T4317 oasc.RequestHandlers.initHandlersFromConfig created /schema: org.apache.solr.handler.SchemaHandler
[junit4] 2> 772563 T4317 oasc.RequestHandlers.initHandlersFromConfig created /replication: org.apache.solr.handler.ReplicationHandler
[junit4] 2> 772564 T4317 oasc.RequestHandlers.initHandlersFromConfig created /get: org.apache.solr.handler.RealTimeGetHandler
[junit4] 2> 772564 T4317 oasc.RequestHandlers.initHandlersFromConfig created /admin/luke: org.apache.solr.handler.admin.LukeRequestHandler
[junit4] 2> 772565 T4317 oasc.RequestHandlers.initHandlersFromConfig created /admin/system: org.apache.solr.handler.admin.SystemInfoHandler
[junit4] 2> 772565 T4317 oasc.RequestHandlers.initHandlersFromConfig created /admin/mbeans: org.apache.solr.handler.admin.SolrInfoMBeanHandler
[junit4] 2> 772565 T4317 oasc.RequestHandlers.initHandlersFromConfig created /admin/plugins: org.apache.solr.handler.admin.PluginInfoHandler
[junit4] 2> 772565 T4317 oasc.RequestHandlers.initHandlersFromConfig created /admin/threads: org.apache.solr.handler.admin.ThreadDumpHandler
[junit4] 2> 772566 T4317 oasc.RequestHandlers.initHandlersFromConfig created /admin/properties: org.apache.solr.handler.admin.PropertiesRequestHandler
[junit4] 2> 772566 T4317 oasc.RequestHandlers.initHandlersFromConfig created /admin/logging: org.apache.solr.handler.admin.LoggingHandler
[junit4] 2> 772566 T4317 oasc.RequestHandlers.initHandlersFromConfig created /admin/ping: org.apache.solr.handler.PingRequestHandler
[junit4] 2> 772567 T4317 oasc.RequestHandlers.initHandlersFromConfig created standard: solr.StandardRequestHandler
[junit4] 2> 772567 T4317 oasc.RequestHandlers.initHandlersFromConfig created dismax: solr.SearchHandler
[junit4] 2> 772567 T4317 oasc.RequestHandlers.initHandlersFromConfig created mock: org.apache.solr.core.MockQuerySenderListenerReqHandler
[junit4] 2> 772568 T4317 oasc.RequestHandlers.initHandlersFromConfig created /admin/file: solr.admin.ShowFileRequestHandler
[junit4] 2> 772568 T4317 oasc.RequestHandlers.initHandlersFromConfig created /admin/fileedit: solr.admin.EditFileRequestHandler
[junit4] 2> 772568 T4317 oasc.RequestHandlers.initHandlersFromConfig created defaults: solr.StandardRequestHandler
[junit4] 2> 772569 T4317 oasc.RequestHandlers.initHandlersFromConfig adding lazy requestHandler: solr.StandardRequestHandler
[junit4] 2> 772569 T4317 oasc.RequestHandlers.initHandlersFromConfig created lazy: solr.StandardRequestHandler
[junit4] 2> 772569 T4317 oasc.RequestHandlers.initHandlersFromConfig created /terms: org.apache.solr.handler.component.SearchHandler
[junit4] 2> 772569 T4317 oasc.RequestHandlers.initHandlersFromConfig created spellCheckCompRH: org.apache.solr.handler.component.SearchHandler
[junit4] 2> 772570 T4317 oasc.RequestHandlers.initHandlersFromConfig created spellCheckCompRH_Direct: org.apache.solr.handler.component.SearchHandler
[junit4] 2> 772570 T4317 oasc.RequestHandlers.initHandlersFromConfig created spellCheckWithWordbreak: org.apache.solr.handler.component.SearchHandler
[junit4] 2> 772570 T4317 oasc.RequestHandlers.initHandlersFromConfig created spellCheckWithWordbreak_Direct: org.apache.solr.handler.component.SearchHandler
[junit4] 2> 772571 T4317 oasc.RequestHandlers.initHandlersFromConfig created spellCheckCompRH1: org.apache.solr.handler.component.SearchHandler
[junit4] 2> 772571 T4317 oasc.RequestHandlers.initHandlersFromConfig created mltrh: org.apache.solr.handler.component.SearchHandler
[junit4] 2> 772571 T4317 oasc.RequestHandlers.initHandlersFromConfig created tvrh: org.apache.solr.handler.component.SearchHandler
[junit4] 2> 772572 T4317 oasc.RequestHandlers.initHandlersFromConfig created /mlt: solr.MoreLikeThisHandler
[junit4] 2> 772572 T4317 oasc.RequestHandlers.initHandlersFromConfig created /debug/dump: solr.DumpRequestHandler
[junit4] 2> 772572 T4317 oasc.RequestHandlers.initHandlersFromConfig created /search-facet-def: solr.SearchHandler
[junit4] 2> 772573 T4317 oasc.RequestHandlers.initHandlersFromConfig created /search-facet-invariants: solr.SearchHandler
[junit4] 2> 772574 T4317 oashl.XMLLoader.init xsltCacheLifetimeSeconds=60
[junit4] 2> 772575 T4317 oashl.XMLLoader.init xsltCacheLifetimeSeconds=60
[junit4] 2> 772576 T4317 oashl.XMLLoader.init xsltCacheLifetimeSeconds=60
[junit4] 2> 772577 T4317 oashl.XMLLoader.init xsltCacheLifetimeSeconds=60
[junit4] 2> 772578 T4317 oasc.SolrCore.initDeprecatedSupport WARN solrconfig.xml uses deprecated <admin/gettableFiles>, Please update your config to use the ShowFileRequestHandler.
[junit4] 2> 772579 T4317 oasc.SolrCore.initStatsCache Using default statsCache cache: org.apache.solr.search.stats.LocalStatsCache
[junit4] 2> 772580 T4317 oasu.CommitTracker.<init> Hard AutoCommit: disabled
[junit4] 2> 772580 T4317 oasu.CommitTracker.<init> Soft AutoCommit: disabled
[junit4] 2> 772581 T4317 oasu.RandomMergePolicy.<init> RandomMergePolicy wrapping class org.apache.lucene.index.TieredMergePolicy: [TieredMergePolicy: maxMergeAtOnce=21, maxMergeAtOnceExplicit=15, maxMergedSegmentMB=68.1259765625, floorSegmentMB=2.0322265625, forceMergeDeletesPctAllowed=15.90771393513273, segmentsPerTier=44.0, maxCFSSegmentSizeMB=8.796093022207999E12, noCFSRatio=0.5527810995080127
[junit4] 2> 772581 T4317 oasc.SolrDeletionPolicy.onInit SolrDeletionPolicy.onInit: commits: num=1
[junit4] 2> commit{dir=RateLimitedDirectoryWrapper(MockDirectoryWrapper(RAMDirectory@962cd10c lockFactory=org.apache.lucene.store.SingleInstanceLockFactory@3728244f)),segFN=segments_1,generation=1}
[junit4] 2> 772581 T4317 oasc.SolrDeletionPolicy.updateCommits newest commit generation = 1
[junit4] 2> 772582 T4317 oass.SolrIndexSearcher.<init> Opening Searcher@4f11a975[collection1] main
[junit4] 2> 772582 T4317 oasr.RestManager.init Initializing RestManager with initArgs: {storageIO=org.apache.solr.rest.ManagedResourceStorage$InMemoryStorageIO}
[junit4] 2> 772582 T4317 oasr.ManagedResourceStorage.load Reading _rest_managed.json using InMemoryStorage
[junit4] 2> 772583 T4317 oasr.RestManager.init Initializing 0 registered ManagedResources
[junit4] 2> 772583 T4317 oashc.SpellCheckComponent.inform Initializing spell checkers
[junit4] 2> 772587 T4317 oass.DirectSolrSpellChecker.init init: {name=direct,classname=DirectSolrSpellChecker,field=lowerfilt,minQueryLength=3}
[junit4] 2> 772614 T4317 oash.ReplicationHandler.inform Commits will be reserved for 10000
[junit4] 2> 772615 T4318 oashc.SpellCheckComponent$SpellCheckerListener.newSearcher Loading spell index for spellchecker: default
[junit4] 2> 772616 T4317 oasc.CoreContainer.registerCore registering core: collection1
[junit4] 2> 772616 T4318 oashc.SpellCheckComponent$SpellCheckerListener.newSearcher Loading spell index for spellchecker: direct
[junit4] 2> 772616 T4318 oashc.SpellCheckComponent$SpellCheckerListener.newSearcher Loading spell index for spellchecker: wordbreak
[junit4] 2> 772617 T4318 oashc.SpellCheckComponent$SpellCheckerListener.newSearcher Loading spell index for spellchecker: multipleFields
[junit4] 2> 772618 T4316 oas.SolrTestCaseJ4.initCore ####initCore end
[junit4] 2> 772618 T4318 oashc.SpellCheckComponent$SpellCheckerListener.newSearcher Loading spell index for spellchecker: jarowinkler
[junit4] 2> 772620 T4318 oashc.SpellCheckComponent$SpellCheckerListener.newSearcher Loading spell index for spellchecker: external
[junit4] 2> 772621 T4318 oashc.SpellCheckComponent$SpellCheckerListener.newSearcher Loading spell index for spellchecker: freq
[junit4] 2> 772622 T4318 oashc.SpellCheckComponent$SpellCheckerListener.newSearcher Loading spell index for spellchecker: fqcn
[junit4] 2> 772623 T4318 oashc.SpellCheckComponent$SpellCheckerListener.newSearcher Loading spell index for spellchecker: perDict
[junit4] 2> 772624 T4316 oas.SolrTestCaseJ4.setUp ###Starting testCommitWithin
[junit4] 2> 772625 T4318 oasc.SolrCore.registerSearcher [collection1] Registered new searcher Searcher@4f11a975[collection1] main{ExitableDirectoryReader(UninvertingDirectoryReader())}
[junit4] 2> ASYNC NEW_CORE C965 name=collection1 org.apache.solr.core.SolrCore@859a5c77
[junit4] 2> 772626 T4316 C965 oasup.LogUpdateProcessor.finish [collection1] webapp=null path=null params={} {deleteByQuery=*:* (-1489449188959715328)} 0 1
[junit4] 2> 772632 T4316 oasc.SolrResourceLoader.<init> new SolrResourceLoader for directory: '/mnt/ssd/jenkins/workspace/Lucene-Solr-5.x-Linux/solr/core/src/test-files/solr/collection1/'
[junit4] 2> 772633 T4316 oasc.SolrResourceLoader.replaceClassLoader Adding 'file:/mnt/ssd/jenkins/workspace/Lucene-Solr-5.x-Linux/solr/core/src/test-files/solr/collection1/lib/.svn/' to classloader
[junit4] 2> 772634 T4316 oasc.SolrResourceLoader.replaceClassLoader Adding 'file:/mnt/ssd/jenkins/workspace/Lucene-Solr-5.x-Linux/solr/core/src/test-files/solr/collection1/lib/classes/' to classloader
[junit4] 2> 772635 T4316 oasc.SolrResourceLoader.replaceClassLoader Adding 'file:/mnt/ssd/jenkins/workspace/Lucene-Solr-5.x-Linux/solr/core/src/test-files/solr/collection1/lib/README' to classloader
[junit4] 2> 772649 T4316 oasc.SolrConfig.refreshRequestParams current version of requestparams : -1
[junit4] 2> 772673 T4316 oasc.SolrConfig.<init> Using Lucene MatchVersion: 5.0.0
[junit4] 2> 772722 T4316 oasc.SolrConfig.<init> Loaded SolrConfig: solrconfig.xml
[junit4] 2> 772723 T4316 oass.IndexSchema.readSchema Reading Solr Schema from /mnt/ssd/jenkins/workspace/Lucene-Solr-5.x-Linux/solr/core/src/test-files/solr/collection1/conf/schema.xml
[junit4] 2> 772728 T4316 oass.IndexSchema.readSchema [collection1] Schema name=test
[junit4] 2> 773016 T4316 oass.OpenExchangeRatesOrgProvider.init Initialized with rates=open-exchange-rates.json, refreshInterval=1440.
[junit4] 2> 773021 T4316 oass.IndexSchema.readSchema default search field in schema is text
[junit4] 2> 773023 T4316 oass.IndexSchema.readSchema unique key field: id
[junit4] 2> 773029 T4316 oass.FileExchangeRateProvider.reload Reloading exchange rates from file currency.xml
[junit4] 2> 773033 T4316 oass.FileExchangeRateProvider.reload Reloading exchange rates from file currency.xml
[junit4] 2> 773036 T4316 oass.OpenExchangeRatesOrgProvider.reload Reloading exchange rates from open-exchange-rates.json
[junit4] 2> 773036 T4316 oass.OpenExchangeRatesOrgProvider$OpenExchangeRates.<init> WARN Unknown key IMPORTANT NOTE
[junit4] 2> 773037 T4316 oass.OpenExchangeRatesOrgProvider$OpenExchangeRates.<init> WARN Expected key, got STRING
[junit4] 2> 773037 T4316 oass.OpenExchangeRatesOrgProvider.reload Reloading exchange rates from open-exchange-rates.json
[junit4] 2> 773038 T4316 oass.OpenExchangeRatesOrgProvider$OpenExchangeRates.<init> WARN Unknown key IMPORTANT NOTE
[junit4] 2> 773038 T4316 oass.OpenExchangeRatesOrgProvider$OpenExchangeRates.<init> WARN Expected key, got STRING
[junit4] 2> 773039 T4316 oasc.CoreContainer.reload Reloading SolrCore 'collection1' using configuration from instancedir /mnt/ssd/jenkins/workspace/Lucene-Solr-5.x-Linux/solr/core/src/test-files/solr/collection1/
[junit4] 2> 773039 T4316 oasc.SolrCore.<init> [collection1] Opening new SolrCore at /mnt/ssd/jenkins/workspace/Lucene-Solr-5.x-Linux/solr/core/src/test-files/solr/collection1/, dataDir=/mnt/ssd/jenkins/workspace/Lucene-Solr-5.x-Linux/solr/build/solr-core/test/J0/temp/solr.update.HardAutoCommitTest-DA701C4449010A69-001/init-core-data-001/
[junit4] 2> 773040 T4316 oasc.JmxMonitoredMap.<init> JMX monitoring is enabled. Adding Solr mbeans to JMX Server: com.sun.jmx.mbeanserver.JmxMBeanServer@e075f9bc
[junit4] 2> 773040 T4316 oasc.SolrCore.getNewIndexDir New index directory detected: old=null new=/mnt/ssd/jenkins/workspace/Lucene-Solr-5.x-Linux/solr/build/solr-core/test/J0/temp/solr.update.HardAutoCommitTest-DA701C4449010A69-001/init-core-data-001/index/
[junit4] 2> 773041 T4316 oasc.SolrCore.initWriters created xml: solr.XMLResponseWriter
[junit4] 2> 773043 T4316 oasup.UpdateRequestProcessorChain.init creating updateRequestProcessorChain "dedupe"
[junit4] 2> 773044 T4316 oasup.UpdateRequestProcessorChain.init inserting DistributedUpdateProcessorFactory into updateRequestProcessorChain "dedupe"
[junit4] 2> 773044 T4316 oasup.UpdateRequestProcessorChain.init creating updateRequestProcessorChain "dedupe-allfields"
[junit4] 2> 773045 T4316 oasup.UpdateRequestProcessorChain.init inserting DistributedUpdateProcessorFactory into updateRequestProcessorChain "dedupe-allfields"
[junit4] 2> 773045 T4316 oasup.UpdateRequestProcessorChain.init creating updateRequestProcessorChain "stored_sig"
[junit4] 2> 773046 T4316 oasup.UpdateRequestProcessorChain.init inserting DistributedUpdateProcessorFactory into updateRequestProcessorChain "stored_sig"
[junit4] 2> 773046 T4316 oasup.UpdateRequestProcessorChain.init creating updateRequestProcessorChain "uniq-fields"
[junit4] 2> 773046 T4316 oasup.UpdateRequestProcessorChain.init inserting DistributedUpdateProcessorFactory into updateRequestProcessorChain "uniq-fields"
[junit4] 2> 773047 T4316 oasup.UpdateRequestProcessorChain.init creating updateRequestProcessorChain "distrib-dup-test-chain-explicit"
[junit4] 2> 773047 T4316 oasup.UpdateRequestProcessorChain.init creating updateRequestProcessorChain "distrib-dup-test-chain-implicit"
[junit4] 2> 773049 T4316 oasup.UpdateRequestProcessorChain.init inserting DistributedUpdateProcessorFactory into updateRequestProcessorChain "distrib-dup-test-chain-implicit"
[junit4] 2> 773050 T4316 oasc.SolrCore.loadUpdateProcessorChains no updateRequestProcessorChain defined as default, creating implicit default
[junit4] 2> 773050 T4316 oasc.RequestHandlers.initHandlersFromConfig created /update: org.apache.solr.handler.UpdateRequestHandler
[junit4] 2> 773051 T4316 oasc.RequestHandlers.initHandlersFromConfig created /update/json: org.apache.solr.handler.UpdateRequestHandler
[junit4] 2> 773051 T4316 oasc.RequestHandlers.initHandlersFromConfig created /update/csv: org.apache.solr.handler.UpdateRequestHandler
[junit4] 2> 773052 T4316 oasc.RequestHandlers.initHandlersFromConfig created /update/json/docs: org.apache.solr.handler.UpdateRequestHandler
[junit4] 2> 773053 T4316 oasc.RequestHandlers.initHandlersFromConfig created /config: org.apache.solr.handler.SolrConfigHandler
[junit4] 2> 773053 T4316 oasc.RequestHandlers.initHandlersFromConfig created /schema: org.apache.solr.handler.SchemaHandler
[junit4] 2> 773054 T4316 oasc.RequestHandlers.initHandlersFromConfig created /replication: org.apache.solr.handler.ReplicationHandler
[junit4] 2> 773054 T4316 oasc.RequestHandlers.initHandlersFromConfig created /get: org.apache.solr.handler.RealTimeGetHandler
[junit4] 2> 773055 T4316 oasc.RequestHandlers.initHandlersFromConfig created /admin/luke: org.apache.solr.handler.admin.LukeRequestHandler
[junit4] 2> 773056 T4316 oasc.RequestHandlers.initHandlersFromConfig created /admin/system: org.apache.solr.handler.admin.SystemInfoHandler
[junit4] 2> 773056 T4316 oasc.RequestHandlers.initHandlersFromConfig created /admin/mbeans: org.apache.solr.handler.admin.SolrInfoMBeanHandler
[junit4] 2> 773057 T4316 oasc.RequestHandlers.initHandlersFromConfig created /admin/plugins: org.apache.solr.handler.admin.PluginInfoHandler
[junit4] 2> 773057 T4316 oasc.RequestHandlers.initHandlersFromConfig created /admin/threads: org.apache.solr.handler.admin.ThreadDumpHandler
[junit4] 2> 773058 T4316 oasc.RequestHandlers.initHandlersFromConfig created /admin/properties: org.apache.solr.handler.admin.PropertiesRequestHandler
[junit4] 2> 773058 T4316 oasc.RequestHandlers.initHandlersFromConfig created /admin/logging: org.apache.solr.handler.admin.LoggingHandler
[junit4] 2> 773059 T4316 oasc.RequestHandlers.initHandlersFromConfig created /admin/ping: org.apache.solr.handler.PingRequestHandler
[junit4] 2> 773060 T4316 oasc.RequestHandlers.initHandlersFromConfig created standard: solr.StandardRequestHandler
[junit4] 2> 773060 T4316 oasc.RequestHandlers.initHandlersFromConfig created dismax: solr.SearchHandler
[junit4] 2> 773061 T4316 oasc.RequestHandlers.initHandlersFromConfig created mock: org.apache.solr.core.MockQuerySenderListenerReqHandler
[junit4] 2> 773061 T4316 oasc.RequestHandlers.initHandlersFromConfig created /admin/file: solr.admin.ShowFileRequestHandler
[junit4] 2> 773062 T4316 oasc.RequestHandlers.initHandlersFromConfig created /admin/fileedit: solr.admin.EditFileRequestHandler
[junit4] 2> 773062 T4316 oasc.RequestHandlers.initHandlersFromConfig created defaults: solr.StandardRequestHandler
[junit4] 2> 773063 T4316 oasc.RequestHandlers.initHandlersFromConfig adding lazy requestHandler: solr.StandardRequestHandler
[junit4] 2> 773063 T4316 oasc.RequestHandlers.initHandlersFromConfig created lazy: solr.StandardRequestHandler
[junit4] 2> 773064 T4316 oasc.RequestHandlers.initHandlersFromConfig created /terms: org.apache.solr.handler.component.SearchHandler
[junit4] 2> 773064 T4316 oasc.RequestHandlers.initHandlersFromConfig created spellCheckCompRH: org.apache.solr.handler.component.SearchHandler
[junit4] 2> 773065 T4316 oasc.RequestHandlers.initHandlersFromConfig created spellCheckCompRH_Direct: org.apache.solr.handler.component.SearchHandler
[junit4] 2> 773066 T4316 oasc.RequestHandlers.initHandlersFromConfig created spellCheckWithWordbreak: org.apache.solr.handler.component.SearchHandler
[junit4] 2> 773066 T4316 oasc.RequestHandlers.initHandlersFromConfig created spellCheckWithWordbreak_Direct: org.apache.solr.handler.component.SearchHandler
[junit4] 2> 773067 T4316 oasc.RequestHandlers.initHandlersFromConfig created spellCheckCompRH1: org.apache.solr.handler.component.SearchHandler
[junit4] 2> 773067 T4316 oasc.RequestHandlers.initHandlersFromConfig created mltrh: org.apache.solr.handler.component.SearchHandler
[junit4] 2> 773068 T4316 oasc.RequestHandlers.initHandlersFromConfig created tvrh: org.apache.solr.handler.component.SearchHandler
[junit4] 2> 773068 T4316 oasc.RequestHandlers.initHandlersFromConfig created /mlt: solr.MoreLikeThisHandler
[junit4] 2> 773069 T4316 oasc.RequestHandlers.initHandlersFromConfig created /debug/dump: solr.DumpRequestHandler
[junit4] 2> 773070 T4316 oasc.RequestHandlers.initHandlersFromConfig created /search-facet-def: solr.SearchHandler
[junit4] 2> 773070 T4316 oasc.RequestHandlers.initHandlersFromConfig created /search-facet-invariants: solr.SearchHandler
[junit4] 2> 773071 T4316 oashl.XMLLoader.init xsltCacheLifetimeSeconds=60
[junit4] 2> 773073 T4316 oashl.XMLLoader.init xsltCacheLifetimeSeconds=60
[junit4] 2> 773074 T4316 oashl.XMLLoader.init xsltCacheLifetimeSeconds=60
[junit4] 2> 773075 T4316 oashl.XMLLoader.init xsltCacheLifetimeSeconds=60
[junit4] 2> 773076 T4316 oasc.SolrCore.initDeprecatedSupport WARN solrconfig.xml uses deprecated <admin/gettableFiles>, Please update your config to use the ShowFileRequestHandler.
[junit4] 2> 773078 T4316 oasc.SolrCore.initStatsCache Using default statsCache cache: org.apache.solr.search.stats.LocalStatsCache
[junit4] 2> 773078 T4316 oasu.CommitTracker.<init> Hard AutoCommit: disabled
[junit4] 2> 773079 T4316 oasu.CommitTracker.<init> Soft AutoCommit: disabled
[junit4] 2> 773079 T4316 oass.SolrIndexSearcher.<init> Opening Searcher@4f20b023[collection1] main
[junit4] 2> 773080 T4316 oasr.RestManager.init Initializing RestManager with initArgs: {storageIO=org.apache.solr.rest.ManagedResourceStorage$InMemoryStorageIO}
[junit4] 2> 773080 T4316 oasr.ManagedResourceStorage.load Reading _rest_managed.json using InMemoryStorage
[junit4] 2> 773081 T4316 oasr.RestManager.init Initializing 0 registered ManagedResources
[junit4] 2> 773081 T4316 oashc.SpellCheckComponent.inform Initializing spell checkers
[junit4] 2> 773082 T4316 oass.DirectSolrSpellChecker.init init: {name=direct,classname=DirectSolrSpellChecker,field=lowerfilt,minQueryLength=3}
[junit4] 2> 773085 T4316 oash.ReplicationHandler.inform Commits will be reserved for 10000
[junit4] 2> 773086 T4320 oashc.SpellCheckComponent$SpellCheckerListener.newSearcher Loading spell index for spellchecker: default
[junit4] 2> 773087 T4320 oashc.SpellCheckComponent$SpellCheckerListener.newSearcher Loading spell index for spellchecker: direct
[junit4] 2> 773087 T4320 oashc.SpellCheckComponent$SpellCheckerListener.newSearcher Loading spell index for spellchecker: wordbreak
[junit4] 2> 773087 T4316 oasu.DefaultSolrCoreState.newIndexWriter Creating new IndexWriter...
[junit4] 2> 773087 T4320 oashc.SpellCheckComponent$SpellCheckerListener.newSearcher Loading spell index for spellchecker: multipleFields
[junit4] 2> 773088 T4316 oasu.DefaultSolrCoreState.newIndexWriter Waiting until IndexWriter is unused... core=collection1
[junit4] 2> 773088 T4316 oasu.DefaultSolrCoreState.newIndexWriter Closing old IndexWriter... core=collection1
[junit4] 2> 773088 T4320 oashc.SpellCheckComponent$SpellCheckerListener.newSearcher Loading spell index for spellchecker: jarowinkler
[junit4] 2> 773089 T4316 oasu.RandomMergePolicy.<init> RandomMergePolicy wrapping class org.apache.lucene.index.LogByteSizeMergePolicy: [LogByteSizeMergePolicy: minMergeSize=1677721, mergeFactor=22, maxMergeSize=2147483648, maxMergeSizeForForcedMerge=9223372036854775807, calibrateSizeByDeletes=false, maxMergeDocs=2147483647, maxCFSSegmentSizeMB=8.796093022207999E12, noCFSRatio=1.0]
[junit4] 2> 773089 T4320 oashc.SpellCheckComponent$SpellCheckerListener.newSearcher Loading spell index for spellchecker: external
[junit4] 2> 773090 T4316 oasc.SolrDeletionPolicy.onInit SolrDeletionPolicy.onInit: commits: num=1
[junit4] 2> commit{dir=RateLimitedDirectoryWrapper(MockDirectoryWrapper(RAMDirectory@962cd10c lockFactory=org.apache.lucene.store.SingleInstanceLockFactory@3728244f)),segFN=segments_1,generation=1}
[junit4] 2> 773090 T4320 oashc.SpellCheckComponent$SpellCheckerListener.newSearcher Loading spell index for spellchecker: freq
[junit4] 2> 773090 T4316 oasc.SolrDeletionPolicy.updateCommits newest commit generation = 1
[junit4] 2> 773091 T4320 oashc.SpellCheckComponent$SpellCheckerListener.newSearcher Loading spell index for spellchecker: fqcn
[junit4] 2> 773091 T4316 oasu.DefaultSolrCoreState.newIndexWriter New IndexWriter is ready to be used.
[junit4] 2> 773092 T4316 oasc.SolrCore.getSearcher WARN [collection1] PERFORMANCE WARNING: Overlapping onDeckSearchers=2
[junit4] 2> 773091 T4320 oashc.SpellCheckComponent$SpellCheckerListener.newSearcher Loading spell index for spellchecker: perDict
[junit4] 2> 773092 T4316 oass.SolrIndexSearcher.<init> Opening Searcher@45e58bbd[collection1] main
[junit4] 2> 773093 T4320 oasc.SolrCore.registerSearcher [collection1] Registered new searcher Searcher@4f20b023[collection1] main{ExitableDirectoryReader(UninvertingDirectoryReader())}
[junit4] 2> 773094 T4316 oasc.CoreContainer.registerCore replacing core: collection1
[junit4] 2> 773094 T4316 oasc.SolrCore.close [collection1] CLOSING SolrCore org.apache.solr.core.SolrCore@859a5c77
[junit4] 2> 773094 T4316 oasu.DirectUpdateHandler2.close closing DirectUpdateHandler2{commits=0,autocommits=0,soft autocommits=0,optimizes=0,rollbacks=0,expungeDeletes=0,docsPending=0,adds=0,deletesById=0,deletesByQuery=1,errors=0,cumulative_adds=0,cumulative_deletesById=0,cumulative_deletesByQuery=1,cumulative_errors=0,transaction_logs_total_size=0,transaction_logs_total_number=0}
[junit4] 2> 773095 T4320 oasc.SolrCore.registerSearcher [collection1] Registered new searcher Searcher@45e58bbd[collection1] main{ExitableDirectoryReader(UninvertingDirectoryReader())}
[junit4] 2> 773095 T4316 oasc.SolrCore.closeSearcher [collection1] Closing main searcher on request.
[junit4] 2> 774889 T4316 oasup.LogUpdateProcessor.finish [collection1] {add=[529 (1489449191332642816)]} 0 1775
[junit4] 2> 776889 T4321 oasu.DirectUpdateHandler2.commit start commit{,optimize=false,openSearcher=true,waitSearcher=true,expungeDeletes=false,softCommit=false,prepareCommit=false}
[junit4] 2> 776892 T4321 oasc.SolrDeletionPolicy.onCommit SolrDeletionPolicy.onCommit: commits: num=2
[junit4] 2> commit{dir=RateLimitedDirectoryWrapper(MockDirectoryWrapper(RAMDirectory@962cd10c lockFactory=org.apache.lucene.store.SingleInstanceLockFactory@3728244f)),segFN=segments_1,generation=1}
[junit4] 2> commit{dir=RateLimitedDirectoryWrapper(MockDirectoryWrapper(RAMDirectory@962cd10c lockFactory=org.apache.lucene.store.SingleInstanceLockFactory@3728244f)),segFN=segments_2,generation=2}
[junit4] 2> 776892 T4321 oasc.SolrDeletionPolicy.updateCommits newest commit generation = 2
[junit4] 2> 776894 T4321 oass.SolrIndexSearcher.<init> Opening Searcher@6efea249[collection1] main
[junit4] 2> 776895 T4321 oasu.DirectUpdateHandler2.commit end_commit_flush
[junit4] 2> 776896 T4320 oasc.SolrCore.registerSearcher [collection1] Registered new searcher Searcher@6efea249[collection1] main{ExitableDirectoryReader(UninvertingDirectoryReader(Uninverting(_0(5.0.0):c1)))}
[junit4] 2> ASYNC NEW_CORE C966 name=collection1 org.apache.solr.core.SolrCore@ab368639
[junit4] 2> 777271 T4316 C966 oasc.SolrCore.execute [collection1] webapp=null path=null params={start=0&rows=20&qt=standard&version=2.2&q=id:529} hits=1 status=0 QTime=2381
[junit4] 2> 777272 T4316 C966 oasc.SolrCore.execute WARN slow: [collection1] webapp=null path=null params={start=0&rows=20&qt=standard&version=2.2&q=id:529} hits=1 status=0 QTime=2381
[junit4] 2> 777318 T4316 oas.SolrTestCaseJ4.assertQ ERROR REQUEST FAILED: xpath=//result[@numFound=0]
[junit4] 2> xml response was: <?xml version="1.0" encoding="UTF-8"?>
[junit4] 2> <response>
[junit4] 2> <lst name="responseHeader"><int name="status">0</int><int name="QTime">2381</int></lst><result name="response" numFound="1" start="0"><doc><int name="id">529</int><arr name="range_facet_l"><long>529</long></arr><arr name="field_t"><str>what's inside?</str></arr><arr name="subject"><str>info</str></arr><long name="_version_">1489449191332642816</long><date name="timestamp">2015-01-05T09:17:19.366Z</date><int name="intDefault">42</int><arr name="multiDefault"><str>muLti-Default</str></arr></doc></result>
[junit4] 2> </response>
[junit4] 2>
[junit4] 2> request was:start=0&rows=20&qt=standard&version=2.2&q=id:529
[junit4] 2> 777319 T4316 oasc.SolrException.log ERROR REQUEST FAILED: start=0&rows=20&qt=standard&version=2.2&q=id:529:java.lang.RuntimeException: REQUEST FAILED: xpath=//result[@numFound=0]
[junit4] 2> xml response was: <?xml version="1.0" encoding="UTF-8"?>
[junit4] 2> <response>
[junit4] 2> <lst name="responseHeader"><int name="status">0</int><int name="QTime">2381</int></lst><result name="response" numFound="1" start="0"><doc><int name="id">529</int><arr name="range_facet_l"><long>529</long></arr><arr name="field_t"><str>what's inside?</str></arr><arr name="subject"><str>info</str></arr><long name="_version_">1489449191332642816</long><date name="timestamp">2015-01-05T09:17:19.366Z</date><int name="intDefault">42</int><arr name="multiDefault"><str>muLti-Default</str></arr></doc></result>
[junit4] 2> </response>
[junit4] 2>
[junit4] 2> request was:start=0&rows=20&qt=standard&version=2.2&q=id:529
[junit4] 2> at org.apache.solr.SolrTestCaseJ4.assertQ(SolrTestCaseJ4.java:723)
[junit4] 2> at org.apache.solr.update.HardAutoCommitTest.testCommitWithin(HardAutoCommitTest.java:79)
[junit4] 2> at sun.reflect.NativeMethodAccessorImpl.invoke0(Native Method)
[junit4] 2> at sun.reflect.NativeMethodAccessorImpl.invoke(NativeMethodAccessorImpl.java:94)
[junit4] 2> at sun.reflect.DelegatingMethodAccessorImpl.invoke(DelegatingMethodAccessorImpl.java:55)
[junit4] 2> at java.lang.reflect.Method.invoke(Method.java:619)
[junit4] 2> at com.carrotsearch.randomizedtesting.RandomizedRunner.invoke(RandomizedRunner.java:1618)
[junit4] 2> at com.carrotsearch.randomizedtesting.RandomizedRunner$6.evaluate(RandomizedRunner.java:827)
[junit4] 2> at com.carrotsearch.randomizedtesting.RandomizedRunner$7.evaluate(RandomizedRunner.java:863)
[junit4] 2> at com.carrotsearch.randomizedtesting.RandomizedRunner$8.evaluate(RandomizedRunner.java:877)
[junit4] 2> at com.carrotsearch.randomizedtesting.rules.SystemPropertiesRestoreRule$1.evaluate(SystemPropertiesRestoreRule.java:53)
[junit4] 2> at org.apache.lucene.util.TestRuleSetupTeardownChained$1.evaluate(TestRuleSetupTeardownChained.java:50)
[junit4] 2> at org.apache.lucene.util.AbstractBeforeAfterRule$1.evaluate(AbstractBeforeAfterRule.java:46)
[junit4] 2> at com.carrotsearch.randomizedtesting.rules.SystemPropertiesInvariantRule$1.evaluate(SystemPropertiesInvariantRule.java:55)
[junit4] 2> at org.apache.lucene.util.TestRuleThreadAndTestName$1.evaluate(TestRuleThreadAndTestName.java:49)
[junit4] 2> at org.apache.lucene.util.TestRuleIgnoreAfterMaxFailures$1.evaluate(TestRuleIgnoreAfterMaxFailures.java:65)
[junit4] 2> at org.apache.lucene.util.TestRuleMarkFailure$1.evaluate(TestRuleMarkFailure.java:48)
[junit4] 2> at com.carrotsearch.randomizedtesting.rules.StatementAdapter.evaluate(StatementAdapter.java:36)
[junit4] 2> at com.carrotsearch.randomizedtesting.ThreadLeakControl$StatementRunner.run(ThreadLeakControl.java:365)
[junit4] 2> at com.carrotsearch.randomizedtesting.ThreadLeakControl.forkTimeoutingTask(ThreadLeakControl.java:798)
[junit4] 2> at com.carrotsearch.randomizedtesting.ThreadLeakControl$3.evaluate(ThreadLeakControl.java:458)
[junit4] 2> at com.carrotsearch.randomizedtesting.RandomizedRunner.runSingleTest(RandomizedRunner.java:836)
[junit4] 2> at com.carrotsearch.randomizedtesting.RandomizedRunner$3.evaluate(RandomizedRunner.java:738)
[junit4] 2> at com.carrotsearch.randomizedtesting.RandomizedRunner$4.evaluate(RandomizedRunner.java:772)
[junit4] 2> at com.carrotsearch.randomizedtesting.RandomizedRunner$5.evaluate(RandomizedRunner.java:783)
[junit4] 2> at com.carrotsearch.randomizedtesting.rules.StatementAdapter.evaluate(StatementAdapter.java:36)
[junit4] 2> at com.carrotsearch.randomizedtesting.rules.SystemPropertiesRestoreRule$1.evaluate(SystemPropertiesRestoreRule.java:53)
[junit4] 2> at org.apache.lucene.util.AbstractBeforeAfterRule$1.evaluate(AbstractBeforeAfterRule.java:46)
[junit4] 2> at org.apache.lucene.util.TestRuleStoreClassName$1.evaluate(TestRuleStoreClassName.java:42)
[junit4] 2> at com.carrotsearch.randomizedtesting.rules.SystemPropertiesInvariantRule$1.evaluate(SystemPropertiesInvariantRule.java:55)
[junit4] 2> at com.carrotsearch.randomizedtesting.rules.NoShadowingOrOverridesOnMethodsRule$1.evaluate(NoShadowingOrOverridesOnMethodsRule.java:39)
[junit4] 2> at com.carrotsearch.randomizedtesting.rules.NoShadowingOrOverridesOnMethodsRule$1.evaluate(NoShadowingOrOverridesOnMethodsRule.java:39)
[junit4] 2> at com.carrotsearch.randomizedtesting.rules.StatementAdapter.evaluate(StatementAdapter.java:36)
[junit4] 2> at com.carrotsearch.randomizedtesting.rules.StatementAdapter.evaluate(StatementAdapter.java:36)
[junit4] 2> at com.carrotsearch.randomizedtesting.rules.StatementAdapter.evaluate(StatementAdapter.java:36)
[junit4] 2> at org.apache.lucene.util.TestRuleAssertionsRequired$1.evaluate(TestRuleAssertionsRequired.java:54)
[junit4] 2> at org.apache.lucene.util.TestRuleMarkFailure$1.evaluate(TestRuleMarkFailure.java:48)
[junit4] 2> at org.apache.lucene.util.TestRuleIgnoreAfterMaxFailures$1.evaluate(TestRuleIgnoreAfterMaxFailures.java:65)
[junit4] 2> at org.apache.lucene.util.TestRuleIgnoreTestSuites$1.evaluate(TestRuleIgnoreTestSuites.java:55)
[junit4] 2> at com.carrotsearch.randomizedtesting.rules.StatementAdapter.evaluate(StatementAdapter.java:36)
[junit4] 2> at com.carrotsearch.randomizedtesting.ThreadLeakControl$StatementRunner.run(ThreadLeakControl.java:365)
[junit4] 2> at java.lang.Thread.run(Thread.java:853)
[junit4] 2>
[junit4] 2> 777320 T4316 oas.SolrTestCaseJ4.tearDown ###Ending testCommitWithin
[junit4] 2> NOTE: reproduce with: ant test -Dtestcase=HardAutoCommitTest -Dtests.method=testCommitWithin -Dtests.seed=DA701C4449010A69 -Dtests.multiplier=3 -Dtests.slow=true -Dtests.locale=no_NO_NY -Dtests.timezone=Kwajalein -Dtests.asserts=true -Dtests.file.encoding=UTF-8
[junit4] ERROR 4.72s J0 | HardAutoCommitTest.testCommitWithin <<<
[junit4] > Throwable #1: java.lang.RuntimeException: Exception during query
[junit4] > at __randomizedtesting.SeedInfo.seed([DA701C4449010A69:60A2733CCA2FE47C]:0)
[junit4] > at org.apache.solr.SolrTestCaseJ4.assertQ(SolrTestCaseJ4.java:730)
[junit4] > at org.apache.solr.update.HardAutoCommitTest.testCommitWithin(HardAutoCommitTest.java:79)
[junit4] > at java.lang.Thread.run(Thread.java:853)
[junit4] > Caused by: java.lang.RuntimeException: REQUEST FAILED: xpath=//result[@numFound=0]
[junit4] > xml response was: <?xml version="1.0" encoding="UTF-8"?>
[junit4] > <response>
[junit4] > <lst name="responseHeader"><int name="status">0</int><int name="QTime">2381</int></lst><result name="response" numFound="1" start="0"><doc><int name="id">529</int><arr name="range_facet_l"><long>529</long></arr><arr name="field_t"><str>what's inside?</str></arr><arr name="subject"><str>info</str></arr><long name="_version_">1489449191332642816</long><date name="timestamp">2015-01-05T09:17:19.366Z</date><int name="intDefault">42</int><arr name="multiDefault"><str>muLti-Default</str></arr></doc></result>
[junit4] > </response>
[junit4] > request was:start=0&rows=20&qt=standard&version=2.2&q=id:529
[junit4] > at org.apache.solr.SolrTestCaseJ4.assertQ(SolrTestCaseJ4.java:723)
[junit4] > ... 41 more
[junit4] 2> 777341 T4316 oas.SolrTestCaseJ4.deleteCore ###deleteCore
[junit4] 2> 777342 T4316 oasc.CoreContainer.shutdown Shutting down CoreContainer instance=-2120515417
[junit4] 2> 777342 T4316 oasc.SolrCore.close [collection1] CLOSING SolrCore org.apache.solr.core.SolrCore@ab368639
[junit4] 2> 777342 T4316 oasu.DirectUpdateHandler2.close closing DirectUpdateHandler2{commits=1,autocommits=1,soft autocommits=0,optimizes=0,rollbacks=0,expungeDeletes=0,docsPending=0,adds=0,deletesById=0,deletesByQuery=0,errors=0,cumulative_adds=1,cumulative_deletesById=0,cumulative_deletesByQuery=0,cumulative_errors=0,transaction_logs_total_size=151,transaction_logs_total_number=1}
[junit4] 2> 777343 T4316 oasu.SolrCoreState.decrefSolrCoreState Closing SolrCoreState
[junit4] 2> 777343 T4316 oasu.DefaultSolrCoreState.closeIndexWriter SolrCoreState ref count has reached 0 - closing IndexWriter
[junit4] 2> 777344 T4316 oasu.DefaultSolrCoreState.closeIndexWriter closing IndexWriter with IndexWriterCloser
[junit4] 2> 777344 T4316 oasc.SolrCore.closeSearcher [collection1] Closing main searcher on request.
[junit4] 2> 777346 T4316 oasc.JmxMonitoredMap$SolrDynamicMBean.getMBeanInfo WARN Could not getStatistics on info bean org.apache.solr.handler.ReplicationHandler org.apache.solr.common.SolrException: openNewSearcher called on closed core
[junit4] 2> at org.apache.solr.core.SolrCore.openNewSearcher(SolrCore.java:1498)
[junit4] 2> at org.apache.solr.core.SolrCore.getSearcher(SolrCore.java:1736)
[junit4] 2> at org.apache.solr.core.SolrCore.getSearcher(SolrCore.java:1481)
[junit4] 2> at org.apache.solr.core.SolrCore.getSearcher(SolrCore.java:1416)
[junit4] 2> at org.apache.solr.handler.ReplicationHandler.getIndexVersion(ReplicationHandler.java:558)
[junit4] 2> at org.apache.solr.handler.ReplicationHandler.getStatistics(ReplicationHandler.java:575)
[junit4] 2> at org.apache.solr.core.JmxMonitoredMap$SolrDynamicMBean.getMBeanInfo(JmxMonitoredMap.java:257)
[junit4] 2> at com.sun.jmx.interceptor.DefaultMBeanServerInterceptor.getClassName(DefaultMBeanServerInterceptor.java:1816)
[junit4] 2> at com.sun.jmx.interceptor.DefaultMBeanServerInterceptor.safeGetClassName(DefaultMBeanServerInterceptor.java:1607)
[junit4] 2> at com.sun.jmx.interceptor.DefaultMBeanServerInterceptor.objectInstancesFromFilteredNamedObjects(DefaultMBeanServerInterceptor.java:1568)
[junit4] 2> at com.sun.jmx.interceptor.DefaultMBeanServerInterceptor.queryMBeansImpl(DefaultMBeanServerInterceptor.java:525)
[junit4] 2> at com.sun.jmx.interceptor.DefaultMBeanServerInterceptor.queryNames(DefaultMBeanServerInterceptor.java:538)
[junit4] 2> at com.sun.jmx.mbeanserver.JmxMBeanServer.queryNames(JmxMBeanServer.java:631)
[junit4] 2> at org.apache.solr.core.JmxMonitoredMap.clear(JmxMonitoredMap.java:120)
[junit4] 2> at org.apache.solr.core.SolrCore.close(SolrCore.java:1161)
[junit4] 2> at org.apache.solr.core.SolrCores.close(SolrCores.java:117)
[junit4] 2> at org.apache.solr.core.CoreContainer.shutdown(CoreContainer.java:366)
[junit4] 2> at org.apache.solr.util.TestHarness.close(TestHarness.java:337)
[junit4] 2> at org.apache.solr.SolrTestCaseJ4.deleteCore(SolrTestCaseJ4.java:641)
[junit4] 2> at org.apache.solr.SolrTestCaseJ4.afterClass(SolrTestCaseJ4.java:185)
[junit4] 2> at sun.reflect.GeneratedMethodAccessor31.invoke(Unknown Source)
[junit4] 2> at sun.reflect.DelegatingMethodAccessorImpl.invoke(DelegatingMethodAccessorImpl.java:55)
[junit4] 2> at java.lang.reflect.Method.invoke(Method.java:619)
[junit4] 2> at com.carrotsearch.randomizedtesting.RandomizedRunner.invoke(RandomizedRunner.java:1618)
[junit4] 2> at com.carrotsearch.randomizedtesting.RandomizedRunner$5.evaluate(RandomizedRunner.java:790)
[junit4] 2> at com.carrotsearch.randomizedtesting.rules.StatementAdapter.evaluate(StatementAdapter.java:36)
[junit4] 2> at com.carrotsearch.randomizedtesting.rules.SystemPropertiesRestoreRule$1.evaluate(SystemPropertiesRestoreRule.java:53)
[junit4] 2> at org.apache.lucene.util.AbstractBeforeAfterRule$1.evaluate(AbstractBeforeAfterRule.java:46)
[junit4] 2> at org.apache.lucene.util.TestRuleStoreClassName$1.evaluate(TestRuleStoreClassName.java:42)
[junit4] 2> at com.carrotsearch.randomizedtesting.rules.SystemPropertiesInvariantRule$1.evaluate(SystemPropertiesInvariantRule.java:55)
[junit4] 2> at com.carrotsearch.randomizedtesting.rules.NoShadowingOrOverridesOnMethodsRule$1.evaluate(NoShadowingOrOverridesOnMethodsRule.java:39)
[junit4] 2> at com.carrotsearch.randomizedtesting.rules.NoShadowingOrOverridesOnMethodsRule$1.evaluate(NoShadowingOrOverridesOnMethodsRule.java:39)
[junit4] 2> at com.carrotsearch.randomizedtesting.rules.StatementAdapter.evaluate(StatementAdapter.java:36)
[junit4] 2> at com.carrotsearch.randomizedtesting.rules.StatementAdapter.evaluate(StatementAdapter.java:36)
[junit4] 2> at com.carrotsearch.randomizedtesting.rules.StatementAdapter.evaluate(StatementAdapter.java:36)
[junit4] 2> at org.apache.lucene.util.TestRuleAssertionsRequired$1.evaluate(TestRuleAssertionsRequired.java:54)
[junit4] 2> at org.apache.lucene.util.TestRuleMarkFailure$1.evaluate(TestRuleMarkFailure.java:48)
[junit4] 2> at org.apache.lucene.util.TestRuleIgnoreAfterMaxFailures$1.evaluate(TestRuleIgnoreAfterMaxFailures.java:65)
[junit4] 2> at org.apache.lucene.util.TestRuleIgnoreTestSuites$1.evaluate(TestRuleIgnoreTestSuites.java:55)
[junit4] 2> at com.carrotsearch.randomizedtesting.rules.StatementAdapter.evaluate(StatementAdapter.java:36)
[junit4] 2> at com.carrotsearch.randomizedtesting.ThreadLeakControl$StatementRunner.run(ThreadLeakControl.java:365)
[junit4] 2> at java.lang.Thread.run(Thread.java:853)
[junit4] 2>
[junit4] 2> 777348 T4316 oasc.JmxMonitoredMap$SolrDynamicMBean.getMBeanInfo WARN Could not getStatistics on info bean org.apache.solr.search.SolrIndexSearcher org.apache.lucene.store.AlreadyClosedException: this IndexReader is closed
[junit4] 2> at org.apache.lucene.index.IndexReader.ensureOpen(IndexReader.java:274)
[junit4] 2> at org.apache.lucene.index.StandardDirectoryReader.getVersion(StandardDirectoryReader.java:326)
[junit4] 2> at org.apache.lucene.index.FilterDirectoryReader.getVersion(FilterDirectoryReader.java:119)
[junit4] 2> at org.apache.lucene.index.FilterDirectoryReader.getVersion(FilterDirectoryReader.java:119)
[junit4] 2> at org.apache.solr.search.SolrIndexSearcher.getStatistics(SolrIndexSearcher.java:2283)
[junit4] 2> at org.apache.solr.core.JmxMonitoredMap$SolrDynamicMBean.getMBeanInfo(JmxMonitoredMap.java:257)
[junit4] 2> at com.sun.jmx.interceptor.DefaultMBeanServerInterceptor.getClassName(DefaultMBeanServerInterceptor.java:1816)
[junit4] 2> at com.sun.jmx.interceptor.DefaultMBeanServerInterceptor.safeGetClassName(DefaultMBeanServerInterceptor.java:1607)
[junit4] 2> at com.sun.jmx.interceptor.DefaultMBeanServerInterceptor.objectInstancesFromFilteredNamedObjects(DefaultMBeanServerInterceptor.java:1568)
[junit4] 2> at com.sun.jmx.interceptor.DefaultMBeanServerInterceptor.queryMBeansImpl(DefaultMBeanServerInterceptor.java:525)
[junit4] 2> at com.sun.jmx.interceptor.DefaultMBeanServerInterceptor.queryNames(DefaultMBeanServerInterceptor.java:538)
[junit4] 2> at com.sun.jmx.mbeanserver.JmxMBeanServer.queryNames(JmxMBeanServer.java:631)
[junit4] 2> at org.apache.solr.core.JmxMonitoredMap.clear(JmxMonitoredMap.java:120)
[junit4] 2> at org.apache.solr.core.SolrCore.close(SolrCore.java:1161)
[junit4] 2> at org.apache.solr.core.SolrCores.close(SolrCores.java:117)
[junit4] 2> at org.apache.solr.core.CoreContainer.shutdown(CoreContainer.java:366)
[junit4] 2> at org.apache.solr.util.TestHarness.close(TestHarness.java:337)
[junit4] 2> at org.apache.solr.SolrTestCaseJ4.deleteCore(SolrTestCaseJ4.java:641)
[junit4] 2> at org.apache.solr.SolrTestCaseJ4.afterClass(SolrTestCaseJ4.java:185)
[junit4] 2> at sun.reflect.GeneratedMethodAccessor31.invoke(Unknown Source)
[junit4] 2> at sun.reflect.DelegatingMethodAccessorImpl.invoke(DelegatingMethodAccessorImpl.java:55)
[junit4] 2> at java.lang.reflect.Method.invoke(Method.java:619)
[junit4] 2> at com.carrotsearch.randomizedtesting.RandomizedRunner.invoke(RandomizedRunner.java:1618)
[junit4] 2> at com.carrotsearch.randomizedtesting.RandomizedRunner$5.evaluate(RandomizedRunner.java:790)
[junit4] 2> at com.carrotsearch.randomizedtesting.rules.StatementAdapter.evaluate(StatementAdapter.java:36)
[junit4] 2> at com.carrotsearch.randomizedtesting.rules.SystemPropertiesRestoreRule$1.evaluate(SystemPropertiesRestoreRule.java:53)
[junit4] 2> at org.apache.lucene.util.AbstractBeforeAfterRule$1.evaluate(AbstractBeforeAfterRule.java:46)
[junit4] 2> at org.apache.lucene.util.TestRuleStoreClassName$1.evaluate(TestRuleStoreClassName.java:42)
[junit4] 2> at com.carrotsearch.randomizedtesting.rules.SystemPropertiesInvariantRule$1.evaluate(SystemPropertiesInvariantRule.java:55)
[junit4] 2> at com.carrotsearch.randomizedtesting.rules.NoShadowingOrOverridesOnMethodsRule$1.evaluate(NoShadowingOrOverridesOnMethodsRule.java:39)
[junit4] 2> at com.carrotsearch.randomizedtesting.rules.NoShadowingOrOverridesOnMethodsRule$1.evaluate(NoShadowingOrOverridesOnMethodsRule.java:39)
[junit4] 2> at com.carrotsearch.randomizedtesting.rules.StatementAdapter.evaluate(StatementAdapter.java:36)
[junit4] 2> at com.carrotsearch.randomizedtesting.rules.StatementAdapter.evaluate(StatementAdapter.java:36)
[junit4] 2> at com.carrotsearch.randomizedtesting.rules.StatementAdapter.evaluate(StatementAdapter.java:36)
[junit4] 2> at org.apache.lucene.util.TestRuleAssertionsRequired$1.evaluate(TestRuleAssertionsRequired.java:54)
[junit4] 2> at org.apache.lucene.util.TestRuleMarkFailure$1.evaluate(TestRuleMarkFailure.java:48)
[junit4] 2> at org.apache.lucene.util.TestRuleIgnoreAfterMaxFailures$1.evaluate(TestRuleIgnoreAfterMaxFailures.java:65)
[junit4] 2> at org.apache.lucene.util.TestRuleIgnoreTestSuites$1.evaluate(TestRuleIgnoreTestSuites.java:55)
[junit4] 2> at com.carrotsearch.randomizedtesting.rules.StatementAdapter.evaluate(StatementAdapter.java:36)
[junit4] 2> at com.carrotsearch.randomizedtesting.ThreadLeakControl$StatementRunner.run(ThreadLeakControl.java:365)
[junit4] 2> at java.lang.Thread.run(Thread.java:853)
[junit4] 2>
[junit4] 2> 777352 T4316 oasc.JmxMonitoredMap$SolrDynamicMBean.getMBeanInfo WARN Could not getStatistics on info bean org.apache.solr.search.SolrIndexSearcher org.apache.lucene.store.AlreadyClosedException: this IndexReader is closed
[junit4] 2> at org.apache.lucene.index.IndexReader.ensureOpen(IndexReader.java:274)
[junit4] 2> at org.apache.lucene.index.StandardDirectoryReader.getVersion(StandardDirectoryReader.java:326)
[junit4] 2> at org.apache.lucene.index.FilterDirectoryReader.getVersion(FilterDirectoryReader.java:119)
[junit4] 2> at org.apache.lucene.index.FilterDirectoryReader.getVersion(FilterDirectoryReader.java:119)
[junit4] 2> at org.apache.solr.search.SolrIndexSearcher.getStatistics(SolrIndexSearcher.java:2283)
[junit4] 2> at org.apache.solr.core.JmxMonitoredMap$SolrDynamicMBean.getMBeanInfo(JmxMonitoredMap.java:257)
[junit4] 2> at com.sun.jmx.interceptor.DefaultMBeanServerInterceptor.getClassName(DefaultMBeanServerInterceptor.java:1816)
[junit4] 2> at com.sun.jmx.interceptor.DefaultMBeanServerInterceptor.safeGetClassName(DefaultMBeanServerInterceptor.java:1607)
[junit4] 2> at com.sun.jmx.interceptor.DefaultMBeanServerInterceptor.checkMBeanPermission(DefaultMBeanServerInterceptor.java:1825)
[junit4] 2> at com.sun.jmx.interceptor.DefaultMBeanServerInterceptor.getAttribute(DefaultMBeanServerInterceptor.java:656)
[junit4] 2> at com.sun.jmx.mbeanserver.JmxMBeanServer.getAttribute(JmxMBeanServer.java:690)
[junit4] 2> at javax.management.AttributeValueExp.getAttribute(AttributeValueExp.java:174)
[junit4] 2> at javax.management.AttributeValueExp.apply(AttributeValueExp.java:116)
[junit4] 2> at javax.management.BinaryRelQueryExp.apply(BinaryRelQueryExp.java:120)
[junit4] 2> at com.sun.jmx.interceptor.DefaultMBeanServerInterceptor.filterListOfObjectInstances(DefaultMBeanServerInterceptor.java:1638)
[junit4] 2> at com.sun.jmx.interceptor.DefaultMBeanServerInterceptor.queryNames(DefaultMBeanServerInterceptor.java:557)
[junit4] 2> at com.sun.jmx.mbeanserver.JmxMBeanServer.queryNames(JmxMBeanServer.java:631)
[junit4] 2> at org.apache.solr.core.JmxMonitoredMap.clear(JmxMonitoredMap.java:120)
[junit4] 2> at org.apache.solr.core.SolrCore.close(SolrCore.java:1161)
[junit4] 2> at org.apache.solr.core.SolrCores.close(SolrCores.java:117)
[junit4] 2> at org.apache.solr.core.CoreContainer.shutdown(CoreContainer.java:366)
[junit4] 2> at org.apache.solr.util.TestHarness.close(TestHarness.java:337)
[junit4] 2> at org.apache.solr.SolrTestCaseJ4.deleteCore(SolrTestCaseJ4.java:641)
[junit4] 2> at org.apache.solr.SolrTestCaseJ4.afterClass(SolrTestCaseJ4.java:185)
[junit4] 2> at sun.reflect.GeneratedMethodAccessor31.invoke(Unknown Source)
[junit4] 2> at sun.reflect.DelegatingMethodAccessorImpl.invoke(DelegatingMethodAccessorImpl.java:55)
[junit4] 2> at java.lang.reflect.Method.invoke(Method.java:619)
[junit4] 2> at com.carrotsearch.randomizedtesting.RandomizedRunner.invoke(RandomizedRunner.java:1618)
[junit4] 2> at com.carrotsearch.randomizedtesting.RandomizedRunner$5.evaluate(RandomizedRunner.java:790)
[junit4] 2> at com.carrotsearch.randomizedtesting.rules.StatementAdapter.evaluate(StatementAdapter.java:36)
[junit4] 2> at com.carrotsearch.randomizedtesting.rules.SystemPropertiesRestoreRule$1.evaluate(SystemPropertiesRestoreRule.java:53)
[junit4] 2> at org.apache.lucene.util.AbstractBeforeAfterRule$1.evaluate(AbstractBeforeAfterRule.java:46)
[junit4] 2> at org.apache.lucene.util.TestRuleStoreClassName$1.evaluate(TestRuleStoreClassName.java:42)
[junit4] 2> at com.carrotsearch.randomizedtesting.rules.SystemPropertiesInvariantRule$1.evaluate(SystemPropertiesInvariantRule.java:55)
[junit4] 2> at com.carrotsearch.randomizedtesting.rules.NoShadowingOrOverridesOnMethodsRule$1.evaluate(NoShadowingOrOverridesOnMethodsRule.java:39)
[junit4] 2> at com.carrotsearch.randomizedtesting.rules.NoShadowingOrOverridesOnMethodsRule$1.evaluate(NoShadowingOrOverridesOnMethodsRule.java:39)
[junit4] 2> at com.carrotsearch.randomizedtesting.rules.StatementAdapter.evaluate(StatementAdapter.java:36)
[junit4] 2> at com.carrotsearch.randomizedtesting.rules.StatementAdapter.evaluate(StatementAdapter.java:36)
[junit4] 2> at com.carrotsearch.randomizedtesting.rules.StatementAdapter.evaluate(StatementAdapter.java:36)
[junit4] 2> at org.apache.lucene.util.TestRuleAssertionsRequired$1.evaluate(TestRuleAssertionsRequired.java:54)
[junit4] 2> at org.apache.lucene.util.TestRuleMarkFailure$1.evaluate(TestRuleMarkFailure.java:48)
[junit4] 2> at org.apache.lucene.util.TestRuleIgnoreAfterMaxFailures$1.evaluate(TestRuleIgnoreAfterMaxFailures.java:65)
[junit4] 2> at org.apache.lucene.util.TestRuleIgnoreTestSuites$1.evaluate(TestRuleIgnoreTestSuites.java:55)
[junit4] 2> at com.carrotsearch.randomizedtesting.rules.StatementAdapter.evaluate(StatementAdapter.java:36)
[junit4] 2> at com.carrotsearch.randomizedtesting.ThreadLeakControl$StatementRunner.run(ThreadLeakControl.java:365)
[junit4] 2> at java.lang.Thread.run(Thread.java:853)
[junit4] 2>
[junit4] 2> 777353 T4316 oasc.JmxMonitoredMap$SolrDynamicMBean.getMBeanInfo WARN Could not getStatistics on info bean org.apache.solr.handler.ReplicationHandler org.apache.solr.common.SolrException: openNewSearcher called on closed core
[junit4] 2> at org.apache.solr.core.SolrCore.openNewSearcher(SolrCore.java:1498)
[junit4] 2> at org.apache.solr.core.SolrCore.getSearcher(SolrCore.java:1736)
[junit4] 2> at org.apache.solr.core.SolrCore.getSearcher(SolrCore.java:1481)
[junit4] 2> at org.apache.solr.core.SolrCore.getSearcher(SolrCore.java:1416)
[junit4] 2> at org.apache.solr.handler.ReplicationHandler.getIndexVersion(ReplicationHandler.java:558)
[junit4] 2> at org.apache.solr.handler.ReplicationHandler.getStatistics(ReplicationHandler.java:575)
[junit4] 2> at org.apache.solr.core.JmxMonitoredMap$SolrDynamicMBean.getMBeanInfo(JmxMonitoredMap.java:257)
[junit4] 2> at com.sun.jmx.interceptor.DefaultMBeanServerInterceptor.getClassName(DefaultMBeanServerInterceptor.java:1816)
[junit4] 2> at com.sun.jmx.interceptor.DefaultMBeanServerInterceptor.safeGetClassName(DefaultMBeanServerInterceptor.java:1607)
[junit4] 2> at com.sun.jmx.interceptor.DefaultMBeanServerInterceptor.checkMBeanPermission(DefaultMBeanServerInterceptor.java:1825)
[junit4] 2> at com.sun.jmx.interceptor.DefaultMBeanServerInterceptor.getAttribute(DefaultMBeanServerInterceptor.java:656)
[junit4] 2> at com.sun.jmx.mbeanserver.JmxMBeanServer.getAttribute(JmxMBeanServer.java:690)
[junit4] 2> at javax.management.AttributeValueExp.getAttribute(AttributeValueExp.java:174)
[junit4] 2> at javax.management.AttributeValueExp.apply(AttributeValueExp.java:116)
[junit4] 2> at javax.management.BinaryRelQueryExp.apply(BinaryRelQueryExp.java:120)
[junit4] 2> at com.sun.jmx.interceptor.DefaultMBeanServerInterceptor.filterListOfObjectInstances(DefaultMBeanServerInterceptor.java:1638)
[junit4] 2> at com.sun.jmx.interceptor.DefaultMBeanServerInterceptor.queryNames(DefaultMBeanServerInterceptor.java:557)
[junit4] 2> at com.sun.jmx.mbeanserver.JmxMBeanServer.queryNames(JmxMBeanServer.java:631)
[junit4] 2> at org.apache.solr.core.JmxMonitoredMap.clear(JmxMonitoredMap.java:120)
[junit4] 2> at org.apache.solr.core.SolrCore.close(SolrCore.java:1161)
[junit4] 2> at org.apache.solr.core.SolrCores.close(SolrCores.java:117)
[junit4] 2> at org.apache.solr.core.CoreContainer.shutdown(CoreContainer.java:366)
[junit4] 2> at org.apache.solr.util.TestHarness.close(TestHarness.java:337)
[junit4] 2> at org.apache.solr.SolrTestCaseJ4.deleteCore(SolrTestCaseJ4.java:641)
[junit4] 2> at org.apache.solr.SolrTestCaseJ4.afterClass(SolrTestCaseJ4.java:185)
[junit4] 2> at sun.reflect.GeneratedMethodAccessor31.invoke(Unknown Source)
[junit4] 2> at sun.reflect.DelegatingMethodAccessorImpl.invoke(DelegatingMethodAccessorImpl.java:55)
[junit4] 2> at java.lang.reflect.Method.invoke(Method.java:619)
[junit4] 2> at com.carrotsearch.randomizedtesting.RandomizedRunner.invoke(RandomizedRunner.java:1618)
[junit4] 2> at com.carrotsearch.randomizedtesting.RandomizedRunner$5.evaluate(RandomizedRunner.java:790)
[junit4] 2> at com.carrotsearch.randomizedtesting.rules.StatementAdapter.evaluate(StatementAdapter.java:36)
[junit4] 2> at com.carrotsearch.randomizedtesting.rules.SystemPropertiesRestoreRule$1.evaluate(SystemPropertiesRestoreRule.java:53)
[junit4] 2> at org.apache.lucene.util.AbstractBeforeAfterRule$1.evaluate(AbstractBeforeAfterRule.java:46)
[junit4] 2> at org.apache.lucene.util.TestRuleStoreClassName$1.evaluate(TestRuleStoreClassName.java:42)
[junit4] 2> at com.carrotsearch.randomizedtesting.rules.SystemPropertiesInvariantRule$1.evaluate(SystemPropertiesInvariantRule.java:55)
[junit4] 2> at com.carrotsearch.randomizedtesting.rules.NoShadowingOrOverridesOnMethodsRule$1.evaluate(NoShadowingOrOverridesOnMethodsRule.java:39)
[junit4] 2> at com.carrotsearch.randomizedtesting.rules.NoShadowingOrOverridesOnMethodsRule$1.evaluate(NoShadowingOrOverridesOnMethodsRule.java:39)
[junit4] 2> at com.carrotsearch.randomizedtesting.rules.StatementAdapter.evaluate(StatementAdapter.java:36)
[junit4] 2> at com.carrotsearch.randomizedtesting.rules.StatementAdapter.evaluate(StatementAdapter.java:36)
[junit4] 2> at com.carrotsearch.randomizedtesting.rules.StatementAdapter.evaluate(StatementAdapter.java:36)
[junit4] 2> at org.apache.lucene.util.TestRuleAssertionsRequired$1.evaluate(TestRuleAssertionsRequired.java:54)
[junit4] 2> at org.apache.lucene.util.TestRuleMarkFailure$1.evaluate(TestRuleMarkFailure.java:48)
[junit4] 2> at org.apache.lucene.util.TestRuleIgnoreAfterMaxFailures$1.evaluate(TestRuleIgnoreAfterMaxFailures.java:65)
[junit4] 2> at org.apache.lucene.util.TestRuleIgnoreTestSuites$1.evaluate(TestRuleIgnoreTestSuites.java:55)
[junit4] 2> at com.carrotsearch.randomizedtesting.rules.StatementAdapter.evaluate(StatementAdapter.java:36)
[junit4] 2> at com.carrotsearch.randomizedtesting.ThreadLeakControl$StatementRunner.run(ThreadLeakControl.java:365)
[junit4] 2> at java.lang.Thread.run(Thread.java:853)
[junit4] 2>
[junit4] 2> 777359 T4316 oasc.JmxMonitoredMap$SolrDynamicMBean.getMBeanInfo WARN Could not getStatistics on info bean org.apache.solr.search.SolrIndexSearcher org.apache.lucene.store.AlreadyClosedException: this IndexReader is closed
[junit4] 2> at org.apache.lucene.index.IndexReader.ensureOpen(IndexReader.java:274)
[junit4] 2> at org.apache.lucene.index.StandardDirectoryReader.getVersion(StandardDirectoryReader.java:326)
[junit4] 2> at org.apache.lucene.index.FilterDirectoryReader.getVersion(FilterDirectoryReader.java:119)
[junit4] 2> at org.apache.lucene.index.FilterDirectoryReader.getVersion(FilterDirectoryReader.java:119)
[junit4] 2> at org.apache.solr.search.SolrIndexSearcher.getStatistics(SolrIndexSearcher.java:2283)
[junit4] 2> at org.apache.solr.core.JmxMonitoredMap$SolrDynamicMBean.getMBeanInfo(JmxMonitoredMap.java:257)
[junit4] 2> at com.sun.jmx.interceptor.DefaultMBeanServerInterceptor.getClassName(DefaultMBeanServerInterceptor.java:1816)
[junit4] 2> at com.sun.jmx.interceptor.DefaultMBeanServerInterceptor.safeGetClassName(DefaultMBeanServerInterceptor.java:1607)
[junit4] 2> at com.sun.jmx.interceptor.DefaultMBeanServerInterceptor.checkMBeanPermission(DefaultMBeanServerInterceptor.java:1825)
[junit4] 2> at com.sun.jmx.interceptor.DefaultMBeanServerInterceptor.exclusiveUnregisterMBean(DefaultMBeanServerInterceptor.java:442)
[junit4] 2> at com.sun.jmx.interceptor.DefaultMBeanServerInterceptor.unregisterMBean(DefaultMBeanServerInterceptor.java:427)
[junit4] 2> at com.sun.jmx.mbeanserver.JmxMBeanServer.unregisterMBean(JmxMBeanServer.java:558)
[junit4] 2> at org.apache.solr.core.JmxMonitoredMap.clear(JmxMonitoredMap.java:124)
[junit4] 2> at org.apache.solr.core.SolrCore.close(SolrCore.java:1161)
[junit4] 2> at org.apache.solr.core.SolrCores.close(SolrCores.java:117)
[junit4] 2> at org.apache.solr.core.CoreContainer.shutdown(CoreContainer.java:366)
[junit4] 2> at org.apache.solr.util.TestHarness.close(TestHarness.java:337)
[junit4] 2> at org.apache.solr.SolrTestCaseJ4.deleteCore(SolrTestCaseJ4.java:641)
[junit4] 2> at org.apache.solr.SolrTestCaseJ4.afterClass(SolrTestCaseJ4.java:185)
[junit4] 2> at sun.reflect.GeneratedMethodAccessor31.invoke(Unknown Source)
[junit4] 2> at sun.reflect.DelegatingMethodAccessorImpl.invoke(DelegatingMethodAccessorImpl.java:55)
[junit4] 2> at java.lang.reflect.Method.invoke(Method.java:619)
[junit4] 2> at com.carrotsearch.randomizedtesting.RandomizedRunner.invoke(RandomizedRunner.java:1618)
[junit4] 2> at com.carrotsearch.randomizedtesting.RandomizedRunner$5.evaluate(RandomizedRunner.java:790)
[junit4] 2> at com.carrotsearch.randomizedtesting.rules.StatementAdapter.evaluate(StatementAdapter.java:36)
[junit4] 2> at com.carrotsearch.randomizedtesting.rules.SystemPropertiesRestoreRule$1.evaluate(SystemPropertiesRestoreRule.java:53)
[junit4] 2> at org.apache.lucene.util.AbstractBeforeAfterRule$1.evaluate(AbstractBeforeAfterRule.java:46)
[junit4] 2> at org.apache.lucene.util.TestRuleStoreClassName$1.evaluate(TestRuleStoreClassName.java:42)
[junit4] 2> at com.carrotsearch.randomizedtesting.rules.SystemPropertiesInvariantRule$1.evaluate(SystemPropertiesInvariantRule.java:55)
[junit4] 2> at com.carrotsearch.randomizedtesting.rules.NoShadowingOrOverridesOnMethodsRule$1.evaluate(NoShadowingOrOverridesOnMethodsRule.java:39)
[junit4] 2> at com.carrotsearch.randomizedtesting.rules.NoShadowingOrOverridesOnMethodsRule$1.evaluate(NoShadowingOrOverridesOnMethodsRule.java:39)
[junit4] 2> at com.carrotsearch.randomizedtesting.rules.StatementAdapter.evaluate(StatementAdapter.java:36)
[junit4] 2> at com.carrotsearch.randomizedtesting.rules.StatementAdapter.evaluate(StatementAdapter.java:36)
[junit4] 2> at com.carrotsearch.randomizedtesting.rules.StatementAdapter.evaluate(StatementAdapter.java:36)
[junit4] 2> at org.apache.lucene.util.TestRuleAssertionsRequired$1.evaluate(TestRuleAssertionsRequired.java:54)
[junit4] 2> at org.apache.lucene.util.TestRuleMarkFailure$1.evaluate(TestRuleMarkFailure.java:48)
[junit4] 2> at org.apache.lucene.util.TestRuleIgnoreAfterMaxFailures$1.evaluate(TestRuleIgnoreAfterMaxFailures.java:65)
[junit4] 2> at org.apache.lucene.util.TestRuleIgnoreTestSuites$1.evaluate(TestRuleIgnoreTestSuites.java:55)
[junit4] 2> at com.carrotsearch.randomizedtesting.rules.StatementAdapter.evaluate(StatementAdapter.java:36)
[junit4] 2> at com.carrotsearch.randomizedtesting.ThreadLeakControl$StatementRunner.run(ThreadLeakControl.java:365)
[junit4] 2> at java.lang.Thread.run(Thread.java:853)
[junit4] 2>
[junit4] 2> 777360 T4316 oasc.JmxMonitoredMap$SolrDynamicMBean.getMBeanInfo WARN Could not getStatistics on info bean org.apache.solr.handler.ReplicationHandler org.apache.solr.common.SolrException: openNewSearcher called on closed core
[junit4] 2> at org.apache.solr.core.SolrCore.openNewSearcher(SolrCore.java:1498)
[junit4] 2> at org.apache.solr.core.SolrCore.getSearcher(SolrCore.java:1736)
[junit4] 2> at org.apache.solr.core.SolrCore.getSearcher(SolrCore.java:1481)
[junit4] 2> at org.apache.solr.core.SolrCore.getSearcher(SolrCore.java:1416)
[junit4] 2> at org.apache.solr.handler.ReplicationHandler.getIndexVersion(ReplicationHandler.java:558)
[junit4] 2> at org.apache.solr.handler.ReplicationHandler.getStatistics(ReplicationHandler.java:575)
[junit4] 2> at org.apache.solr.core.JmxMonitoredMap$SolrDynamicMBean.getMBeanInfo(JmxMonitoredMap.java:257)
[junit4] 2> at com.sun.jmx.interceptor.DefaultMBeanServerInterceptor.getClassName(DefaultMBeanServerInterceptor.java:1816)
[junit4] 2> at com.sun.jmx.interceptor.DefaultMBeanServerInterceptor.safeGetClassName(DefaultMBeanServerInterceptor.java:1607)
[junit4] 2> at com.sun.jmx.interceptor.DefaultMBeanServerInterceptor.checkMBeanPermission(DefaultMBeanServerInterceptor.java:1825)
[junit4] 2> at com.sun.jmx.interceptor.DefaultMBeanServerInterceptor.exclusiveUnregisterMBean(DefaultMBeanServerInterceptor.java:442)
[junit4] 2> at com.sun.jmx.interceptor.DefaultMBeanServerInterceptor.unregisterMBean(DefaultMBeanServerInterceptor.java:427)
[junit4] 2> at com.sun.jmx.mbeanserver.JmxMBeanServer.unregisterMBean(JmxMBeanServer.java:558)
[junit4] 2> at org.apache.solr.core.JmxMonitoredMap.clear(JmxMonitoredMap.java:124)
[junit4] 2> at org.apache.solr.core.SolrCore.close(SolrCore.java:1161)
[junit4] 2> at org.apache.solr.core.SolrCores.close(SolrCores.java:117)
[junit4] 2> at org.apache.solr.core.CoreContainer.shutdown(CoreContainer.java:366)
[junit4] 2> at org.apache.solr.util.TestHarness.close(TestHarness.java:337)
[junit4] 2> at org.apache.solr.SolrTestCaseJ4.deleteCore(SolrTestCaseJ4.java:641)
[junit4] 2> at org.apache.solr.SolrTestCaseJ4.afterClass(SolrTestCaseJ4.java:185)
[junit4] 2> at sun.reflect.GeneratedMethodAccessor31.invoke(Unknown Source)
[junit4] 2> at sun.reflect.DelegatingMethodAccessorImpl.invoke(DelegatingMethodAccessorImpl.java:55)
[junit4] 2> at java.lang.reflect.Method.invoke(Method.java:619)
[junit4] 2> at com.carrotsearch.randomizedtesting.RandomizedRunner.invoke(RandomizedRunner.java:1618)
[junit4] 2> at com.carrotsearch.randomizedtesting.RandomizedRunner$5.evaluate(RandomizedRunner.java:790)
[junit4] 2> at com.carrotsearch.randomizedtesting.rules.StatementAdapter.evaluate(StatementAdapter.java:36)
[junit4] 2> at com.carrotsearch.randomizedtesting.rules.SystemPropertiesRestoreRule$1.evaluate(SystemPropertiesRestoreRule.java:53)
[junit4] 2> at org.apache.lucene.util.AbstractBeforeAfterRule$1.evaluate(AbstractBeforeAfterRule.java:46)
[junit4] 2> at org.apache.lucene.util.TestRuleStoreClassName$1.evaluate(TestRuleStoreClassName.java:42)
[junit4] 2> at com.carrotsearch.randomizedtesting.rules.SystemPropertiesInvariantRule$1.evaluate(SystemPropertiesInvariantRule.java:55)
[junit4] 2> at com.carrotsearch.randomizedtesting.rules.NoShadowingOrOverridesOnMethodsRule$1.evaluate(NoShadowingOrOverridesOnMethodsRule.java:39)
[junit4] 2> at com.carrotsearch.randomizedtesting.rules.NoShadowingOrOverridesOnMethodsRule$1.evaluate(NoShadowingOrOverridesOnMethodsRule.java:39)
[junit4] 2> at com.carrotsearch.randomizedtesting.rules.StatementAdapter.evaluate(StatementAdapter.java:36)
[junit4] 2> at com.carrotsearch.randomizedtesting.rules.StatementAdapter.evaluate(StatementAdapter.java:36)
[junit4] 2> at com.carrotsearch.randomizedtesting.rules.StatementAdapter.evaluate(StatementAdapter.java:36)
[junit4] 2> at org.apache.lucene.util.TestRuleAssertionsRequired$1.evaluate(TestRuleAssertionsRequired.java:54)
[junit4] 2> at org.apache.lucene.util.TestRuleMarkFailure$1.evaluate(TestRuleMarkFailure.java:48)
[junit4] 2> at org.apache.lucene.util.TestRuleIgnoreAfterMaxFailures$1.evaluate(TestRuleIgnoreAfterMaxFailures.java:65)
[junit4] 2> at org.apache.lucene.util.TestRuleIgnoreTestSuites$1.evaluate(TestRuleIgnoreTestSuites.java:55)
[junit4] 2> at com.carrotsearch.randomizedtesting.rules.StatementAdapter.evaluate(StatementAdapter.java:36)
[junit4] 2> at com.carrotsearch.randomizedtesting.ThreadLeakControl$StatementRunner.run(ThreadLeakControl.java:365)
[junit4] 2> at java.lang.Thread.run(Thread.java:853)
[junit4] 2>
[junit4] 2> 777366 T4316 oasc.CachingDirectoryFactory.close Closing MockDirectoryFactory - 2 directories currently being tracked
[junit4] 2> 777367 T4316 oasc.CachingDirectoryFactory.closeCacheValue looking to close /mnt/ssd/jenkins/workspace/Lucene-Solr-5.x-Linux/solr/build/solr-core/test/J0/temp/solr.update.HardAutoCommitTest-DA701C4449010A69-001/init-core-data-001/index [CachedDir<<refCount=0;path=/mnt/ssd/jenkins/workspace/Lucene-Solr-5.x-Linux/solr/build/solr-core/test/J0/temp/solr.update.HardAutoCommitTest-DA701C4449010A69-001/init-core-data-001/index;done=false>>]
[junit4] 2> 777367 T4316 oasc.CachingDirectoryFactory.close Closing directory: /mnt/ssd/jenkins/workspace/Lucene-Solr-5.x-Linux/solr/build/solr-core/test/J0/temp/solr.update.HardAutoCommitTest-DA701C4449010A69-001/init-core-data-001/index
[junit4] 2> 777368 T4316 oasc.CachingDirectoryFactory.closeCacheValue looking to close /mnt/ssd/jenkins/workspace/Lucene-Solr-5.x-Linux/solr/build/solr-core/test/J0/temp/solr.update.HardAutoCommitTest-DA701C4449010A69-001/init-core-data-001 [CachedDir<<refCount=0;path=/mnt/ssd/jenkins/workspace/Lucene-Solr-5.x-Linux/solr/build/solr-core/test/J0/temp/solr.update.HardAutoCommitTest-DA701C4449010A69-001/init-core-data-001;done=false>>]
[junit4] 2> 777368 T4316 oasc.CachingDirectoryFactory.close Closing directory: /mnt/ssd/jenkins/workspace/Lucene-Solr-5.x-Linux/solr/build/solr-core/test/J0/temp/solr.update.HardAutoCommitTest-DA701C4449010A69-001/init-core-data-001
[junit4] 2> NOTE: leaving temporary files on disk at: /mnt/ssd/jenkins/workspace/Lucene-Solr-5.x-Linux/solr/build/solr-core/test/J0/temp/solr.update.HardAutoCommitTest-DA701C4449010A69-001
[junit4] 2> NOTE: test params are: codec=Asserting(Lucene50), sim=DefaultSimilarity, locale=no_NO_NY, timezone=Kwajalein
[junit4] 2> NOTE: Linux 3.13.0-43-generic x86/IBM Corporation 1.7.0 (32-bit)/cpus=8,threads=1,free=73440424,total=276365312
[junit4] 2> NOTE: All tests run in this JVM: [TestLMDirichletSimilarityFactory, DocExpirationUpdateProcessorFactoryTest, TestExactStatsCache, DocValuesTest, TestCopyFieldCollectionResource, HdfsLockFactoryTest, SharedFSAutoReplicaFailoverTest, HighlighterConfigTest, AddSchemaFieldsUpdateProcessorFactoryTest, TestSolrXmlPersistence, TestOmitPositions, TestQuerySenderListener, BJQParserTest, MultiTermTest, TestQueryTypes, BadCopyFieldTest, SolrCoreCheckLockOnStartupTest, TestPhraseSuggestions, TestShardHandlerFactory, SimpleFacetsTest, DistributedQueryElevationComponentTest, UniqFieldsUpdateProcessorFactoryTest, DocValuesMissingTest, TestInfoStreamLogging, LeaderElectionTest, TestReplicationHandler, OverseerRolesTest, TestSweetSpotSimilarityFactory, TestStressRecovery, TestSimpleQParserPlugin, InfoHandlerTest, FieldAnalysisRequestHandlerTest, MergeStrategyTest, PathHierarchyTokenizerFactoryTest, PingRequestHandlerTest, DateMathParserTest, NoCacheHeaderTest, SuggesterFSTTest, SimpleMLTQParserTest, TestSurroundQueryParser, TestStressLucene, TestBinaryField, MinimalSchemaTest, TestBinaryResponseWriter, TestMiniSolrCloudCluster, TestSolrConfigHandlerConcurrent, TestSerializedLuceneMatchVersion, TestSolrXmlPersistor, CollectionsAPIAsyncDistributedZkTest, DirectUpdateHandlerTest, CursorPagingTest, DistributedExpandComponentTest, TestLazyCores, TestOrdValues, TestIBSimilarityFactory, DateFieldTest, TestCollationField, ParsingFieldUpdateProcessorsTest, AtomicUpdatesTest, TestNonNRTOpen, DOMUtilTest, TestCloudInspectUtil, DistanceFunctionTest, DeleteReplicaTest, TestBulkSchemaAPI, TestWriterPerf, CoreContainerCoreInitFailuresTest, DirectSolrConnectionTest, TestQuerySenderNoQuery, BlockDirectoryTest, DistributedQueryComponentOptimizationTest, TestFastOutputStream, SyncSliceTest, CursorMarkTest, TestAddFieldRealTimeGet, TestSolrQueryParserDefaultOperatorResource, DistributedQueryComponentCustomSortTest, CachingDirectoryFactoryTest, PeerSyncTest, TestCSVLoader, BasicDistributedZkTest, OverseerStatusTest, DistribCursorPagingTest, TestFunctionQuery, JSONWriterTest, AlternateDirectoryTest, ShardRoutingTest, TestSchemaVersionResource, TestReloadAndDeleteDocs, TestSchemaNameResource, RequestHandlersTest, SoftAutoCommitTest, HardAutoCommitTest]
[junit4] Completed on J0 in 5.82s, 1 test, 1 error <<< FAILURES!
[...truncated 889 lines...]
BUILD FAILED
/mnt/ssd/jenkins/workspace/Lucene-Solr-5.x-Linux/build.xml:529: The following error occurred while executing this line:
/mnt/ssd/jenkins/workspace/Lucene-Solr-5.x-Linux/build.xml:490: The following error occurred while executing this line:
/mnt/ssd/jenkins/workspace/Lucene-Solr-5.x-Linux/build.xml:61: The following error occurred while executing this line:
/mnt/ssd/jenkins/workspace/Lucene-Solr-5.x-Linux/extra-targets.xml:39: The following error occurred while executing this line:
/mnt/ssd/jenkins/workspace/Lucene-Solr-5.x-Linux/solr/build.xml:190: The following error occurred while executing this line:
/mnt/ssd/jenkins/workspace/Lucene-Solr-5.x-Linux/solr/common-build.xml:508: The following error occurred while executing this line:
/mnt/ssd/jenkins/workspace/Lucene-Solr-5.x-Linux/lucene/common-build.xml:1363: The following error occurred while executing this line:
/mnt/ssd/jenkins/workspace/Lucene-Solr-5.x-Linux/lucene/common-build.xml:970: There were test failures: 460 suites, 1869 tests, 1 error, 55 ignored (22 assumptions)
Total time: 84 minutes 2 seconds
Build step 'Invoke Ant' marked build as failure
[description-setter] Description set: Java: 32bit/ibm-j9-jdk7 -Xjit:exclude={org/apache/lucene/util/fst/FST.pack(IIF)Lorg/apache/lucene/util/fst/FST;} (asserts: true)
Archiving artifacts
Recording test results
Email was triggered for: Failure - Any
Sending email for trigger: Failure - Any