You are viewing a plain text version of this content. The canonical link for it is here.
Posted to builds@beam.apache.org by Apache Jenkins Server <je...@builds.apache.org> on 2022/09/07 05:35:44 UTC
Build failed in Jenkins: beam_PostCommit_XVR_Direct #3109
See <https://ci-beam.apache.org/job/beam_PostCommit_XVR_Direct/3109/display/redirect?page=changes>
Changes:
[Kenneth Knowles] Cosmetic checkstyle fix to TextRowCountEstimator
[Kenneth Knowles] Upgrade to Gradle 7.5.1
[Heejong Lee] [BEAM-22856] PythonService Beam version compatibility
------------------------------------------
[...truncated 1.43 MB...]
INFO root:portable_runner.py:577 Default Python SDK image for environment is apache/beam_python3.7_sdk:2.42.0.dev
INFO root:portable_runner.py:577 ==================== <function annotate_downstream_side_inputs at 0x7f9312deb8c0> ====================
INFO root:portable_runner.py:577 ==================== <function fix_side_input_pcoll_coders at 0x7f9312deb9e0> ====================
INFO root:portable_runner.py:577 ==================== <function pack_combiners at 0x7f9312debef0> ====================
INFO root:portable_runner.py:577 ==================== <function lift_combiners at 0x7f9312debf80> ====================
INFO root:portable_runner.py:577 ==================== <function expand_sdf at 0x7f9312dec170> ====================
INFO root:portable_runner.py:577 ==================== <function expand_gbk at 0x7f9312dec200> ====================
INFO root:portable_runner.py:577 ==================== <function sink_flattens at 0x7f9312dec320> ====================
INFO root:portable_runner.py:577 ==================== <function greedily_fuse at 0x7f9312dec3b0> ====================
INFO root:portable_runner.py:577 ==================== <function read_to_impulse at 0x7f9312dec440> ====================
INFO root:portable_runner.py:577 ==================== <function impulse_to_input at 0x7f9312dec4d0> ====================
INFO root:portable_runner.py:577 ==================== <function sort_stages at 0x7f9312dec710> ====================
INFO root:portable_runner.py:577 ==================== <function add_impulse_to_dangling_transforms at 0x7f9312dec830> ====================
INFO root:portable_runner.py:577 ==================== <function setup_timer_mapping at 0x7f9312dec680> ====================
INFO root:portable_runner.py:577 ==================== <function populate_data_channel_coders at 0x7f9312dec7a0> ====================
INFO root:portable_runner.py:577 starting control server on port 44903
INFO root:portable_runner.py:577 starting data server on port 39657
INFO root:portable_runner.py:577 starting state server on port 41671
INFO root:portable_runner.py:577 starting logging server on port 38287
INFO root:portable_runner.py:577 Created Worker handler <apache_beam.runners.portability.fn_api_runner.worker_handlers.DockerSdkWorkerHandler object at 0x7f93396cff50> for environment ref_Environment_default_environment_2 (beam:env:docker:v1, b'\n$apache/beam_python3.7_sdk:2.42.0.dev')
INFO root:portable_runner.py:577 Attempting to pull image apache/beam_python3.7_sdk:2.42.0.dev
INFO root:portable_runner.py:577 Unable to pull image apache/beam_python3.7_sdk:2.42.0.dev, defaulting to local image if it exists
INFO root:portable_runner.py:577 Waiting for docker to start up. Current status is running
INFO root:portable_runner.py:577 Docker container is running. container_id = b'0a87954e4565a8abb387ed000e0c0553f0ef0eac0dee4a56c2990507746c8af1', worker_id = worker_79
INFO root:portable_runner.py:577 Created Worker handler <apache_beam.runners.portability.fn_api_runner.worker_handlers.DockerSdkWorkerHandler object at 0x7f93396cae50> for environment external_7beam:env:docker:v1 (beam:env:docker:v1, b'\n apache/beam_java8_sdk:2.42.0.dev')
INFO root:portable_runner.py:577 Attempting to pull image apache/beam_java8_sdk:2.42.0.dev
INFO root:portable_runner.py:577 Unable to pull image apache/beam_java8_sdk:2.42.0.dev, defaulting to local image if it exists
INFO root:portable_runner.py:577 Waiting for docker to start up. Current status is running
INFO root:portable_runner.py:577 Docker container is running. container_id = b'1100086efdfe583b97019c685ec4504e1405e0f7c84e3f53379c3a9286b4c25a', worker_id = worker_80
INFO root:portable_runner.py:577 Completed job in 13.238803386688232 seconds with state DONE.
INFO apache_beam.runners.portability.portable_runner:portable_runner.py:583 Job state changed to DONE
PASSED [ 77%]
apache_beam/transforms/sql_test.py::SqlTransformTest::test_windowing_before_sql
-------------------------------- live log call ---------------------------------
INFO apache_beam.utils.subprocess_server:subprocess_server.py:239 Using pre-built snapshot at <https://ci-beam.apache.org/job/beam_PostCommit_XVR_Direct/ws/src/sdks/java/extensions/sql/expansion-service/build/libs/beam-sdks-java-extensions-sql-expansion-service-2.42.0-SNAPSHOT.jar>
INFO root:external.py:773 Starting a JAR-based expansion service from JAR <https://ci-beam.apache.org/job/beam_PostCommit_XVR_Direct/ws/src/sdks/java/extensions/sql/expansion-service/build/libs/beam-sdks-java-extensions-sql-expansion-service-2.42.0-SNAPSHOT.jar>
INFO apache_beam.utils.subprocess_server:subprocess_server.py:116 Starting service with ['java' '-jar' '<https://ci-beam.apache.org/job/beam_PostCommit_XVR_Direct/ws/src/sdks/java/extensions/sql/expansion-service/build/libs/beam-sdks-java-extensions-sql-expansion-service-2.42.0-SNAPSHOT.jar'> '60205' '--filesToStage=<https://ci-beam.apache.org/job/beam_PostCommit_XVR_Direct/ws/src/sdks/java/extensions/sql/expansion-service/build/libs/beam-sdks-java-extensions-sql-expansion-service-2.42.0-SNAPSHOT.jar']>
INFO apache_beam.utils.subprocess_server:subprocess_server.py:126 Starting expansion service at localhost:60205
INFO apache_beam.utils.subprocess_server:subprocess_server.py:126 Sep 07, 2022 5:34:44 AM org.apache.beam.sdk.expansion.service.ExpansionService loadRegisteredTransforms
INFO apache_beam.utils.subprocess_server:subprocess_server.py:126 INFO: Registering external transforms: [beam:external:java:sql:v1, beam:transform:org.apache.beam:pubsub_read:v1, beam:transform:org.apache.beam:pubsub_write:v1, beam:transform:org.apache.beam:pubsublite_write:v1, beam:transform:org.apache.beam:pubsublite_read:v1, beam:transform:org.apache.beam:spanner_insert:v1, beam:transform:org.apache.beam:spanner_update:v1, beam:transform:org.apache.beam:spanner_replace:v1, beam:transform:org.apache.beam:spanner_insert_or_update:v1, beam:transform:org.apache.beam:spanner_delete:v1, beam:transform:org.apache.beam:spanner_read:v1, beam:transform:org.apache.beam:kafka_read_with_metadata:v1, beam:transform:org.apache.beam:kafka_read_without_metadata:v1, beam:transform:org.apache.beam:kafka_write:v1, beam:external:java:generate_sequence:v1]
INFO apache_beam.utils.subprocess_server:subprocess_server.py:126 beam:external:java:sql:v1: org.apache.beam.sdk.expansion.service.ExpansionService$ExternalTransformRegistrarLoader$1@47eaca72
INFO apache_beam.utils.subprocess_server:subprocess_server.py:126 beam:transform:org.apache.beam:pubsub_read:v1: org.apache.beam.sdk.expansion.service.ExpansionService$ExternalTransformRegistrarLoader$1@55141def
INFO apache_beam.utils.subprocess_server:subprocess_server.py:126 beam:transform:org.apache.beam:pubsub_write:v1: org.apache.beam.sdk.expansion.service.ExpansionService$ExternalTransformRegistrarLoader$1@55182842
INFO apache_beam.utils.subprocess_server:subprocess_server.py:126 beam:transform:org.apache.beam:pubsublite_write:v1: org.apache.beam.sdk.expansion.service.ExpansionService$ExternalTransformRegistrarLoader$1@3270d194
INFO apache_beam.utils.subprocess_server:subprocess_server.py:126 beam:transform:org.apache.beam:pubsublite_read:v1: org.apache.beam.sdk.expansion.service.ExpansionService$ExternalTransformRegistrarLoader$1@235834f2
INFO apache_beam.utils.subprocess_server:subprocess_server.py:126 beam:transform:org.apache.beam:spanner_insert:v1: org.apache.beam.sdk.expansion.service.ExpansionService$ExternalTransformRegistrarLoader$1@5656be13
INFO apache_beam.utils.subprocess_server:subprocess_server.py:126 beam:transform:org.apache.beam:spanner_update:v1: org.apache.beam.sdk.expansion.service.ExpansionService$ExternalTransformRegistrarLoader$1@4218d6a3
INFO apache_beam.utils.subprocess_server:subprocess_server.py:126 beam:transform:org.apache.beam:spanner_replace:v1: org.apache.beam.sdk.expansion.service.ExpansionService$ExternalTransformRegistrarLoader$1@76505305
INFO apache_beam.utils.subprocess_server:subprocess_server.py:126 beam:transform:org.apache.beam:spanner_insert_or_update:v1: org.apache.beam.sdk.expansion.service.ExpansionService$ExternalTransformRegistrarLoader$1@14cd1699
INFO apache_beam.utils.subprocess_server:subprocess_server.py:126 beam:transform:org.apache.beam:spanner_delete:v1: org.apache.beam.sdk.expansion.service.ExpansionService$ExternalTransformRegistrarLoader$1@77888435
INFO apache_beam.utils.subprocess_server:subprocess_server.py:126 beam:transform:org.apache.beam:spanner_read:v1: org.apache.beam.sdk.expansion.service.ExpansionService$ExternalTransformRegistrarLoader$1@73a1e9a9
INFO apache_beam.utils.subprocess_server:subprocess_server.py:126 beam:transform:org.apache.beam:kafka_read_with_metadata:v1: org.apache.beam.sdk.expansion.service.ExpansionService$ExternalTransformRegistrarLoader$1@71d44a3
INFO apache_beam.utils.subprocess_server:subprocess_server.py:126 beam:transform:org.apache.beam:kafka_read_without_metadata:v1: org.apache.beam.sdk.expansion.service.ExpansionService$ExternalTransformRegistrarLoader$1@7b98f307
INFO apache_beam.utils.subprocess_server:subprocess_server.py:126 beam:transform:org.apache.beam:kafka_write:v1: org.apache.beam.sdk.expansion.service.ExpansionService$ExternalTransformRegistrarLoader$1@4802796d
INFO apache_beam.utils.subprocess_server:subprocess_server.py:126 beam:external:java:generate_sequence:v1: org.apache.beam.sdk.expansion.service.ExpansionService$ExternalTransformRegistrarLoader$1@34123d65
WARNING root:subprocess_server.py:98 Waiting for grpc channel to be ready at localhost:60205.
INFO apache_beam.utils.subprocess_server:subprocess_server.py:126 Sep 07, 2022 5:34:48 AM org.apache.beam.sdk.expansion.service.ExpansionService expand
INFO apache_beam.utils.subprocess_server:subprocess_server.py:126 INFO: Expanding 'SqlTransform(beam:external:java:sql:v1)' with URN 'beam:external:java:sql:v1'
INFO apache_beam.utils.subprocess_server:subprocess_server.py:126 Sep 07, 2022 5:34:48 AM org.apache.beam.sdk.expansion.service.ExpansionService$ExternalTransformRegistrarLoader payloadToConfig
INFO apache_beam.utils.subprocess_server:subprocess_server.py:126 WARNING: Configuration class 'org.apache.beam.sdk.extensions.sql.expansion.ExternalSqlTransformRegistrar$Configuration' has no schema registered. Attempting to construct with setter approach.
INFO apache_beam.utils.subprocess_server:subprocess_server.py:126 Sep 07, 2022 5:34:48 AM org.apache.beam.sdk.expansion.service.ExpansionService$ExternalTransformRegistrarLoader payloadToConfig
INFO apache_beam.utils.subprocess_server:subprocess_server.py:126 WARNING: Configuration class 'org.apache.beam.sdk.extensions.sql.expansion.ExternalSqlTransformRegistrar$Configuration' has no schema registered. Attempting to construct with setter approach.
INFO apache_beam.utils.subprocess_server:subprocess_server.py:126 Sep 07, 2022 5:34:50 AM org.apache.beam.sdk.extensions.sql.impl.CalciteQueryPlanner convertToBeamRel
INFO apache_beam.utils.subprocess_server:subprocess_server.py:126 INFO: SQL:
INFO apache_beam.utils.subprocess_server:subprocess_server.py:126 SELECT COUNT(*) AS `count`
INFO apache_beam.utils.subprocess_server:subprocess_server.py:126 FROM `beam`.`PCOLLECTION` AS `PCOLLECTION`
INFO apache_beam.utils.subprocess_server:subprocess_server.py:126 Sep 07, 2022 5:34:50 AM org.apache.beam.sdk.extensions.sql.impl.CalciteQueryPlanner convertToBeamRel
INFO apache_beam.utils.subprocess_server:subprocess_server.py:126 INFO: SQLPlan>
INFO apache_beam.utils.subprocess_server:subprocess_server.py:126 LogicalAggregate(group=[{}], count=[COUNT()])
INFO apache_beam.utils.subprocess_server:subprocess_server.py:126 BeamIOSourceRel(table=[[beam, PCOLLECTION]])
INFO apache_beam.utils.subprocess_server:subprocess_server.py:126
INFO apache_beam.utils.subprocess_server:subprocess_server.py:126 Sep 07, 2022 5:34:50 AM org.apache.beam.sdk.extensions.sql.impl.CalciteQueryPlanner convertToBeamRel
INFO apache_beam.utils.subprocess_server:subprocess_server.py:126 INFO: BEAMPlan>
INFO apache_beam.utils.subprocess_server:subprocess_server.py:126 BeamAggregationRel(group=[{}], count=[COUNT()])
INFO apache_beam.utils.subprocess_server:subprocess_server.py:126 BeamIOSourceRel(table=[[beam, PCOLLECTION]])
INFO apache_beam.utils.subprocess_server:subprocess_server.py:126
INFO root:environments.py:376 Default Python SDK image for environment is apache/beam_python3.7_sdk:2.42.0.dev
INFO root:environments.py:299 No image given, using default Python SDK image
INFO root:environments.py:376 Default Python SDK image for environment is apache/beam_python3.7_sdk:2.42.0.dev
INFO root:environments.py:304 Python SDK container image set to "apache/beam_python3.7_sdk:2.42.0.dev" for Docker environment
INFO apache_beam.runners.portability.fn_api_runner.translations:translations.py:714 ==================== <function pack_combiners at 0x7fae8a462320> ====================
INFO apache_beam.runners.portability.fn_api_runner.translations:translations.py:714 ==================== <function lift_combiners at 0x7fae8a4623b0> ====================
INFO apache_beam.runners.portability.fn_api_runner.translations:translations.py:714 ==================== <function sort_stages at 0x7fae8a462b00> ====================
INFO apache_beam.runners.portability.portable_runner:portable_runner.py:583 Job state changed to STOPPED
INFO apache_beam.runners.portability.portable_runner:portable_runner.py:583 Job state changed to STARTING
INFO apache_beam.runners.portability.portable_runner:portable_runner.py:583 Job state changed to RUNNING
INFO root:portable_runner.py:577 Default Python SDK image for environment is apache/beam_python3.7_sdk:2.42.0.dev
INFO root:portable_runner.py:577 ==================== <function annotate_downstream_side_inputs at 0x7f9312deb8c0> ====================
INFO root:portable_runner.py:577 ==================== <function fix_side_input_pcoll_coders at 0x7f9312deb9e0> ====================
INFO root:portable_runner.py:577 ==================== <function pack_combiners at 0x7f9312debef0> ====================
INFO root:portable_runner.py:577 ==================== <function lift_combiners at 0x7f9312debf80> ====================
INFO root:portable_runner.py:577 ==================== <function expand_sdf at 0x7f9312dec170> ====================
INFO root:portable_runner.py:577 ==================== <function expand_gbk at 0x7f9312dec200> ====================
INFO root:portable_runner.py:577 ==================== <function sink_flattens at 0x7f9312dec320> ====================
INFO root:portable_runner.py:577 ==================== <function greedily_fuse at 0x7f9312dec3b0> ====================
INFO root:portable_runner.py:577 ==================== <function read_to_impulse at 0x7f9312dec440> ====================
INFO root:portable_runner.py:577 ==================== <function impulse_to_input at 0x7f9312dec4d0> ====================
INFO root:portable_runner.py:577 ==================== <function sort_stages at 0x7f9312dec710> ====================
INFO root:portable_runner.py:577 ==================== <function add_impulse_to_dangling_transforms at 0x7f9312dec830> ====================
INFO root:portable_runner.py:577 ==================== <function setup_timer_mapping at 0x7f9312dec680> ====================
INFO root:portable_runner.py:577 ==================== <function populate_data_channel_coders at 0x7f9312dec7a0> ====================
INFO root:portable_runner.py:577 starting control server on port 36297
INFO root:portable_runner.py:577 starting data server on port 36227
INFO root:portable_runner.py:577 starting state server on port 41411
INFO root:portable_runner.py:577 starting logging server on port 33971
INFO root:portable_runner.py:577 Created Worker handler <apache_beam.runners.portability.fn_api_runner.worker_handlers.DockerSdkWorkerHandler object at 0x7f93396ca210> for environment ref_Environment_default_environment_2 (beam:env:docker:v1, b'\n$apache/beam_python3.7_sdk:2.42.0.dev')
INFO root:portable_runner.py:577 Attempting to pull image apache/beam_python3.7_sdk:2.42.0.dev
INFO root:portable_runner.py:577 Unable to pull image apache/beam_python3.7_sdk:2.42.0.dev, defaulting to local image if it exists
INFO root:portable_runner.py:577 Waiting for docker to start up. Current status is running
INFO root:portable_runner.py:577 Docker container is running. container_id = b'9faf4904f274afdd684061655a946863bc7efc75c4a0dadd395b0a1146452075', worker_id = worker_81
INFO root:portable_runner.py:577 Created Worker handler <apache_beam.runners.portability.fn_api_runner.worker_handlers.DockerSdkWorkerHandler object at 0x7f9339655550> for environment external_8beam:env:docker:v1 (beam:env:docker:v1, b'\n apache/beam_java8_sdk:2.42.0.dev')
INFO root:portable_runner.py:577 Attempting to pull image apache/beam_java8_sdk:2.42.0.dev
INFO root:portable_runner.py:577 Unable to pull image apache/beam_java8_sdk:2.42.0.dev, defaulting to local image if it exists
INFO root:portable_runner.py:577 Waiting for docker to start up. Current status is running
INFO root:portable_runner.py:577 Docker container is running. container_id = b'884b6ea2b2b51934eeb4b541a00004a0b7503bb3beea2167b3266c28967d8ca9', worker_id = worker_82
INFO root:portable_runner.py:577 Completed job in 12.95447587966919 seconds with state DONE.
INFO apache_beam.runners.portability.portable_runner:portable_runner.py:583 Job state changed to DONE
PASSED [ 88%]
apache_beam/transforms/sql_test.py::SqlTransformTest::test_zetasql_generate_data
-------------------------------- live log call ---------------------------------
INFO apache_beam.utils.subprocess_server:subprocess_server.py:239 Using pre-built snapshot at <https://ci-beam.apache.org/job/beam_PostCommit_XVR_Direct/ws/src/sdks/java/extensions/sql/expansion-service/build/libs/beam-sdks-java-extensions-sql-expansion-service-2.42.0-SNAPSHOT.jar>
INFO root:external.py:773 Starting a JAR-based expansion service from JAR <https://ci-beam.apache.org/job/beam_PostCommit_XVR_Direct/ws/src/sdks/java/extensions/sql/expansion-service/build/libs/beam-sdks-java-extensions-sql-expansion-service-2.42.0-SNAPSHOT.jar>
INFO apache_beam.utils.subprocess_server:subprocess_server.py:116 Starting service with ['java' '-jar' '<https://ci-beam.apache.org/job/beam_PostCommit_XVR_Direct/ws/src/sdks/java/extensions/sql/expansion-service/build/libs/beam-sdks-java-extensions-sql-expansion-service-2.42.0-SNAPSHOT.jar'> '45231' '--filesToStage=<https://ci-beam.apache.org/job/beam_PostCommit_XVR_Direct/ws/src/sdks/java/extensions/sql/expansion-service/build/libs/beam-sdks-java-extensions-sql-expansion-service-2.42.0-SNAPSHOT.jar']>
INFO apache_beam.utils.subprocess_server:subprocess_server.py:126 Starting expansion service at localhost:45231
INFO apache_beam.utils.subprocess_server:subprocess_server.py:126 Sep 07, 2022 5:35:12 AM org.apache.beam.sdk.expansion.service.ExpansionService loadRegisteredTransforms
INFO apache_beam.utils.subprocess_server:subprocess_server.py:126 INFO: Registering external transforms: [beam:external:java:sql:v1, beam:transform:org.apache.beam:pubsub_read:v1, beam:transform:org.apache.beam:pubsub_write:v1, beam:transform:org.apache.beam:pubsublite_write:v1, beam:transform:org.apache.beam:pubsublite_read:v1, beam:transform:org.apache.beam:spanner_insert:v1, beam:transform:org.apache.beam:spanner_update:v1, beam:transform:org.apache.beam:spanner_replace:v1, beam:transform:org.apache.beam:spanner_insert_or_update:v1, beam:transform:org.apache.beam:spanner_delete:v1, beam:transform:org.apache.beam:spanner_read:v1, beam:transform:org.apache.beam:kafka_read_with_metadata:v1, beam:transform:org.apache.beam:kafka_read_without_metadata:v1, beam:transform:org.apache.beam:kafka_write:v1, beam:external:java:generate_sequence:v1]
INFO apache_beam.utils.subprocess_server:subprocess_server.py:126 beam:external:java:sql:v1: org.apache.beam.sdk.expansion.service.ExpansionService$ExternalTransformRegistrarLoader$1@47eaca72
INFO apache_beam.utils.subprocess_server:subprocess_server.py:126 beam:transform:org.apache.beam:pubsub_read:v1: org.apache.beam.sdk.expansion.service.ExpansionService$ExternalTransformRegistrarLoader$1@55141def
INFO apache_beam.utils.subprocess_server:subprocess_server.py:126 beam:transform:org.apache.beam:pubsub_write:v1: org.apache.beam.sdk.expansion.service.ExpansionService$ExternalTransformRegistrarLoader$1@55182842
INFO apache_beam.utils.subprocess_server:subprocess_server.py:126 beam:transform:org.apache.beam:pubsublite_write:v1: org.apache.beam.sdk.expansion.service.ExpansionService$ExternalTransformRegistrarLoader$1@3270d194
INFO apache_beam.utils.subprocess_server:subprocess_server.py:126 beam:transform:org.apache.beam:pubsublite_read:v1: org.apache.beam.sdk.expansion.service.ExpansionService$ExternalTransformRegistrarLoader$1@235834f2
INFO apache_beam.utils.subprocess_server:subprocess_server.py:126 beam:transform:org.apache.beam:spanner_insert:v1: org.apache.beam.sdk.expansion.service.ExpansionService$ExternalTransformRegistrarLoader$1@5656be13
INFO apache_beam.utils.subprocess_server:subprocess_server.py:126 beam:transform:org.apache.beam:spanner_update:v1: org.apache.beam.sdk.expansion.service.ExpansionService$ExternalTransformRegistrarLoader$1@4218d6a3
INFO apache_beam.utils.subprocess_server:subprocess_server.py:126 beam:transform:org.apache.beam:spanner_replace:v1: org.apache.beam.sdk.expansion.service.ExpansionService$ExternalTransformRegistrarLoader$1@76505305
INFO apache_beam.utils.subprocess_server:subprocess_server.py:126 beam:transform:org.apache.beam:spanner_insert_or_update:v1: org.apache.beam.sdk.expansion.service.ExpansionService$ExternalTransformRegistrarLoader$1@14cd1699
INFO apache_beam.utils.subprocess_server:subprocess_server.py:126 beam:transform:org.apache.beam:spanner_delete:v1: org.apache.beam.sdk.expansion.service.ExpansionService$ExternalTransformRegistrarLoader$1@77888435
INFO apache_beam.utils.subprocess_server:subprocess_server.py:126 beam:transform:org.apache.beam:spanner_read:v1: org.apache.beam.sdk.expansion.service.ExpansionService$ExternalTransformRegistrarLoader$1@73a1e9a9
INFO apache_beam.utils.subprocess_server:subprocess_server.py:126 beam:transform:org.apache.beam:kafka_read_with_metadata:v1: org.apache.beam.sdk.expansion.service.ExpansionService$ExternalTransformRegistrarLoader$1@71d44a3
INFO apache_beam.utils.subprocess_server:subprocess_server.py:126 beam:transform:org.apache.beam:kafka_read_without_metadata:v1: org.apache.beam.sdk.expansion.service.ExpansionService$ExternalTransformRegistrarLoader$1@7b98f307
INFO apache_beam.utils.subprocess_server:subprocess_server.py:126 beam:transform:org.apache.beam:kafka_write:v1: org.apache.beam.sdk.expansion.service.ExpansionService$ExternalTransformRegistrarLoader$1@4802796d
INFO apache_beam.utils.subprocess_server:subprocess_server.py:126 beam:external:java:generate_sequence:v1: org.apache.beam.sdk.expansion.service.ExpansionService$ExternalTransformRegistrarLoader$1@34123d65
INFO apache_beam.utils.subprocess_server:subprocess_server.py:126 Sep 07, 2022 5:35:14 AM org.apache.beam.sdk.expansion.service.ExpansionService expand
INFO apache_beam.utils.subprocess_server:subprocess_server.py:126 INFO: Expanding 'SqlTransform(beam:external:java:sql:v1)' with URN 'beam:external:java:sql:v1'
INFO apache_beam.utils.subprocess_server:subprocess_server.py:126 Sep 07, 2022 5:35:14 AM org.apache.beam.sdk.expansion.service.ExpansionService$ExternalTransformRegistrarLoader payloadToConfig
INFO apache_beam.utils.subprocess_server:subprocess_server.py:126 WARNING: Configuration class 'org.apache.beam.sdk.extensions.sql.expansion.ExternalSqlTransformRegistrar$Configuration' has no schema registered. Attempting to construct with setter approach.
INFO apache_beam.utils.subprocess_server:subprocess_server.py:126 Sep 07, 2022 5:35:14 AM org.apache.beam.sdk.expansion.service.ExpansionService$ExternalTransformRegistrarLoader payloadToConfig
INFO apache_beam.utils.subprocess_server:subprocess_server.py:126 WARNING: Configuration class 'org.apache.beam.sdk.extensions.sql.expansion.ExternalSqlTransformRegistrar$Configuration' has no schema registered. Attempting to construct with setter approach.
INFO apache_beam.utils.subprocess_server:subprocess_server.py:126 Sep 07, 2022 5:35:16 AM com.google.zetasql.io.grpc.NameResolverRegistry getDefaultRegistry
INFO apache_beam.utils.subprocess_server:subprocess_server.py:126 WARNING: No NameResolverProviders found via ServiceLoader, including for DNS. This is probably due to a broken build. If using ProGuard, check your configuration
INFO apache_beam.utils.subprocess_server:subprocess_server.py:126 Sep 07, 2022 5:35:18 AM org.apache.beam.sdk.extensions.sql.zetasql.ZetaSQLQueryPlanner convertToBeamRelInternal
INFO apache_beam.utils.subprocess_server:subprocess_server.py:126 INFO: BEAMPlan>
INFO apache_beam.utils.subprocess_server:subprocess_server.py:126 BeamZetaSqlCalcRel(expr#0=[{inputs}], expr#1=[1:BIGINT], expr#2=['foo':VARCHAR], expr#3=[3.1400000000000001243E0:DOUBLE], int=[$t1], str=[$t2], flt=[$t3])
INFO apache_beam.utils.subprocess_server:subprocess_server.py:126 BeamValuesRel(tuples=[[{ 0 }]])
INFO apache_beam.utils.subprocess_server:subprocess_server.py:126
INFO root:environments.py:376 Default Python SDK image for environment is apache/beam_python3.7_sdk:2.42.0.dev
INFO root:environments.py:299 No image given, using default Python SDK image
INFO root:environments.py:376 Default Python SDK image for environment is apache/beam_python3.7_sdk:2.42.0.dev
INFO root:environments.py:304 Python SDK container image set to "apache/beam_python3.7_sdk:2.42.0.dev" for Docker environment
INFO apache_beam.runners.portability.fn_api_runner.translations:translations.py:714 ==================== <function pack_combiners at 0x7fae8a462320> ====================
INFO apache_beam.runners.portability.fn_api_runner.translations:translations.py:714 ==================== <function lift_combiners at 0x7fae8a4623b0> ====================
INFO apache_beam.runners.portability.fn_api_runner.translations:translations.py:714 ==================== <function sort_stages at 0x7fae8a462b00> ====================
INFO apache_beam.runners.portability.portable_runner:portable_runner.py:583 Job state changed to STOPPED
INFO apache_beam.runners.portability.portable_runner:portable_runner.py:583 Job state changed to STARTING
INFO apache_beam.runners.portability.portable_runner:portable_runner.py:583 Job state changed to RUNNING
INFO root:portable_runner.py:577 Default Python SDK image for environment is apache/beam_python3.7_sdk:2.42.0.dev
INFO root:portable_runner.py:577 ==================== <function annotate_downstream_side_inputs at 0x7f9312deb8c0> ====================
INFO root:portable_runner.py:577 ==================== <function fix_side_input_pcoll_coders at 0x7f9312deb9e0> ====================
INFO root:portable_runner.py:577 ==================== <function pack_combiners at 0x7f9312debef0> ====================
INFO root:portable_runner.py:577 ==================== <function lift_combiners at 0x7f9312debf80> ====================
INFO root:portable_runner.py:577 ==================== <function expand_sdf at 0x7f9312dec170> ====================
INFO root:portable_runner.py:577 ==================== <function expand_gbk at 0x7f9312dec200> ====================
INFO root:portable_runner.py:577 ==================== <function sink_flattens at 0x7f9312dec320> ====================
INFO root:portable_runner.py:577 ==================== <function greedily_fuse at 0x7f9312dec3b0> ====================
INFO root:portable_runner.py:577 ==================== <function read_to_impulse at 0x7f9312dec440> ====================
INFO root:portable_runner.py:577 ==================== <function impulse_to_input at 0x7f9312dec4d0> ====================
INFO root:portable_runner.py:577 ==================== <function sort_stages at 0x7f9312dec710> ====================
INFO root:portable_runner.py:577 ==================== <function add_impulse_to_dangling_transforms at 0x7f9312dec830> ====================
INFO root:portable_runner.py:577 ==================== <function setup_timer_mapping at 0x7f9312dec680> ====================
INFO root:portable_runner.py:577 ==================== <function populate_data_channel_coders at 0x7f9312dec7a0> ====================
INFO root:portable_runner.py:577 starting control server on port 44935
INFO root:portable_runner.py:577 starting data server on port 39063
INFO root:portable_runner.py:577 starting state server on port 37737
INFO root:portable_runner.py:577 starting logging server on port 38675
INFO root:portable_runner.py:577 Created Worker handler <apache_beam.runners.portability.fn_api_runner.worker_handlers.DockerSdkWorkerHandler object at 0x7f92f3fe1ed0> for environment external_9beam:env:docker:v1 (beam:env:docker:v1, b'\n apache/beam_java8_sdk:2.42.0.dev')
INFO root:portable_runner.py:577 Attempting to pull image apache/beam_java8_sdk:2.42.0.dev
INFO root:portable_runner.py:577 Unable to pull image apache/beam_java8_sdk:2.42.0.dev, defaulting to local image if it exists
INFO root:portable_runner.py:577 Waiting for docker to start up. Current status is running
INFO root:portable_runner.py:577 Docker container is running. container_id = b'51e12bdaab9a4ee2024bbcdad377fa3eb2e92dc9cd019effe1cb987ffb8afe18', worker_id = worker_83
INFO root:portable_runner.py:577 Created Worker handler <apache_beam.runners.portability.fn_api_runner.worker_handlers.DockerSdkWorkerHandler object at 0x7f933972a750> for environment ref_Environment_default_environment_2 (beam:env:docker:v1, b'\n$apache/beam_python3.7_sdk:2.42.0.dev')
INFO root:portable_runner.py:577 Attempting to pull image apache/beam_python3.7_sdk:2.42.0.dev
INFO root:portable_runner.py:577 Unable to pull image apache/beam_python3.7_sdk:2.42.0.dev, defaulting to local image if it exists
INFO root:portable_runner.py:577 Waiting for docker to start up. Current status is running
INFO root:portable_runner.py:577 Docker container is running. container_id = b'd2fba382509b0a463f317cd50678f4672830c0cb5cddca4e525b1f51a3e6a72c', worker_id = worker_84
INFO root:portable_runner.py:577 Completed job in 11.643773794174194 seconds with state DONE.
INFO apache_beam.runners.portability.portable_runner:portable_runner.py:583 Job state changed to DONE
PASSED [100%]
=============================== warnings summary ===============================
../../build/gradleenv/1922375555/lib/python3.7/site-packages/hdfs/config.py:15
<https://ci-beam.apache.org/job/beam_PostCommit_XVR_Direct/ws/src/build/gradleenv/1922375555/lib/python3.7/site-packages/hdfs/config.py>:15: DeprecationWarning: the imp module is deprecated in favour of importlib; see the module's documentation for alternative uses
from imp import load_source
../../build/gradleenv/1922375555/lib/python3.7/site-packages/google/api_core/grpc_helpers.py:42
<https://ci-beam.apache.org/job/beam_PostCommit_XVR_Direct/ws/src/build/gradleenv/1922375555/lib/python3.7/site-packages/google/api_core/grpc_helpers.py>:42: DeprecationWarning: Support for grpcio-gcp is deprecated. This feature will be
removed from `google-api-core` after January 1, 2024. If you need to
continue to use this feature, please pin to a specific version of
`google-api-core`.
DeprecationWarning,
-- Docs: https://docs.pytest.org/en/stable/how-to/capture-warnings.html
- generated xml file: <https://ci-beam.apache.org/job/beam_PostCommit_XVR_Direct/ws/src/sdks/python/pytest_xlangSqlValidateRunner.xml> -
==== 9 passed, 2 skipped, 6648 deselected, 2 warnings in 239.90s (0:03:59) =====
> Task :sdks:python:test-suites:direct:xlang:fnApiJobServerCleanup
Killing process at 1214270
> Task :sdks:python:test-suites:direct:xlang:validatesCrossLanguageRunnerCleanup
Stopping expansion service pid: 1217101.
Stopping expansion service pid: 1217102.
FAILURE: Build failed with an exception.
* What went wrong:
Execution failed for task ':sdks:python:test-suites:direct:xlang:validatesCrossLanguageRunnerJavaUsingPython'.
> There were failing tests. See the report at: file://<https://ci-beam.apache.org/job/beam_PostCommit_XVR_Direct/ws/src/sdks/python/test-suites/direct/xlang/build/reports/tests/validatesCrossLanguageRunnerJavaUsingPython/index.html>
* Try:
> Run with --stacktrace option to get the stack trace.
> Run with --info or --debug option to get more log output.
* Get more help at https://help.gradle.org
Deprecated Gradle features were used in this build, making it incompatible with Gradle 8.0.
You can use '--warning-mode all' to show the individual deprecation warnings and determine if they come from your own scripts or plugins.
See https://docs.gradle.org/7.5.1/userguide/command_line_interface.html#sec:command_line_warnings
Execution optimizations have been disabled for 1 invalid unit(s) of work during this build to ensure correctness.
Please consult deprecation warnings for more details.
BUILD FAILED in 25m 16s
247 actionable tasks: 195 executed, 42 from cache, 10 up-to-date
Publishing build scan...
https://gradle.com/s/7worzmwxp3vv2
Build step 'Invoke Gradle script' changed build result to FAILURE
Build step 'Invoke Gradle script' marked build as failure
---------------------------------------------------------------------
To unsubscribe, e-mail: builds-unsubscribe@beam.apache.org
For additional commands, e-mail: builds-help@beam.apache.org
Jenkins build is back to normal : beam_PostCommit_XVR_Direct #3110
Posted by Apache Jenkins Server <je...@builds.apache.org>.
See <https://ci-beam.apache.org/job/beam_PostCommit_XVR_Direct/3110/display/redirect?page=changes>
---------------------------------------------------------------------
To unsubscribe, e-mail: builds-unsubscribe@beam.apache.org
For additional commands, e-mail: builds-help@beam.apache.org