You are viewing a plain text version of this content. The canonical link for it is here.
Posted to notifications@maven.apache.org by Apache Jenkins Server <je...@builds.apache.org> on 2012/09/22 15:13:11 UTC
Build failed in Jenkins: maven-plugins-ITs-m3 #668
See <https://builds.apache.org/job/maven-plugins-ITs-m3/668/changes>
Changes:
[hboutemy] added generics
------------------------------------------
[...truncated 9886 lines...]
Tests run: 1, Failures: 0, Errors: 0, Skipped: 0, Time elapsed: 0.038 sec
Running org.apache.maven.plugins.shade.mojo.ShadeMojoTest
Tests run: 4, Failures: 0, Errors: 0, Skipped: 0, Time elapsed: 2.65 sec
Running org.apache.maven.plugins.shade.mojo.ArtifactSelectorTest
Tests run: 1, Failures: 0, Errors: 0, Skipped: 0, Time elapsed: 0.001 sec
Running org.apache.maven.plugins.shade.mojo.ArtifactIdTest
Tests run: 2, Failures: 0, Errors: 0, Skipped: 0, Time elapsed: 0.002 sec
Running org.apache.maven.plugins.shade.filter.SimpleFilterTest
Tests run: 1, Failures: 0, Errors: 0, Skipped: 0, Time elapsed: 0 sec
Running org.apache.maven.plugins.shade.resource.AppendingTransformerTest
Tests run: 1, Failures: 0, Errors: 0, Skipped: 0, Time elapsed: 0.001 sec
Running org.apache.maven.plugins.shade.resource.ApacheNoticeResourceTransformerTest
Tests run: 1, Failures: 0, Errors: 0, Skipped: 0, Time elapsed: 0.001 sec
Running org.apache.maven.plugins.shade.resource.ApacheLicenseResourceTransformerTest
Tests run: 1, Failures: 0, Errors: 0, Skipped: 0, Time elapsed: 0.001 sec
Running org.apache.maven.plugins.shade.resource.XmlAppendingTransformerTest
Tests run: 1, Failures: 0, Errors: 0, Skipped: 0, Time elapsed: 0.005 sec
Running org.apache.maven.plugins.shade.resource.ComponentsXmlResourceTransformerTest
Tests run: 1, Failures: 0, Errors: 0, Skipped: 0, Time elapsed: 0.062 sec
Running org.apache.maven.plugins.shade.relocation.SimpleRelocatorParameterTest
Tests run: 2, Failures: 0, Errors: 0, Skipped: 0, Time elapsed: 0 sec
Running org.apache.maven.plugins.shade.relocation.SimpleRelocatorTest
Tests run: 7, Failures: 0, Errors: 0, Skipped: 0, Time elapsed: 0.003 sec
Running org.apache.maven.plugins.shade.DefaultShaderTest
Tests run: 4, Failures: 0, Errors: 0, Skipped: 0, Time elapsed: 0.853 sec
Results :
Tests run: 27, Failures: 0, Errors: 0, Skipped: 0
[INFO]
[INFO] --- maven-jar-plugin:2.4:jar (default-jar) @ maven-shade-plugin ---
[INFO] Building jar: <https://builds.apache.org/job/maven-plugins-ITs-m3/ws/maven-shade-plugin/target/maven-shade-plugin-2.0.1-SNAPSHOT.jar>
[INFO]
[INFO] --- maven-plugin-plugin:3.1:addPluginArtifactMetadata (default-addPluginArtifactMetadata) @ maven-shade-plugin ---
[INFO]
[INFO] --- maven-jar-plugin:2.4:test-jar (default) @ maven-shade-plugin ---
[INFO] Building jar: <https://builds.apache.org/job/maven-plugins-ITs-m3/ws/maven-shade-plugin/target/maven-shade-plugin-2.0.1-SNAPSHOT-tests.jar>
[INFO]
[INFO] --- maven-invoker-plugin:1.6:install (integration-test) @ maven-shade-plugin ---
[INFO] Installing <https://builds.apache.org/job/maven-plugins-ITs-m3/ws/maven-shade-plugin/pom.xml> to <https://builds.apache.org/job/maven-plugins-ITs-m3/ws/maven-shade-plugin/target/local-repo/org/apache/maven/plugins/maven-shade-plugin/2.0.1-SNAPSHOT/maven-shade-plugin-2.0.1-SNAPSHOT.pom>
[INFO] Installing <https://builds.apache.org/job/maven-plugins-ITs-m3/ws/maven-shade-plugin/target/maven-shade-plugin-2.0.1-SNAPSHOT.jar> to <https://builds.apache.org/job/maven-plugins-ITs-m3/ws/maven-shade-plugin/target/local-repo/org/apache/maven/plugins/maven-shade-plugin/2.0.1-SNAPSHOT/maven-shade-plugin-2.0.1-SNAPSHOT.jar>
[INFO] Installing <https://builds.apache.org/job/maven-plugins-ITs-m3/ws/maven-shade-plugin/target/maven-shade-plugin-2.0.1-SNAPSHOT-tests.jar> to <https://builds.apache.org/job/maven-plugins-ITs-m3/ws/maven-shade-plugin/target/local-repo/org/apache/maven/plugins/maven-shade-plugin/2.0.1-SNAPSHOT/maven-shade-plugin-2.0.1-SNAPSHOT-tests.jar>
[INFO]
[INFO] --- maven-invoker-plugin:1.6:integration-test (integration-test) @ maven-shade-plugin ---
[INFO] Building: shadePomDependency/pom.xml
[INFO] ..SUCCESS (5.9 s)
[INFO] Building: finalNameShade-attached/pom.xml
[INFO] run script <https://builds.apache.org/job/maven-plugins-ITs-m3/ws/maven-shade-plugin/target/it/finalNameShade-attached/setup.bsh>
[INFO] run script <https://builds.apache.org/job/maven-plugins-ITs-m3/ws/maven-shade-plugin/target/it/finalNameShade-attached/verify.bsh>
[INFO] ..SUCCESS (3.6 s)
[INFO] Building: attached-artifact-type/pom.xml
[INFO] ..SUCCESS (3.4 s)
[INFO] Building: project-with-reactors-included/pom.xml
[INFO] run script <https://builds.apache.org/job/maven-plugins-ITs-m3/ws/maven-shade-plugin/target/it/project-with-reactors-included/verify.bsh>
[INFO] ..SUCCESS (11.9 s)
[INFO] Building: pom-packaging/pom.xml
[INFO] run script <https://builds.apache.org/job/maven-plugins-ITs-m3/ws/maven-shade-plugin/target/it/pom-packaging/verify.bsh>
[INFO] ..SUCCESS (2.6 s)
[INFO] Building: users-shader-impl/pom.xml
[INFO] run script <https://builds.apache.org/job/maven-plugins-ITs-m3/ws/maven-shade-plugin/target/it/users-shader-impl/verify.groovy>
[INFO] ..SUCCESS (4.1 s)
[INFO] Building: mini-jar-respect-includes/pom.xml
[INFO] run script <https://builds.apache.org/job/maven-plugins-ITs-m3/ws/maven-shade-plugin/target/it/mini-jar-respect-includes/verify.bsh>
[INFO] ..SUCCESS (4.6 s)
[INFO] Building: reloc-includes-excludes/pom.xml
[INFO] run script <https://builds.apache.org/job/maven-plugins-ITs-m3/ws/maven-shade-plugin/target/it/reloc-includes-excludes/verify.bsh>
[INFO] ..SUCCESS (4.3 s)
[INFO] Building: manifest-retained/pom.xml
[INFO] run script <https://builds.apache.org/job/maven-plugins-ITs-m3/ws/maven-shade-plugin/target/it/manifest-retained/verify.bsh>
[INFO] ..SUCCESS (4.8 s)
[INFO] Building: implicit-inclusion-of-project-artifact/pom.xml
[INFO] run script <https://builds.apache.org/job/maven-plugins-ITs-m3/ws/maven-shade-plugin/target/it/implicit-inclusion-of-project-artifact/verify.bsh>
[INFO] ..SUCCESS (3.9 s)
[INFO] Building: dep-reduced-pom-relocated-result/pom.xml
[INFO] ..SUCCESS (2.9 s)
[INFO] Building: dep-reduced-pom-with-local-parent/pom.xml
[INFO] ..SUCCESS (2.7 s)
[INFO] Building: rerun-without-reloc/pom.xml
[INFO] ..SUCCESS (3.4 s)
[INFO] Building: finalNameBuild-attached/pom.xml
[INFO] run script <https://builds.apache.org/job/maven-plugins-ITs-m3/ws/maven-shade-plugin/target/it/finalNameBuild-attached/setup.bsh>
[INFO] run script <https://builds.apache.org/job/maven-plugins-ITs-m3/ws/maven-shade-plugin/target/it/finalNameBuild-attached/verify.bsh>
[INFO] ..SUCCESS (4.4 s)
[INFO] Building: empty-apache-notice-transform/pom.xml
[INFO] ..SUCCESS (4.2 s)
[INFO] Building: MSHADE-105/pom.xml
[INFO] run script <https://builds.apache.org/job/maven-plugins-ITs-m3/ws/maven-shade-plugin/target/it/MSHADE-105/verify.bsh>
[INFO] ..SUCCESS (8.7 s)
[INFO] Building: reloc-anno/pom.xml
[INFO] ..SUCCESS (3.6 s)
[INFO] Building: component-descriptor-relocation/pom.xml
[INFO] ..SUCCESS (4.3 s)
[INFO] Building: mini-jar-package-info/pom.xml
[INFO] run script <https://builds.apache.org/job/maven-plugins-ITs-m3/ws/maven-shade-plugin/target/it/mini-jar-package-info/verify.bsh>
[INFO] ..SUCCESS (4.5 s)
[INFO] Building: dep-reduced-pom/pom.xml
[INFO] run script <https://builds.apache.org/job/maven-plugins-ITs-m3/ws/maven-shade-plugin/target/it/dep-reduced-pom/verify.groovy>
[INFO] ..SUCCESS (3.6 s)
[INFO] Building: mshade-123/pom.xml
[INFO] ..SUCCESS (16.2 s)
[INFO] Building: reloc-enum-ref-from-anno/pom.xml
[INFO] ..SUCCESS (3.4 s)
[INFO] Building: rerun-with-reloc/pom.xml
[INFO] ..SUCCESS (5.3 s)
[INFO] Building: mini-jar/pom.xml
[INFO] run script <https://builds.apache.org/job/maven-plugins-ITs-m3/ws/maven-shade-plugin/target/it/mini-jar/verify.bsh>
[INFO] ..SUCCESS (4.0 s)
[INFO] Building: xml-transformer-ignores-dtd/pom.xml
[INFO] run script <https://builds.apache.org/job/maven-plugins-ITs-m3/ws/maven-shade-plugin/target/it/xml-transformer-ignores-dtd/verify.bsh>
[INFO] ..SUCCESS (3.6 s)
[INFO] Building: duplicate-classes-with-reloc/pom.xml
[INFO] ..SUCCESS (2.8 s)
[INFO] Building: finalNameShade/pom.xml
[INFO] run script <https://builds.apache.org/job/maven-plugins-ITs-m3/ws/maven-shade-plugin/target/it/finalNameShade/setup.bsh>
[INFO] run script <https://builds.apache.org/job/maven-plugins-ITs-m3/ws/maven-shade-plugin/target/it/finalNameShade/verify.bsh>
[INFO] ..SUCCESS (3.6 s)
[INFO] Building: finalNameBuild/pom.xml
[INFO] run script <https://builds.apache.org/job/maven-plugins-ITs-m3/ws/maven-shade-plugin/target/it/finalNameBuild/setup.bsh>
[INFO] run script <https://builds.apache.org/job/maven-plugins-ITs-m3/ws/maven-shade-plugin/target/it/finalNameBuild/verify.bsh>
[INFO] ..SUCCESS (3.6 s)
[INFO] Building: filter-artifact-contents/pom.xml
[INFO] run script <https://builds.apache.org/job/maven-plugins-ITs-m3/ws/maven-shade-plugin/target/it/filter-artifact-contents/verify.bsh>
[INFO] ..SUCCESS (3.5 s)
[INFO] Building: artifact-includes-excludes/pom.xml
[INFO] run script <https://builds.apache.org/job/maven-plugins-ITs-m3/ws/maven-shade-plugin/target/it/artifact-includes-excludes/verify.bsh>
[INFO] ..SUCCESS (3.6 s)
[INFO] Building: non-runtime-scope-excluded/pom.xml
[INFO] run script <https://builds.apache.org/job/maven-plugins-ITs-m3/ws/maven-shade-plugin/target/it/non-runtime-scope-excluded/verify.bsh>
[INFO] ..SUCCESS (3.7 s)
[INFO] Building: manifest-transformed/pom.xml
[INFO] run script <https://builds.apache.org/job/maven-plugins-ITs-m3/ws/maven-shade-plugin/target/it/manifest-transformed/verify.bsh>
[INFO] ..SUCCESS (4.6 s)
[INFO] Building: dep-reduced-pom-unique/pom.xml
[INFO] run script <https://builds.apache.org/job/maven-plugins-ITs-m3/ws/maven-shade-plugin/target/it/dep-reduced-pom-unique/verify.groovy>
[INFO] ..SUCCESS (4.0 s)
[INFO] Building: reloc-abs-resource-path/pom.xml
[INFO] ..SUCCESS (5.5 s)
[INFO] Building: services-resource-transformer/pom.xml
[INFO] run script <https://builds.apache.org/job/maven-plugins-ITs-m3/ws/maven-shade-plugin/target/it/services-resource-transformer/verify.bsh>
[INFO] ..SUCCESS (3.7 s)
[INFO] Building: reloc-class-from-string-pool/pom.xml
[INFO] ..SUCCESS (3.3 s)
[INFO] Building: attach-after-lifecycle-fork/pom.xml
[INFO] run script <https://builds.apache.org/job/maven-plugins-ITs-m3/ws/maven-shade-plugin/target/it/attach-after-lifecycle-fork/setup.bsh>
[INFO] run script <https://builds.apache.org/job/maven-plugins-ITs-m3/ws/maven-shade-plugin/target/it/attach-after-lifecycle-fork/verify.bsh>
[INFO] ..SUCCESS (2.9 s)
[INFO] Building: mini-jar-malformed-dependencies/pom.xml
[INFO] ..SUCCESS (7.2 s)
[INFO] Building: duplicate-classes-without-reloc/pom.xml
[INFO] ..SUCCESS (2.8 s)
[INFO] Building: empty-relocation-shaded-pattern/pom.xml
[INFO] ..SUCCESS (3.6 s)
[INFO] Building: empty-relocation-pattern/pom.xml
[INFO] ..SUCCESS (3.4 s)
[INFO]
[INFO] --- maven-invoker-plugin:1.6:verify (integration-test) @ maven-shade-plugin ---
[INFO] -------------------------------------------------
[INFO] Build Summary:
[INFO] Passed: 41, Failed: 0, Errors: 0, Skipped: 0
[INFO] -------------------------------------------------
[INFO]
[INFO] --- maven-install-plugin:2.3.1:install (default-install) @ maven-shade-plugin ---
[INFO] Installing <https://builds.apache.org/job/maven-plugins-ITs-m3/ws/maven-shade-plugin/target/maven-shade-plugin-2.0.1-SNAPSHOT.jar> to /home/jenkins/.m2/repository/org/apache/maven/plugins/maven-shade-plugin/2.0.1-SNAPSHOT/maven-shade-plugin-2.0.1-SNAPSHOT.jar
[INFO] Installing <https://builds.apache.org/job/maven-plugins-ITs-m3/ws/maven-shade-plugin/pom.xml> to /home/jenkins/.m2/repository/org/apache/maven/plugins/maven-shade-plugin/2.0.1-SNAPSHOT/maven-shade-plugin-2.0.1-SNAPSHOT.pom
[INFO] Installing <https://builds.apache.org/job/maven-plugins-ITs-m3/ws/maven-shade-plugin/target/maven-shade-plugin-2.0.1-SNAPSHOT-tests.jar> to /home/jenkins/.m2/repository/org/apache/maven/plugins/maven-shade-plugin/2.0.1-SNAPSHOT/maven-shade-plugin-2.0.1-SNAPSHOT-tests.jar
[INFO]
[INFO] ------------------------------------------------------------------------
[INFO] Building Maven Plugins Aggregator 1-SNAPSHOT
[INFO] ------------------------------------------------------------------------
[INFO]
[INFO] --- maven-clean-plugin:2.4.1:clean (default-clean) @ maven-plugins-aggregator ---
[INFO] Deleting <https://builds.apache.org/job/maven-plugins-ITs-m3/ws/target>
[INFO]
[INFO] --- maven-remote-resources-plugin:1.1:process (default) @ maven-plugins-aggregator ---
[INFO]
[INFO] --- maven-install-plugin:2.3.1:install (default-install) @ maven-plugins-aggregator ---
[INFO] Installing <https://builds.apache.org/job/maven-plugins-ITs-m3/ws/pom.xml> to /home/jenkins/.m2/repository/org/apache/maven/plugins/maven-plugins-aggregator/1-SNAPSHOT/maven-plugins-aggregator-1-SNAPSHOT.pom
[INFO] ------------------------------------------------------------------------
[INFO] Reactor Summary:
[INFO]
[INFO] Maven Plugins ..................................... SUCCESS [3.423s]
[INFO] Maven ACR Plugin .................................. SUCCESS [43.132s]
[INFO] Maven Ant Plugin .................................. SUCCESS [1:03.897s]
[INFO] Maven AntRun Plugin ............................... SUCCESS [55.799s]
[INFO] Maven Eclipse Plugin .............................. SUCCESS [6:44.671s]
[INFO] Maven Assembly Plugin ............................. SUCCESS [11:04.465s]
[INFO] Maven Changelog Plugin ............................ FAILURE [7.493s]
[INFO] Maven Changes Report Plugin ....................... SUCCESS [57.474s]
[INFO] Maven Checkstyle Plugin ........................... SUCCESS [1:39.221s]
[INFO] Maven Clean Plugin ................................ SUCCESS [20.771s]
[INFO] Maven Compiler Plugin ............................. SUCCESS [45.211s]
[INFO] Maven Dependency Plugin ........................... SUCCESS [2:16.287s]
[INFO] Maven Deploy Plugin ............................... SUCCESS [1:02.182s]
[INFO] Maven DOAP Plugin ................................. SUCCESS [16.852s]
[INFO] Maven Documentation Checker Plugin ................ SUCCESS [6.992s]
[INFO] Maven EAR Plugin .................................. SUCCESS [4:08.814s]
[INFO] Maven EJB Plugin .................................. SUCCESS [28.688s]
[INFO] Maven GPG Plugin .................................. SUCCESS [9.977s]
[INFO] Maven Help Plugin ................................. SUCCESS [36.108s]
[INFO] Maven IDEA Plugin ................................. SUCCESS [9.256s]
[INFO] Maven Install Plugin .............................. SUCCESS [40.110s]
[INFO] Maven JAR Plugin .................................. SUCCESS [1:08.023s]
[INFO] Maven Jarsigner Plugin ............................ SUCCESS [26.032s]
[INFO] Maven Javadoc Plugin .............................. SUCCESS [3:08.692s]
[INFO] Maven Linkcheck Plugin ............................ SUCCESS [5.098s]
[INFO] Maven One Plugin .................................. SUCCESS [1.695s]
[INFO] Maven Patch Plugin ................................ SUCCESS [12.946s]
[INFO] Maven PDF Plugin .................................. SUCCESS [36.739s]
[INFO] Maven PMD Plugin .................................. SUCCESS [41.718s]
[INFO] Maven RAR Plugin .................................. SUCCESS [10.638s]
[INFO] Maven Reactor Plugin .............................. SUCCESS [2.572s]
[INFO] Maven Repository Plugin ........................... SUCCESS [46.127s]
[INFO] Maven Resources Plugin ............................ SUCCESS [58.829s]
[INFO] Maven Site Plugin 3 ............................... SUCCESS [6:58.418s]
[INFO] Maven Source Plugin ............................... SUCCESS [45.430s]
[INFO] Maven Stage Plugin ................................ SUCCESS [1.604s]
[INFO] Maven Toolchains Plugin ........................... SUCCESS [1.701s]
[INFO] Maven Verifier Plugin ............................. SUCCESS [15.370s]
[INFO] Maven WAR Plugin .................................. SUCCESS [1:28.936s]
[INFO] SCM Publish Maven Plugin .......................... SUCCESS [1:14.816s]
[INFO] Maven Invoker Plugin .............................. SUCCESS [4:16.653s]
[INFO] Maven Project Info Reports Plugin ................. SUCCESS [2:21.701s]
[INFO] Maven Remote Resources Plugin ..................... SUCCESS [1:01.172s]
[INFO] Maven Shade Plugin ................................ SUCCESS [3:30.989s]
[INFO] Maven Plugins Aggregator .......................... SUCCESS [0.066s]
[INFO] ------------------------------------------------------------------------
[INFO] BUILD FAILURE
[INFO] ------------------------------------------------------------------------
[INFO] Total time: 1:04:38.239s
[INFO] Finished at: Sat Sep 22 13:12:27 UTC 2012
[INFO] Final Memory: 98M/417M
[INFO] ------------------------------------------------------------------------
[WARNING] The requested profile "apache.snapshots" could not be activated because it does not exist.
[ERROR] Failed to execute goal org.apache.maven.plugins:maven-surefire-plugin:2.12:test (default-test) on project maven-changelog-plugin: There are test failures.
[ERROR]
[ERROR] Please refer to <https://builds.apache.org/job/maven-plugins-ITs-m3/ws/maven-changelog-plugin/target/surefire-reports> for the individual test results.
[ERROR] -> [Help 1]
[ERROR]
[ERROR] To see the full stack trace of the errors, re-run Maven with the -e switch.
[ERROR] Re-run Maven using the -X switch to enable full debug logging.
[ERROR]
[ERROR] For more information about the errors and possible solutions, please read the following articles:
[ERROR] [Help 1] http://cwiki.apache.org/confluence/display/MAVEN/MojoFailureException
[ERROR]
[ERROR] After correcting the problems, you can resume the build with the command
[ERROR] mvn <goals> -rf :maven-changelog-plugin
Build step 'Invoke top-level Maven targets' marked build as failure
Recording test results
Build failed in Jenkins: maven-plugins-ITs-m3 #680
Posted by Apache Jenkins Server <je...@builds.apache.org>.
See <https://builds.apache.org/job/maven-plugins-ITs-m3/680/changes>
Changes:
[krosenvold] Revert "added generics"
This reverts commit 19ae2a8f731d39653450c89d830f25e7ecf691bf.
[krosenvold] o Make asssembly compile on java7
------------------------------------------
[...truncated 9824 lines...]
Tests run: 1, Failures: 0, Errors: 0, Skipped: 0, Time elapsed: 0.042 sec
Running org.apache.maven.plugins.shade.mojo.ShadeMojoTest
Tests run: 4, Failures: 0, Errors: 0, Skipped: 0, Time elapsed: 2.476 sec
Running org.apache.maven.plugins.shade.mojo.ArtifactSelectorTest
Tests run: 1, Failures: 0, Errors: 0, Skipped: 0, Time elapsed: 0.001 sec
Running org.apache.maven.plugins.shade.mojo.ArtifactIdTest
Tests run: 2, Failures: 0, Errors: 0, Skipped: 0, Time elapsed: 0.002 sec
Running org.apache.maven.plugins.shade.filter.SimpleFilterTest
Tests run: 1, Failures: 0, Errors: 0, Skipped: 0, Time elapsed: 0.001 sec
Running org.apache.maven.plugins.shade.resource.AppendingTransformerTest
Tests run: 1, Failures: 0, Errors: 0, Skipped: 0, Time elapsed: 0.001 sec
Running org.apache.maven.plugins.shade.resource.ApacheNoticeResourceTransformerTest
Tests run: 1, Failures: 0, Errors: 0, Skipped: 0, Time elapsed: 0.001 sec
Running org.apache.maven.plugins.shade.resource.ApacheLicenseResourceTransformerTest
Tests run: 1, Failures: 0, Errors: 0, Skipped: 0, Time elapsed: 0 sec
Running org.apache.maven.plugins.shade.resource.XmlAppendingTransformerTest
Tests run: 1, Failures: 0, Errors: 0, Skipped: 0, Time elapsed: 0.005 sec
Running org.apache.maven.plugins.shade.resource.ComponentsXmlResourceTransformerTest
Tests run: 1, Failures: 0, Errors: 0, Skipped: 0, Time elapsed: 0.061 sec
Running org.apache.maven.plugins.shade.relocation.SimpleRelocatorParameterTest
Tests run: 2, Failures: 0, Errors: 0, Skipped: 0, Time elapsed: 0.001 sec
Running org.apache.maven.plugins.shade.relocation.SimpleRelocatorTest
Tests run: 7, Failures: 0, Errors: 0, Skipped: 0, Time elapsed: 0.004 sec
Running org.apache.maven.plugins.shade.DefaultShaderTest
Tests run: 4, Failures: 0, Errors: 0, Skipped: 0, Time elapsed: 0.93 sec
Results :
Tests run: 27, Failures: 0, Errors: 0, Skipped: 0
[INFO]
[INFO] --- maven-jar-plugin:2.4:jar (default-jar) @ maven-shade-plugin ---
[INFO] Building jar: <https://builds.apache.org/job/maven-plugins-ITs-m3/ws/maven-shade-plugin/target/maven-shade-plugin-2.0.1-SNAPSHOT.jar>
[INFO]
[INFO] --- maven-plugin-plugin:3.1:addPluginArtifactMetadata (default-addPluginArtifactMetadata) @ maven-shade-plugin ---
[INFO]
[INFO] --- maven-jar-plugin:2.4:test-jar (default) @ maven-shade-plugin ---
[INFO] Building jar: <https://builds.apache.org/job/maven-plugins-ITs-m3/ws/maven-shade-plugin/target/maven-shade-plugin-2.0.1-SNAPSHOT-tests.jar>
[INFO]
[INFO] --- maven-invoker-plugin:1.6:install (integration-test) @ maven-shade-plugin ---
[INFO] Installing <https://builds.apache.org/job/maven-plugins-ITs-m3/ws/maven-shade-plugin/pom.xml> to <https://builds.apache.org/job/maven-plugins-ITs-m3/ws/maven-shade-plugin/target/local-repo/org/apache/maven/plugins/maven-shade-plugin/2.0.1-SNAPSHOT/maven-shade-plugin-2.0.1-SNAPSHOT.pom>
[INFO] Installing <https://builds.apache.org/job/maven-plugins-ITs-m3/ws/maven-shade-plugin/target/maven-shade-plugin-2.0.1-SNAPSHOT.jar> to <https://builds.apache.org/job/maven-plugins-ITs-m3/ws/maven-shade-plugin/target/local-repo/org/apache/maven/plugins/maven-shade-plugin/2.0.1-SNAPSHOT/maven-shade-plugin-2.0.1-SNAPSHOT.jar>
[INFO] Installing <https://builds.apache.org/job/maven-plugins-ITs-m3/ws/maven-shade-plugin/target/maven-shade-plugin-2.0.1-SNAPSHOT-tests.jar> to <https://builds.apache.org/job/maven-plugins-ITs-m3/ws/maven-shade-plugin/target/local-repo/org/apache/maven/plugins/maven-shade-plugin/2.0.1-SNAPSHOT/maven-shade-plugin-2.0.1-SNAPSHOT-tests.jar>
[INFO]
[INFO] --- maven-invoker-plugin:1.6:integration-test (integration-test) @ maven-shade-plugin ---
[INFO] Building: shadePomDependency/pom.xml
[INFO] ..SUCCESS (5.7 s)
[INFO] Building: finalNameShade-attached/pom.xml
[INFO] run script <https://builds.apache.org/job/maven-plugins-ITs-m3/ws/maven-shade-plugin/target/it/finalNameShade-attached/setup.bsh>
[INFO] run script <https://builds.apache.org/job/maven-plugins-ITs-m3/ws/maven-shade-plugin/target/it/finalNameShade-attached/verify.bsh>
[INFO] ..SUCCESS (3.6 s)
[INFO] Building: attached-artifact-type/pom.xml
[INFO] ..SUCCESS (3.5 s)
[INFO] Building: project-with-reactors-included/pom.xml
[INFO] run script <https://builds.apache.org/job/maven-plugins-ITs-m3/ws/maven-shade-plugin/target/it/project-with-reactors-included/verify.bsh>
[INFO] ..SUCCESS (5.4 s)
[INFO] Building: pom-packaging/pom.xml
[INFO] run script <https://builds.apache.org/job/maven-plugins-ITs-m3/ws/maven-shade-plugin/target/it/pom-packaging/verify.bsh>
[INFO] ..SUCCESS (2.6 s)
[INFO] Building: users-shader-impl/pom.xml
[INFO] run script <https://builds.apache.org/job/maven-plugins-ITs-m3/ws/maven-shade-plugin/target/it/users-shader-impl/verify.groovy>
[INFO] ..SUCCESS (4.2 s)
[INFO] Building: mini-jar-respect-includes/pom.xml
[INFO] run script <https://builds.apache.org/job/maven-plugins-ITs-m3/ws/maven-shade-plugin/target/it/mini-jar-respect-includes/verify.bsh>
[INFO] ..SUCCESS (4.6 s)
[INFO] Building: reloc-includes-excludes/pom.xml
[INFO] run script <https://builds.apache.org/job/maven-plugins-ITs-m3/ws/maven-shade-plugin/target/it/reloc-includes-excludes/verify.bsh>
[INFO] ..SUCCESS (4.5 s)
[INFO] Building: manifest-retained/pom.xml
[INFO] run script <https://builds.apache.org/job/maven-plugins-ITs-m3/ws/maven-shade-plugin/target/it/manifest-retained/verify.bsh>
[INFO] ..SUCCESS (5.1 s)
[INFO] Building: implicit-inclusion-of-project-artifact/pom.xml
[INFO] run script <https://builds.apache.org/job/maven-plugins-ITs-m3/ws/maven-shade-plugin/target/it/implicit-inclusion-of-project-artifact/verify.bsh>
[INFO] ..SUCCESS (3.9 s)
[INFO] Building: dep-reduced-pom-relocated-result/pom.xml
[INFO] ..SUCCESS (2.9 s)
[INFO] Building: dep-reduced-pom-with-local-parent/pom.xml
[INFO] ..SUCCESS (2.8 s)
[INFO] Building: rerun-without-reloc/pom.xml
[INFO] ..SUCCESS (3.6 s)
[INFO] Building: finalNameBuild-attached/pom.xml
[INFO] run script <https://builds.apache.org/job/maven-plugins-ITs-m3/ws/maven-shade-plugin/target/it/finalNameBuild-attached/setup.bsh>
[INFO] run script <https://builds.apache.org/job/maven-plugins-ITs-m3/ws/maven-shade-plugin/target/it/finalNameBuild-attached/verify.bsh>
[INFO] ..SUCCESS (3.6 s)
[INFO] Building: empty-apache-notice-transform/pom.xml
[INFO] ..SUCCESS (4.3 s)
[INFO] Building: MSHADE-105/pom.xml
[INFO] run script <https://builds.apache.org/job/maven-plugins-ITs-m3/ws/maven-shade-plugin/target/it/MSHADE-105/verify.bsh>
[INFO] ..SUCCESS (7.7 s)
[INFO] Building: reloc-anno/pom.xml
[INFO] ..SUCCESS (3.5 s)
[INFO] Building: component-descriptor-relocation/pom.xml
[INFO] ..SUCCESS (4.2 s)
[INFO] Building: mini-jar-package-info/pom.xml
[INFO] run script <https://builds.apache.org/job/maven-plugins-ITs-m3/ws/maven-shade-plugin/target/it/mini-jar-package-info/verify.bsh>
[INFO] ..SUCCESS (4.4 s)
[INFO] Building: dep-reduced-pom/pom.xml
[INFO] run script <https://builds.apache.org/job/maven-plugins-ITs-m3/ws/maven-shade-plugin/target/it/dep-reduced-pom/verify.groovy>
[INFO] ..SUCCESS (3.8 s)
[INFO] Building: mshade-123/pom.xml
[INFO] ..SUCCESS (5.4 s)
[INFO] Building: reloc-enum-ref-from-anno/pom.xml
[INFO] ..SUCCESS (3.4 s)
[INFO] Building: rerun-with-reloc/pom.xml
[INFO] ..SUCCESS (5.6 s)
[INFO] Building: mini-jar/pom.xml
[INFO] run script <https://builds.apache.org/job/maven-plugins-ITs-m3/ws/maven-shade-plugin/target/it/mini-jar/verify.bsh>
[INFO] ..SUCCESS (4.1 s)
[INFO] Building: xml-transformer-ignores-dtd/pom.xml
[INFO] run script <https://builds.apache.org/job/maven-plugins-ITs-m3/ws/maven-shade-plugin/target/it/xml-transformer-ignores-dtd/verify.bsh>
[INFO] ..SUCCESS (3.6 s)
[INFO] Building: duplicate-classes-with-reloc/pom.xml
[INFO] ..SUCCESS (2.9 s)
[INFO] Building: finalNameShade/pom.xml
[INFO] run script <https://builds.apache.org/job/maven-plugins-ITs-m3/ws/maven-shade-plugin/target/it/finalNameShade/setup.bsh>
[INFO] run script <https://builds.apache.org/job/maven-plugins-ITs-m3/ws/maven-shade-plugin/target/it/finalNameShade/verify.bsh>
[INFO] ..SUCCESS (3.6 s)
[INFO] Building: finalNameBuild/pom.xml
[INFO] run script <https://builds.apache.org/job/maven-plugins-ITs-m3/ws/maven-shade-plugin/target/it/finalNameBuild/setup.bsh>
[INFO] run script <https://builds.apache.org/job/maven-plugins-ITs-m3/ws/maven-shade-plugin/target/it/finalNameBuild/verify.bsh>
[INFO] ..SUCCESS (3.5 s)
[INFO] Building: filter-artifact-contents/pom.xml
[INFO] run script <https://builds.apache.org/job/maven-plugins-ITs-m3/ws/maven-shade-plugin/target/it/filter-artifact-contents/verify.bsh>
[INFO] ..SUCCESS (3.6 s)
[INFO] Building: artifact-includes-excludes/pom.xml
[INFO] run script <https://builds.apache.org/job/maven-plugins-ITs-m3/ws/maven-shade-plugin/target/it/artifact-includes-excludes/verify.bsh>
[INFO] ..SUCCESS (3.7 s)
[INFO] Building: non-runtime-scope-excluded/pom.xml
[INFO] run script <https://builds.apache.org/job/maven-plugins-ITs-m3/ws/maven-shade-plugin/target/it/non-runtime-scope-excluded/verify.bsh>
[INFO] ..SUCCESS (3.6 s)
[INFO] Building: manifest-transformed/pom.xml
[INFO] run script <https://builds.apache.org/job/maven-plugins-ITs-m3/ws/maven-shade-plugin/target/it/manifest-transformed/verify.bsh>
[INFO] ..SUCCESS (4.7 s)
[INFO] Building: dep-reduced-pom-unique/pom.xml
[INFO] run script <https://builds.apache.org/job/maven-plugins-ITs-m3/ws/maven-shade-plugin/target/it/dep-reduced-pom-unique/verify.groovy>
[INFO] ..SUCCESS (4.1 s)
[INFO] Building: reloc-abs-resource-path/pom.xml
[INFO] ..SUCCESS (5.6 s)
[INFO] Building: services-resource-transformer/pom.xml
[INFO] run script <https://builds.apache.org/job/maven-plugins-ITs-m3/ws/maven-shade-plugin/target/it/services-resource-transformer/verify.bsh>
[INFO] ..SUCCESS (3.6 s)
[INFO] Building: reloc-class-from-string-pool/pom.xml
[INFO] ..SUCCESS (3.2 s)
[INFO] Building: attach-after-lifecycle-fork/pom.xml
[INFO] run script <https://builds.apache.org/job/maven-plugins-ITs-m3/ws/maven-shade-plugin/target/it/attach-after-lifecycle-fork/setup.bsh>
[INFO] run script <https://builds.apache.org/job/maven-plugins-ITs-m3/ws/maven-shade-plugin/target/it/attach-after-lifecycle-fork/verify.bsh>
[INFO] ..SUCCESS (3.1 s)
[INFO] Building: mini-jar-malformed-dependencies/pom.xml
[INFO] ..SUCCESS (7.1 s)
[INFO] Building: duplicate-classes-without-reloc/pom.xml
[INFO] ..SUCCESS (2.8 s)
[INFO] Building: empty-relocation-shaded-pattern/pom.xml
[INFO] ..SUCCESS (3.4 s)
[INFO] Building: empty-relocation-pattern/pom.xml
[INFO] ..SUCCESS (3.5 s)
[INFO]
[INFO] --- maven-invoker-plugin:1.6:verify (integration-test) @ maven-shade-plugin ---
[INFO] -------------------------------------------------
[INFO] Build Summary:
[INFO] Passed: 41, Failed: 0, Errors: 0, Skipped: 0
[INFO] -------------------------------------------------
[INFO]
[INFO] --- maven-install-plugin:2.3.1:install (default-install) @ maven-shade-plugin ---
[INFO] Installing <https://builds.apache.org/job/maven-plugins-ITs-m3/ws/maven-shade-plugin/target/maven-shade-plugin-2.0.1-SNAPSHOT.jar> to /home/jenkins/.m2/repository/org/apache/maven/plugins/maven-shade-plugin/2.0.1-SNAPSHOT/maven-shade-plugin-2.0.1-SNAPSHOT.jar
[INFO] Installing <https://builds.apache.org/job/maven-plugins-ITs-m3/ws/maven-shade-plugin/pom.xml> to /home/jenkins/.m2/repository/org/apache/maven/plugins/maven-shade-plugin/2.0.1-SNAPSHOT/maven-shade-plugin-2.0.1-SNAPSHOT.pom
[INFO] Installing <https://builds.apache.org/job/maven-plugins-ITs-m3/ws/maven-shade-plugin/target/maven-shade-plugin-2.0.1-SNAPSHOT-tests.jar> to /home/jenkins/.m2/repository/org/apache/maven/plugins/maven-shade-plugin/2.0.1-SNAPSHOT/maven-shade-plugin-2.0.1-SNAPSHOT-tests.jar
[INFO]
[INFO] ------------------------------------------------------------------------
[INFO] Building Maven Plugins Aggregator 1-SNAPSHOT
[INFO] ------------------------------------------------------------------------
[INFO]
[INFO] --- maven-clean-plugin:2.4.1:clean (default-clean) @ maven-plugins-aggregator ---
[INFO] Deleting <https://builds.apache.org/job/maven-plugins-ITs-m3/ws/target>
[INFO]
[INFO] --- maven-remote-resources-plugin:1.1:process (default) @ maven-plugins-aggregator ---
[INFO]
[INFO] --- maven-install-plugin:2.3.1:install (default-install) @ maven-plugins-aggregator ---
[INFO] Installing <https://builds.apache.org/job/maven-plugins-ITs-m3/ws/pom.xml> to /home/jenkins/.m2/repository/org/apache/maven/plugins/maven-plugins-aggregator/1-SNAPSHOT/maven-plugins-aggregator-1-SNAPSHOT.pom
[INFO] ------------------------------------------------------------------------
[INFO] Reactor Summary:
[INFO]
[INFO] Maven Plugins ..................................... SUCCESS [19.143s]
[INFO] Maven ACR Plugin .................................. SUCCESS [53.885s]
[INFO] Maven Ant Plugin .................................. SUCCESS [1:11.484s]
[INFO] Maven AntRun Plugin ............................... SUCCESS [1:00.196s]
[INFO] Maven Eclipse Plugin .............................. SUCCESS [7:44.960s]
[INFO] Maven Assembly Plugin ............................. SUCCESS [11:32.839s]
[INFO] Maven Changelog Plugin ............................ SUCCESS [43.839s]
[INFO] Maven Changes Report Plugin ....................... SUCCESS [58.809s]
[INFO] Maven Checkstyle Plugin ........................... SUCCESS [1:42.070s]
[INFO] Maven Clean Plugin ................................ SUCCESS [19.839s]
[INFO] Maven Compiler Plugin ............................. SUCCESS [59.272s]
[INFO] Maven Dependency Plugin ........................... SUCCESS [2:16.527s]
[INFO] Maven Deploy Plugin ............................... SUCCESS [1:03.951s]
[INFO] Maven DOAP Plugin ................................. SUCCESS [18.602s]
[INFO] Maven Documentation Checker Plugin ................ SUCCESS [13.254s]
[INFO] Maven EAR Plugin .................................. SUCCESS [3:57.045s]
[INFO] Maven EJB Plugin .................................. SUCCESS [28.444s]
[INFO] Maven GPG Plugin .................................. SUCCESS [10.661s]
[INFO] Maven Help Plugin ................................. SUCCESS [35.432s]
[INFO] Maven IDEA Plugin ................................. SUCCESS [10.911s]
[INFO] Maven Install Plugin .............................. SUCCESS [40.464s]
[INFO] Maven JAR Plugin .................................. SUCCESS [1:08.554s]
[INFO] Maven Jarsigner Plugin ............................ SUCCESS [29.966s]
[INFO] Maven Javadoc Plugin .............................. FAILURE [1:14.372s]
[INFO] Maven Linkcheck Plugin ............................ SUCCESS [3.237s]
[INFO] Maven One Plugin .................................. SUCCESS [1.662s]
[INFO] Maven Patch Plugin ................................ SUCCESS [13.824s]
[INFO] Maven PDF Plugin .................................. SUCCESS [2:44.362s]
[INFO] Maven PMD Plugin .................................. SUCCESS [53.646s]
[INFO] Maven RAR Plugin .................................. SUCCESS [11.493s]
[INFO] Maven Reactor Plugin .............................. SUCCESS [3.118s]
[INFO] Maven Repository Plugin ........................... SUCCESS [44.722s]
[INFO] Maven Resources Plugin ............................ SUCCESS [58.592s]
[INFO] Maven Site Plugin 3 ............................... SUCCESS [6:36.579s]
[INFO] Maven Source Plugin ............................... SUCCESS [46.310s]
[INFO] Maven Stage Plugin ................................ SUCCESS [2.424s]
[INFO] Maven Toolchains Plugin ........................... SUCCESS [2.132s]
[INFO] Maven Verifier Plugin ............................. SUCCESS [16.150s]
[INFO] Maven WAR Plugin .................................. SUCCESS [1:29.848s]
[INFO] SCM Publish Maven Plugin .......................... SUCCESS [1:17.886s]
[INFO] Maven Invoker Plugin .............................. SUCCESS [4:20.302s]
[INFO] Maven Project Info Reports Plugin ................. SUCCESS [2:48.291s]
[INFO] Maven Remote Resources Plugin ..................... SUCCESS [58.205s]
[INFO] Maven Shade Plugin ................................ SUCCESS [3:14.453s]
[INFO] Maven Plugins Aggregator .......................... SUCCESS [0.059s]
[INFO] ------------------------------------------------------------------------
[INFO] BUILD FAILURE
[INFO] ------------------------------------------------------------------------
[INFO] Total time: 1:08:03.424s
[INFO] Finished at: Fri Sep 28 21:17:16 UTC 2012
[INFO] Final Memory: 105M/424M
[INFO] ------------------------------------------------------------------------
[WARNING] The requested profile "apache.snapshots" could not be activated because it does not exist.
[ERROR] Failed to execute goal org.apache.maven.plugins:maven-surefire-plugin:2.12:test (default-test) on project maven-javadoc-plugin: There are test failures.
[ERROR]
[ERROR] Please refer to <https://builds.apache.org/job/maven-plugins-ITs-m3/ws/maven-javadoc-plugin/target/surefire-reports> for the individual test results.
[ERROR] -> [Help 1]
[ERROR]
[ERROR] To see the full stack trace of the errors, re-run Maven with the -e switch.
[ERROR] Re-run Maven using the -X switch to enable full debug logging.
[ERROR]
[ERROR] For more information about the errors and possible solutions, please read the following articles:
[ERROR] [Help 1] http://cwiki.apache.org/confluence/display/MAVEN/MojoFailureException
[ERROR]
[ERROR] After correcting the problems, you can resume the build with the command
[ERROR] mvn <goals> -rf :maven-javadoc-plugin
Build step 'Invoke top-level Maven targets' marked build as failure
Recording test results
Build failed in Jenkins: maven-plugins-ITs-m3 #679
Posted by Apache Jenkins Server <je...@builds.apache.org>.
See <https://builds.apache.org/job/maven-plugins-ITs-m3/679/changes>
Changes:
[dennisl] [maven-release-plugin] prepare for next development iteration
[dennisl] [maven-release-plugin] prepare release maven-war-plugin-2.3
[dennisl] [MWAR-164] Support for specifying which encoding to use when filtering resources
- Add more documentation.
------------------------------------------
[...truncated 9770 lines...]
Tests run: 1, Failures: 0, Errors: 0, Skipped: 0, Time elapsed: 0.04 sec
Running org.apache.maven.plugins.shade.mojo.ArtifactIdTest
Tests run: 2, Failures: 0, Errors: 0, Skipped: 0, Time elapsed: 0.002 sec
Running org.apache.maven.plugins.shade.DefaultShaderTest
Tests run: 4, Failures: 0, Errors: 0, Skipped: 0, Time elapsed: 0.837 sec
Running org.apache.maven.plugins.shade.resource.AppendingTransformerTest
Tests run: 1, Failures: 0, Errors: 0, Skipped: 0, Time elapsed: 0.001 sec
Running org.apache.maven.plugins.shade.resource.ApacheNoticeResourceTransformerTest
Tests run: 1, Failures: 0, Errors: 0, Skipped: 0, Time elapsed: 0.001 sec
Running org.apache.maven.plugins.shade.resource.XmlAppendingTransformerTest
Tests run: 1, Failures: 0, Errors: 0, Skipped: 0, Time elapsed: 0.005 sec
Running org.apache.maven.plugins.shade.resource.ApacheLicenseResourceTransformerTest
Tests run: 1, Failures: 0, Errors: 0, Skipped: 0, Time elapsed: 0 sec
Running org.apache.maven.plugins.shade.resource.ComponentsXmlResourceTransformerTest
Tests run: 1, Failures: 0, Errors: 0, Skipped: 0, Time elapsed: 0.06 sec
Running org.apache.maven.plugins.shade.filter.SimpleFilterTest
Tests run: 1, Failures: 0, Errors: 0, Skipped: 0, Time elapsed: 0 sec
Running org.apache.maven.plugins.shade.relocation.SimpleRelocatorParameterTest
Tests run: 2, Failures: 0, Errors: 0, Skipped: 0, Time elapsed: 0 sec
Running org.apache.maven.plugins.shade.relocation.SimpleRelocatorTest
Tests run: 7, Failures: 0, Errors: 0, Skipped: 0, Time elapsed: 0.002 sec
Results :
Tests run: 27, Failures: 0, Errors: 0, Skipped: 0
[INFO]
[INFO] --- maven-jar-plugin:2.4:jar (default-jar) @ maven-shade-plugin ---
[INFO] Building jar: <https://builds.apache.org/job/maven-plugins-ITs-m3/ws/maven-shade-plugin/target/maven-shade-plugin-2.0.1-SNAPSHOT.jar>
[INFO]
[INFO] --- maven-plugin-plugin:3.1:addPluginArtifactMetadata (default-addPluginArtifactMetadata) @ maven-shade-plugin ---
[INFO]
[INFO] --- maven-jar-plugin:2.4:test-jar (default) @ maven-shade-plugin ---
[INFO] Building jar: <https://builds.apache.org/job/maven-plugins-ITs-m3/ws/maven-shade-plugin/target/maven-shade-plugin-2.0.1-SNAPSHOT-tests.jar>
[INFO]
[INFO] --- maven-invoker-plugin:1.6:install (integration-test) @ maven-shade-plugin ---
[INFO] Installing <https://builds.apache.org/job/maven-plugins-ITs-m3/ws/maven-shade-plugin/pom.xml> to <https://builds.apache.org/job/maven-plugins-ITs-m3/ws/maven-shade-plugin/target/local-repo/org/apache/maven/plugins/maven-shade-plugin/2.0.1-SNAPSHOT/maven-shade-plugin-2.0.1-SNAPSHOT.pom>
[INFO] Installing <https://builds.apache.org/job/maven-plugins-ITs-m3/ws/maven-shade-plugin/target/maven-shade-plugin-2.0.1-SNAPSHOT.jar> to <https://builds.apache.org/job/maven-plugins-ITs-m3/ws/maven-shade-plugin/target/local-repo/org/apache/maven/plugins/maven-shade-plugin/2.0.1-SNAPSHOT/maven-shade-plugin-2.0.1-SNAPSHOT.jar>
[INFO] Installing <https://builds.apache.org/job/maven-plugins-ITs-m3/ws/maven-shade-plugin/target/maven-shade-plugin-2.0.1-SNAPSHOT-tests.jar> to <https://builds.apache.org/job/maven-plugins-ITs-m3/ws/maven-shade-plugin/target/local-repo/org/apache/maven/plugins/maven-shade-plugin/2.0.1-SNAPSHOT/maven-shade-plugin-2.0.1-SNAPSHOT-tests.jar>
[INFO]
[INFO] --- maven-invoker-plugin:1.6:integration-test (integration-test) @ maven-shade-plugin ---
[INFO] Building: xml-transformer-ignores-dtd/pom.xml
[INFO] run script <https://builds.apache.org/job/maven-plugins-ITs-m3/ws/maven-shade-plugin/target/it/xml-transformer-ignores-dtd/verify.bsh>
[INFO] ..SUCCESS (4.4 s)
[INFO] Building: attach-after-lifecycle-fork/pom.xml
[INFO] run script <https://builds.apache.org/job/maven-plugins-ITs-m3/ws/maven-shade-plugin/target/it/attach-after-lifecycle-fork/setup.bsh>
[INFO] run script <https://builds.apache.org/job/maven-plugins-ITs-m3/ws/maven-shade-plugin/target/it/attach-after-lifecycle-fork/verify.bsh>
[INFO] ..SUCCESS (4.3 s)
[INFO] Building: duplicate-classes-without-reloc/pom.xml
[INFO] ..SUCCESS (2.9 s)
[INFO] Building: filter-artifact-contents/pom.xml
[INFO] run script <https://builds.apache.org/job/maven-plugins-ITs-m3/ws/maven-shade-plugin/target/it/filter-artifact-contents/verify.bsh>
[INFO] ..SUCCESS (3.6 s)
[INFO] Building: component-descriptor-relocation/pom.xml
[INFO] ..SUCCESS (4.3 s)
[INFO] Building: finalNameShade/pom.xml
[INFO] run script <https://builds.apache.org/job/maven-plugins-ITs-m3/ws/maven-shade-plugin/target/it/finalNameShade/setup.bsh>
[INFO] run script <https://builds.apache.org/job/maven-plugins-ITs-m3/ws/maven-shade-plugin/target/it/finalNameShade/verify.bsh>
[INFO] ..SUCCESS (3.7 s)
[INFO] Building: manifest-retained/pom.xml
[INFO] run script <https://builds.apache.org/job/maven-plugins-ITs-m3/ws/maven-shade-plugin/target/it/manifest-retained/verify.bsh>
[INFO] ..SUCCESS (4.9 s)
[INFO] Building: manifest-transformed/pom.xml
[INFO] run script <https://builds.apache.org/job/maven-plugins-ITs-m3/ws/maven-shade-plugin/target/it/manifest-transformed/verify.bsh>
[INFO] ..SUCCESS (4.7 s)
[INFO] Building: services-resource-transformer/pom.xml
[INFO] run script <https://builds.apache.org/job/maven-plugins-ITs-m3/ws/maven-shade-plugin/target/it/services-resource-transformer/verify.bsh>
[INFO] ..SUCCESS (3.6 s)
[INFO] Building: pom-packaging/pom.xml
[INFO] run script <https://builds.apache.org/job/maven-plugins-ITs-m3/ws/maven-shade-plugin/target/it/pom-packaging/verify.bsh>
[INFO] ..SUCCESS (2.6 s)
[INFO] Building: non-runtime-scope-excluded/pom.xml
[INFO] run script <https://builds.apache.org/job/maven-plugins-ITs-m3/ws/maven-shade-plugin/target/it/non-runtime-scope-excluded/verify.bsh>
[INFO] ..SUCCESS (3.6 s)
[INFO] Building: reloc-anno/pom.xml
[INFO] ..SUCCESS (3.3 s)
[INFO] Building: mini-jar-respect-includes/pom.xml
[INFO] run script <https://builds.apache.org/job/maven-plugins-ITs-m3/ws/maven-shade-plugin/target/it/mini-jar-respect-includes/verify.bsh>
[INFO] ..SUCCESS (4.6 s)
[INFO] Building: empty-relocation-pattern/pom.xml
[INFO] ..SUCCESS (3.4 s)
[INFO] Building: finalNameBuild/pom.xml
[INFO] run script <https://builds.apache.org/job/maven-plugins-ITs-m3/ws/maven-shade-plugin/target/it/finalNameBuild/setup.bsh>
[INFO] run script <https://builds.apache.org/job/maven-plugins-ITs-m3/ws/maven-shade-plugin/target/it/finalNameBuild/verify.bsh>
[INFO] ..SUCCESS (3.6 s)
[INFO] Building: attached-artifact-type/pom.xml
[INFO] ..SUCCESS (3.6 s)
[INFO] Building: empty-relocation-shaded-pattern/pom.xml
[INFO] ..SUCCESS (3.5 s)
[INFO] Building: reloc-includes-excludes/pom.xml
[INFO] run script <https://builds.apache.org/job/maven-plugins-ITs-m3/ws/maven-shade-plugin/target/it/reloc-includes-excludes/verify.bsh>
[INFO] ..SUCCESS (4.3 s)
[INFO] Building: rerun-with-reloc/pom.xml
[INFO] ..SUCCESS (5.5 s)
[INFO] Building: implicit-inclusion-of-project-artifact/pom.xml
[INFO] run script <https://builds.apache.org/job/maven-plugins-ITs-m3/ws/maven-shade-plugin/target/it/implicit-inclusion-of-project-artifact/verify.bsh>
[INFO] ..SUCCESS (3.9 s)
[INFO] Building: duplicate-classes-with-reloc/pom.xml
[INFO] ..SUCCESS (2.9 s)
[INFO] Building: dep-reduced-pom/pom.xml
[INFO] run script <https://builds.apache.org/job/maven-plugins-ITs-m3/ws/maven-shade-plugin/target/it/dep-reduced-pom/verify.groovy>
[INFO] ..SUCCESS (3.8 s)
[INFO] Building: rerun-without-reloc/pom.xml
[INFO] ..SUCCESS (3.5 s)
[INFO] Building: finalNameBuild-attached/pom.xml
[INFO] run script <https://builds.apache.org/job/maven-plugins-ITs-m3/ws/maven-shade-plugin/target/it/finalNameBuild-attached/setup.bsh>
[INFO] run script <https://builds.apache.org/job/maven-plugins-ITs-m3/ws/maven-shade-plugin/target/it/finalNameBuild-attached/verify.bsh>
[INFO] ..SUCCESS (3.6 s)
[INFO] Building: finalNameShade-attached/pom.xml
[INFO] run script <https://builds.apache.org/job/maven-plugins-ITs-m3/ws/maven-shade-plugin/target/it/finalNameShade-attached/setup.bsh>
[INFO] run script <https://builds.apache.org/job/maven-plugins-ITs-m3/ws/maven-shade-plugin/target/it/finalNameShade-attached/verify.bsh>
[INFO] ..SUCCESS (3.6 s)
[INFO] Building: shadePomDependency/pom.xml
[INFO] ..SUCCESS (4.5 s)
[INFO] Building: artifact-includes-excludes/pom.xml
[INFO] run script <https://builds.apache.org/job/maven-plugins-ITs-m3/ws/maven-shade-plugin/target/it/artifact-includes-excludes/verify.bsh>
[INFO] ..SUCCESS (3.6 s)
[INFO] Building: reloc-enum-ref-from-anno/pom.xml
[INFO] ..SUCCESS (3.4 s)
[INFO] Building: mini-jar-package-info/pom.xml
[INFO] run script <https://builds.apache.org/job/maven-plugins-ITs-m3/ws/maven-shade-plugin/target/it/mini-jar-package-info/verify.bsh>
[INFO] ..SUCCESS (4.4 s)
[INFO] Building: project-with-reactors-included/pom.xml
[INFO] run script <https://builds.apache.org/job/maven-plugins-ITs-m3/ws/maven-shade-plugin/target/it/project-with-reactors-included/verify.bsh>
[INFO] ..SUCCESS (5.5 s)
[INFO] Building: dep-reduced-pom-with-local-parent/pom.xml
[INFO] ..SUCCESS (2.8 s)
[INFO] Building: mini-jar/pom.xml
[INFO] run script <https://builds.apache.org/job/maven-plugins-ITs-m3/ws/maven-shade-plugin/target/it/mini-jar/verify.bsh>
[INFO] ..SUCCESS (3.9 s)
[INFO] Building: dep-reduced-pom-unique/pom.xml
[INFO] run script <https://builds.apache.org/job/maven-plugins-ITs-m3/ws/maven-shade-plugin/target/it/dep-reduced-pom-unique/verify.groovy>
[INFO] ..SUCCESS (4.5 s)
[INFO] Building: mini-jar-malformed-dependencies/pom.xml
[INFO] ..SUCCESS (8.0 s)
[INFO] Building: reloc-abs-resource-path/pom.xml
[INFO] ..SUCCESS (6.5 s)
[INFO] Building: MSHADE-105/pom.xml
[INFO] run script <https://builds.apache.org/job/maven-plugins-ITs-m3/ws/maven-shade-plugin/target/it/MSHADE-105/verify.bsh>
[INFO] ..SUCCESS (7.5 s)
[INFO] Building: mshade-123/pom.xml
[INFO] ..SUCCESS (5.4 s)
[INFO] Building: reloc-class-from-string-pool/pom.xml
[INFO] ..SUCCESS (3.3 s)
[INFO] Building: users-shader-impl/pom.xml
[INFO] run script <https://builds.apache.org/job/maven-plugins-ITs-m3/ws/maven-shade-plugin/target/it/users-shader-impl/verify.groovy>
[INFO] ..SUCCESS (4.2 s)
[INFO] Building: empty-apache-notice-transform/pom.xml
[INFO] ..SUCCESS (4.3 s)
[INFO] Building: dep-reduced-pom-relocated-result/pom.xml
[INFO] ..SUCCESS (2.8 s)
[INFO]
[INFO] --- maven-invoker-plugin:1.6:verify (integration-test) @ maven-shade-plugin ---
[INFO] -------------------------------------------------
[INFO] Build Summary:
[INFO] Passed: 41, Failed: 0, Errors: 0, Skipped: 0
[INFO] -------------------------------------------------
[INFO]
[INFO] --- maven-install-plugin:2.3.1:install (default-install) @ maven-shade-plugin ---
[INFO] Installing <https://builds.apache.org/job/maven-plugins-ITs-m3/ws/maven-shade-plugin/target/maven-shade-plugin-2.0.1-SNAPSHOT.jar> to /home/jenkins/.m2/repository/org/apache/maven/plugins/maven-shade-plugin/2.0.1-SNAPSHOT/maven-shade-plugin-2.0.1-SNAPSHOT.jar
[INFO] Installing <https://builds.apache.org/job/maven-plugins-ITs-m3/ws/maven-shade-plugin/pom.xml> to /home/jenkins/.m2/repository/org/apache/maven/plugins/maven-shade-plugin/2.0.1-SNAPSHOT/maven-shade-plugin-2.0.1-SNAPSHOT.pom
[INFO] Installing <https://builds.apache.org/job/maven-plugins-ITs-m3/ws/maven-shade-plugin/target/maven-shade-plugin-2.0.1-SNAPSHOT-tests.jar> to /home/jenkins/.m2/repository/org/apache/maven/plugins/maven-shade-plugin/2.0.1-SNAPSHOT/maven-shade-plugin-2.0.1-SNAPSHOT-tests.jar
[INFO]
[INFO] ------------------------------------------------------------------------
[INFO] Building Maven Plugins Aggregator 1-SNAPSHOT
[INFO] ------------------------------------------------------------------------
[INFO]
[INFO] --- maven-clean-plugin:2.4.1:clean (default-clean) @ maven-plugins-aggregator ---
[INFO] Deleting <https://builds.apache.org/job/maven-plugins-ITs-m3/ws/target>
[INFO]
[INFO] --- maven-remote-resources-plugin:1.1:process (default) @ maven-plugins-aggregator ---
[INFO]
[INFO] --- maven-install-plugin:2.3.1:install (default-install) @ maven-plugins-aggregator ---
[INFO] Installing <https://builds.apache.org/job/maven-plugins-ITs-m3/ws/pom.xml> to /home/jenkins/.m2/repository/org/apache/maven/plugins/maven-plugins-aggregator/1-SNAPSHOT/maven-plugins-aggregator-1-SNAPSHOT.pom
[INFO] ------------------------------------------------------------------------
[INFO] Reactor Summary:
[INFO]
[INFO] Maven Plugins ..................................... SUCCESS [4.156s]
[INFO] Maven ACR Plugin .................................. SUCCESS [23.109s]
[INFO] Maven Ant Plugin .................................. SUCCESS [1:06.716s]
[INFO] Maven AntRun Plugin ............................... SUCCESS [56.073s]
[INFO] Maven Eclipse Plugin .............................. SUCCESS [7:10.878s]
[INFO] Maven Assembly Plugin ............................. SUCCESS [11:44.487s]
[INFO] Maven Changelog Plugin ............................ FAILURE [8.044s]
[INFO] Maven Changes Report Plugin ....................... SUCCESS [1:03.343s]
[INFO] Maven Checkstyle Plugin ........................... SUCCESS [1:49.204s]
[INFO] Maven Clean Plugin ................................ SUCCESS [20.762s]
[INFO] Maven Compiler Plugin ............................. SUCCESS [55.572s]
[INFO] Maven Dependency Plugin ........................... SUCCESS [2:22.400s]
[INFO] Maven Deploy Plugin ............................... SUCCESS [1:04.937s]
[INFO] Maven DOAP Plugin ................................. SUCCESS [17.788s]
[INFO] Maven Documentation Checker Plugin ................ SUCCESS [6.013s]
[INFO] Maven EAR Plugin .................................. SUCCESS [3:59.186s]
[INFO] Maven EJB Plugin .................................. SUCCESS [29.968s]
[INFO] Maven GPG Plugin .................................. SUCCESS [10.911s]
[INFO] Maven Help Plugin ................................. SUCCESS [37.410s]
[INFO] Maven IDEA Plugin ................................. SUCCESS [8.281s]
[INFO] Maven Install Plugin .............................. SUCCESS [42.738s]
[INFO] Maven JAR Plugin .................................. SUCCESS [1:13.951s]
[INFO] Maven Jarsigner Plugin ............................ SUCCESS [25.973s]
[INFO] Maven Javadoc Plugin .............................. FAILURE [1:24.072s]
[INFO] Maven Linkcheck Plugin ............................ SUCCESS [3.030s]
[INFO] Maven One Plugin .................................. SUCCESS [1.487s]
[INFO] Maven Patch Plugin ................................ SUCCESS [13.095s]
[INFO] Maven PDF Plugin .................................. SUCCESS [2:02.047s]
[INFO] Maven PMD Plugin .................................. SUCCESS [42.695s]
[INFO] Maven RAR Plugin .................................. SUCCESS [11.872s]
[INFO] Maven Reactor Plugin .............................. SUCCESS [2.457s]
[INFO] Maven Repository Plugin ........................... SUCCESS [42.574s]
[INFO] Maven Resources Plugin ............................ SUCCESS [57.695s]
[INFO] Maven Site Plugin 3 ............................... SUCCESS [7:44.349s]
[INFO] Maven Source Plugin ............................... SUCCESS [47.219s]
[INFO] Maven Stage Plugin ................................ SUCCESS [2.711s]
[INFO] Maven Toolchains Plugin ........................... SUCCESS [2.752s]
[INFO] Maven Verifier Plugin ............................. SUCCESS [17.415s]
[INFO] Maven WAR Plugin .................................. SUCCESS [1:21.407s]
[INFO] SCM Publish Maven Plugin .......................... SUCCESS [1:12.666s]
[INFO] Maven Invoker Plugin .............................. SUCCESS [4:04.720s]
[INFO] Maven Project Info Reports Plugin ................. SUCCESS [3:05.285s]
[INFO] Maven Remote Resources Plugin ..................... SUCCESS [56.870s]
[INFO] Maven Shade Plugin ................................ SUCCESS [3:03.591s]
[INFO] Maven Plugins Aggregator .......................... SUCCESS [0.035s]
[INFO] ------------------------------------------------------------------------
[INFO] BUILD FAILURE
[INFO] ------------------------------------------------------------------------
[INFO] Total time: 1:06:23.164s
[INFO] Finished at: Fri Sep 28 07:26:11 UTC 2012
[INFO] Final Memory: 82M/312M
[INFO] ------------------------------------------------------------------------
[WARNING] The requested profile "apache.snapshots" could not be activated because it does not exist.
[ERROR] Failed to execute goal org.apache.maven.plugins:maven-surefire-plugin:2.12:test (default-test) on project maven-changelog-plugin: There are test failures.
[ERROR]
[ERROR] Please refer to <https://builds.apache.org/job/maven-plugins-ITs-m3/ws/maven-changelog-plugin/target/surefire-reports> for the individual test results.
[ERROR] -> [Help 1]
[ERROR] Failed to execute goal org.apache.maven.plugins:maven-surefire-plugin:2.12:test (default-test) on project maven-javadoc-plugin: There are test failures.
[ERROR]
[ERROR] Please refer to <https://builds.apache.org/job/maven-plugins-ITs-m3/ws/maven-javadoc-plugin/target/surefire-reports> for the individual test results.
[ERROR] -> [Help 1]
[ERROR]
[ERROR] To see the full stack trace of the errors, re-run Maven with the -e switch.
[ERROR] Re-run Maven using the -X switch to enable full debug logging.
[ERROR]
[ERROR] For more information about the errors and possible solutions, please read the following articles:
[ERROR] [Help 1] http://cwiki.apache.org/confluence/display/MAVEN/MojoFailureException
[ERROR]
[ERROR] After correcting the problems, you can resume the build with the command
[ERROR] mvn <goals> -rf :maven-changelog-plugin
Build step 'Invoke top-level Maven targets' marked build as failure
Recording test results
Build failed in Jenkins: maven-plugins-ITs-m3 #678
Posted by Apache Jenkins Server <je...@builds.apache.org>.
See <https://builds.apache.org/job/maven-plugins-ITs-m3/678/changes>
Changes:
[dennisl] [MASSEMBLY-629] Explanation of default value for useAllReactorProjects is at best confusing, possibly wrong
The documentation was wrong regarding the default value. I went ahead and removed all "Default value is..." texts I could find from the <description>s. They are already there in the <defaultValue> elements which are generated in the site reference.
------------------------------------------
[...truncated 9768 lines...]
Tests run: 1, Failures: 0, Errors: 0, Skipped: 0, Time elapsed: 0.219 sec
Running org.apache.maven.plugins.shade.mojo.ArtifactIdTest
Tests run: 2, Failures: 0, Errors: 0, Skipped: 0, Time elapsed: 0.003 sec
Running org.apache.maven.plugins.shade.DefaultShaderTest
Tests run: 4, Failures: 0, Errors: 0, Skipped: 0, Time elapsed: 0.837 sec
Running org.apache.maven.plugins.shade.resource.AppendingTransformerTest
Tests run: 1, Failures: 0, Errors: 0, Skipped: 0, Time elapsed: 0.001 sec
Running org.apache.maven.plugins.shade.resource.ApacheNoticeResourceTransformerTest
Tests run: 1, Failures: 0, Errors: 0, Skipped: 0, Time elapsed: 0.001 sec
Running org.apache.maven.plugins.shade.resource.XmlAppendingTransformerTest
Tests run: 1, Failures: 0, Errors: 0, Skipped: 0, Time elapsed: 0.005 sec
Running org.apache.maven.plugins.shade.resource.ApacheLicenseResourceTransformerTest
Tests run: 1, Failures: 0, Errors: 0, Skipped: 0, Time elapsed: 0.001 sec
Running org.apache.maven.plugins.shade.resource.ComponentsXmlResourceTransformerTest
Tests run: 1, Failures: 0, Errors: 0, Skipped: 0, Time elapsed: 0.063 sec
Running org.apache.maven.plugins.shade.filter.SimpleFilterTest
Tests run: 1, Failures: 0, Errors: 0, Skipped: 0, Time elapsed: 0 sec
Running org.apache.maven.plugins.shade.relocation.SimpleRelocatorParameterTest
Tests run: 2, Failures: 0, Errors: 0, Skipped: 0, Time elapsed: 0.001 sec
Running org.apache.maven.plugins.shade.relocation.SimpleRelocatorTest
Tests run: 7, Failures: 0, Errors: 0, Skipped: 0, Time elapsed: 0.005 sec
Results :
Tests run: 27, Failures: 0, Errors: 0, Skipped: 0
[INFO]
[INFO] --- maven-jar-plugin:2.4:jar (default-jar) @ maven-shade-plugin ---
[INFO] Building jar: <https://builds.apache.org/job/maven-plugins-ITs-m3/ws/maven-shade-plugin/target/maven-shade-plugin-2.0.1-SNAPSHOT.jar>
[INFO]
[INFO] --- maven-plugin-plugin:3.1:addPluginArtifactMetadata (default-addPluginArtifactMetadata) @ maven-shade-plugin ---
[INFO]
[INFO] --- maven-jar-plugin:2.4:test-jar (default) @ maven-shade-plugin ---
[INFO] Building jar: <https://builds.apache.org/job/maven-plugins-ITs-m3/ws/maven-shade-plugin/target/maven-shade-plugin-2.0.1-SNAPSHOT-tests.jar>
[INFO]
[INFO] --- maven-invoker-plugin:1.6:install (integration-test) @ maven-shade-plugin ---
[INFO] Installing <https://builds.apache.org/job/maven-plugins-ITs-m3/ws/maven-shade-plugin/pom.xml> to <https://builds.apache.org/job/maven-plugins-ITs-m3/ws/maven-shade-plugin/target/local-repo/org/apache/maven/plugins/maven-shade-plugin/2.0.1-SNAPSHOT/maven-shade-plugin-2.0.1-SNAPSHOT.pom>
[INFO] Installing <https://builds.apache.org/job/maven-plugins-ITs-m3/ws/maven-shade-plugin/target/maven-shade-plugin-2.0.1-SNAPSHOT.jar> to <https://builds.apache.org/job/maven-plugins-ITs-m3/ws/maven-shade-plugin/target/local-repo/org/apache/maven/plugins/maven-shade-plugin/2.0.1-SNAPSHOT/maven-shade-plugin-2.0.1-SNAPSHOT.jar>
[INFO] Installing <https://builds.apache.org/job/maven-plugins-ITs-m3/ws/maven-shade-plugin/target/maven-shade-plugin-2.0.1-SNAPSHOT-tests.jar> to <https://builds.apache.org/job/maven-plugins-ITs-m3/ws/maven-shade-plugin/target/local-repo/org/apache/maven/plugins/maven-shade-plugin/2.0.1-SNAPSHOT/maven-shade-plugin-2.0.1-SNAPSHOT-tests.jar>
[INFO]
[INFO] --- maven-invoker-plugin:1.6:integration-test (integration-test) @ maven-shade-plugin ---
[INFO] Building: xml-transformer-ignores-dtd/pom.xml
[INFO] run script <https://builds.apache.org/job/maven-plugins-ITs-m3/ws/maven-shade-plugin/target/it/xml-transformer-ignores-dtd/verify.bsh>
[INFO] ..SUCCESS (4.6 s)
[INFO] Building: attach-after-lifecycle-fork/pom.xml
[INFO] run script <https://builds.apache.org/job/maven-plugins-ITs-m3/ws/maven-shade-plugin/target/it/attach-after-lifecycle-fork/setup.bsh>
[INFO] run script <https://builds.apache.org/job/maven-plugins-ITs-m3/ws/maven-shade-plugin/target/it/attach-after-lifecycle-fork/verify.bsh>
[INFO] ..SUCCESS (4.0 s)
[INFO] Building: duplicate-classes-without-reloc/pom.xml
[INFO] ..SUCCESS (3.0 s)
[INFO] Building: filter-artifact-contents/pom.xml
[INFO] run script <https://builds.apache.org/job/maven-plugins-ITs-m3/ws/maven-shade-plugin/target/it/filter-artifact-contents/verify.bsh>
[INFO] ..SUCCESS (3.7 s)
[INFO] Building: component-descriptor-relocation/pom.xml
[INFO] ..SUCCESS (4.2 s)
[INFO] Building: finalNameShade/pom.xml
[INFO] run script <https://builds.apache.org/job/maven-plugins-ITs-m3/ws/maven-shade-plugin/target/it/finalNameShade/setup.bsh>
[INFO] run script <https://builds.apache.org/job/maven-plugins-ITs-m3/ws/maven-shade-plugin/target/it/finalNameShade/verify.bsh>
[INFO] ..SUCCESS (3.8 s)
[INFO] Building: manifest-retained/pom.xml
[INFO] run script <https://builds.apache.org/job/maven-plugins-ITs-m3/ws/maven-shade-plugin/target/it/manifest-retained/verify.bsh>
[INFO] ..SUCCESS (4.9 s)
[INFO] Building: manifest-transformed/pom.xml
[INFO] run script <https://builds.apache.org/job/maven-plugins-ITs-m3/ws/maven-shade-plugin/target/it/manifest-transformed/verify.bsh>
[INFO] ..SUCCESS (4.7 s)
[INFO] Building: services-resource-transformer/pom.xml
[INFO] run script <https://builds.apache.org/job/maven-plugins-ITs-m3/ws/maven-shade-plugin/target/it/services-resource-transformer/verify.bsh>
[INFO] ..SUCCESS (3.7 s)
[INFO] Building: pom-packaging/pom.xml
[INFO] run script <https://builds.apache.org/job/maven-plugins-ITs-m3/ws/maven-shade-plugin/target/it/pom-packaging/verify.bsh>
[INFO] ..SUCCESS (2.7 s)
[INFO] Building: non-runtime-scope-excluded/pom.xml
[INFO] run script <https://builds.apache.org/job/maven-plugins-ITs-m3/ws/maven-shade-plugin/target/it/non-runtime-scope-excluded/verify.bsh>
[INFO] ..SUCCESS (3.9 s)
[INFO] Building: reloc-anno/pom.xml
[INFO] ..SUCCESS (3.5 s)
[INFO] Building: mini-jar-respect-includes/pom.xml
[INFO] run script <https://builds.apache.org/job/maven-plugins-ITs-m3/ws/maven-shade-plugin/target/it/mini-jar-respect-includes/verify.bsh>
[INFO] ..SUCCESS (4.7 s)
[INFO] Building: empty-relocation-pattern/pom.xml
[INFO] ..SUCCESS (3.7 s)
[INFO] Building: finalNameBuild/pom.xml
[INFO] run script <https://builds.apache.org/job/maven-plugins-ITs-m3/ws/maven-shade-plugin/target/it/finalNameBuild/setup.bsh>
[INFO] run script <https://builds.apache.org/job/maven-plugins-ITs-m3/ws/maven-shade-plugin/target/it/finalNameBuild/verify.bsh>
[INFO] ..SUCCESS (3.6 s)
[INFO] Building: attached-artifact-type/pom.xml
[INFO] ..SUCCESS (3.4 s)
[INFO] Building: empty-relocation-shaded-pattern/pom.xml
[INFO] ..SUCCESS (3.4 s)
[INFO] Building: reloc-includes-excludes/pom.xml
[INFO] run script <https://builds.apache.org/job/maven-plugins-ITs-m3/ws/maven-shade-plugin/target/it/reloc-includes-excludes/verify.bsh>
[INFO] ..SUCCESS (4.2 s)
[INFO] Building: rerun-with-reloc/pom.xml
[INFO] ..SUCCESS (5.4 s)
[INFO] Building: implicit-inclusion-of-project-artifact/pom.xml
[INFO] run script <https://builds.apache.org/job/maven-plugins-ITs-m3/ws/maven-shade-plugin/target/it/implicit-inclusion-of-project-artifact/verify.bsh>
[INFO] ..SUCCESS (3.9 s)
[INFO] Building: duplicate-classes-with-reloc/pom.xml
[INFO] ..SUCCESS (3.0 s)
[INFO] Building: dep-reduced-pom/pom.xml
[INFO] run script <https://builds.apache.org/job/maven-plugins-ITs-m3/ws/maven-shade-plugin/target/it/dep-reduced-pom/verify.groovy>
[INFO] ..SUCCESS (3.6 s)
[INFO] Building: rerun-without-reloc/pom.xml
[INFO] ..SUCCESS (3.5 s)
[INFO] Building: finalNameBuild-attached/pom.xml
[INFO] run script <https://builds.apache.org/job/maven-plugins-ITs-m3/ws/maven-shade-plugin/target/it/finalNameBuild-attached/setup.bsh>
[INFO] run script <https://builds.apache.org/job/maven-plugins-ITs-m3/ws/maven-shade-plugin/target/it/finalNameBuild-attached/verify.bsh>
[INFO] ..SUCCESS (3.6 s)
[INFO] Building: finalNameShade-attached/pom.xml
[INFO] run script <https://builds.apache.org/job/maven-plugins-ITs-m3/ws/maven-shade-plugin/target/it/finalNameShade-attached/setup.bsh>
[INFO] run script <https://builds.apache.org/job/maven-plugins-ITs-m3/ws/maven-shade-plugin/target/it/finalNameShade-attached/verify.bsh>
[INFO] ..SUCCESS (3.6 s)
[INFO] Building: shadePomDependency/pom.xml
[INFO] ..SUCCESS (4.6 s)
[INFO] Building: artifact-includes-excludes/pom.xml
[INFO] run script <https://builds.apache.org/job/maven-plugins-ITs-m3/ws/maven-shade-plugin/target/it/artifact-includes-excludes/verify.bsh>
[INFO] ..SUCCESS (3.6 s)
[INFO] Building: reloc-enum-ref-from-anno/pom.xml
[INFO] ..SUCCESS (3.4 s)
[INFO] Building: mini-jar-package-info/pom.xml
[INFO] run script <https://builds.apache.org/job/maven-plugins-ITs-m3/ws/maven-shade-plugin/target/it/mini-jar-package-info/verify.bsh>
[INFO] ..SUCCESS (4.4 s)
[INFO] Building: project-with-reactors-included/pom.xml
[INFO] run script <https://builds.apache.org/job/maven-plugins-ITs-m3/ws/maven-shade-plugin/target/it/project-with-reactors-included/verify.bsh>
[INFO] ..SUCCESS (5.6 s)
[INFO] Building: dep-reduced-pom-with-local-parent/pom.xml
[INFO] ..SUCCESS (2.8 s)
[INFO] Building: mini-jar/pom.xml
[INFO] run script <https://builds.apache.org/job/maven-plugins-ITs-m3/ws/maven-shade-plugin/target/it/mini-jar/verify.bsh>
[INFO] ..SUCCESS (3.9 s)
[INFO] Building: dep-reduced-pom-unique/pom.xml
[INFO] run script <https://builds.apache.org/job/maven-plugins-ITs-m3/ws/maven-shade-plugin/target/it/dep-reduced-pom-unique/verify.groovy>
[INFO] ..SUCCESS (4.4 s)
[INFO] Building: mini-jar-malformed-dependencies/pom.xml
[INFO] ..SUCCESS (7.0 s)
[INFO] Building: reloc-abs-resource-path/pom.xml
[INFO] ..SUCCESS (6.0 s)
[INFO] Building: MSHADE-105/pom.xml
[INFO] run script <https://builds.apache.org/job/maven-plugins-ITs-m3/ws/maven-shade-plugin/target/it/MSHADE-105/verify.bsh>
[INFO] ..SUCCESS (8.7 s)
[INFO] Building: mshade-123/pom.xml
[INFO] ..SUCCESS (6.0 s)
[INFO] Building: reloc-class-from-string-pool/pom.xml
[INFO] ..SUCCESS (3.4 s)
[INFO] Building: users-shader-impl/pom.xml
[INFO] run script <https://builds.apache.org/job/maven-plugins-ITs-m3/ws/maven-shade-plugin/target/it/users-shader-impl/verify.groovy>
[INFO] ..SUCCESS (4.1 s)
[INFO] Building: empty-apache-notice-transform/pom.xml
[INFO] ..SUCCESS (4.3 s)
[INFO] Building: dep-reduced-pom-relocated-result/pom.xml
[INFO] ..SUCCESS (2.9 s)
[INFO]
[INFO] --- maven-invoker-plugin:1.6:verify (integration-test) @ maven-shade-plugin ---
[INFO] -------------------------------------------------
[INFO] Build Summary:
[INFO] Passed: 41, Failed: 0, Errors: 0, Skipped: 0
[INFO] -------------------------------------------------
[INFO]
[INFO] --- maven-install-plugin:2.3.1:install (default-install) @ maven-shade-plugin ---
[INFO] Installing <https://builds.apache.org/job/maven-plugins-ITs-m3/ws/maven-shade-plugin/target/maven-shade-plugin-2.0.1-SNAPSHOT.jar> to /home/jenkins/.m2/repository/org/apache/maven/plugins/maven-shade-plugin/2.0.1-SNAPSHOT/maven-shade-plugin-2.0.1-SNAPSHOT.jar
[INFO] Installing <https://builds.apache.org/job/maven-plugins-ITs-m3/ws/maven-shade-plugin/pom.xml> to /home/jenkins/.m2/repository/org/apache/maven/plugins/maven-shade-plugin/2.0.1-SNAPSHOT/maven-shade-plugin-2.0.1-SNAPSHOT.pom
[INFO] Installing <https://builds.apache.org/job/maven-plugins-ITs-m3/ws/maven-shade-plugin/target/maven-shade-plugin-2.0.1-SNAPSHOT-tests.jar> to /home/jenkins/.m2/repository/org/apache/maven/plugins/maven-shade-plugin/2.0.1-SNAPSHOT/maven-shade-plugin-2.0.1-SNAPSHOT-tests.jar
[INFO]
[INFO] ------------------------------------------------------------------------
[INFO] Building Maven Plugins Aggregator 1-SNAPSHOT
[INFO] ------------------------------------------------------------------------
[INFO]
[INFO] --- maven-clean-plugin:2.4.1:clean (default-clean) @ maven-plugins-aggregator ---
[INFO] Deleting <https://builds.apache.org/job/maven-plugins-ITs-m3/ws/target>
[INFO]
[INFO] --- maven-remote-resources-plugin:1.1:process (default) @ maven-plugins-aggregator ---
[INFO]
[INFO] --- maven-install-plugin:2.3.1:install (default-install) @ maven-plugins-aggregator ---
[INFO] Installing <https://builds.apache.org/job/maven-plugins-ITs-m3/ws/pom.xml> to /home/jenkins/.m2/repository/org/apache/maven/plugins/maven-plugins-aggregator/1-SNAPSHOT/maven-plugins-aggregator-1-SNAPSHOT.pom
[INFO] ------------------------------------------------------------------------
[INFO] Reactor Summary:
[INFO]
[INFO] Maven Plugins ..................................... SUCCESS [2.948s]
[INFO] Maven ACR Plugin .................................. SUCCESS [22.841s]
[INFO] Maven Ant Plugin .................................. SUCCESS [1:06.253s]
[INFO] Maven AntRun Plugin ............................... SUCCESS [56.982s]
[INFO] Maven Eclipse Plugin .............................. SUCCESS [6:21.027s]
[INFO] Maven Assembly Plugin ............................. SUCCESS [11:07.579s]
[INFO] Maven Changelog Plugin ............................ FAILURE [6.864s]
[INFO] Maven Changes Report Plugin ....................... SUCCESS [1:00.110s]
[INFO] Maven Checkstyle Plugin ........................... SUCCESS [1:40.581s]
[INFO] Maven Clean Plugin ................................ SUCCESS [19.864s]
[INFO] Maven Compiler Plugin ............................. SUCCESS [54.535s]
[INFO] Maven Dependency Plugin ........................... SUCCESS [2:13.166s]
[INFO] Maven Deploy Plugin ............................... SUCCESS [1:01.284s]
[INFO] Maven DOAP Plugin ................................. SUCCESS [17.070s]
[INFO] Maven Documentation Checker Plugin ................ SUCCESS [5.652s]
[INFO] Maven EAR Plugin .................................. SUCCESS [3:54.526s]
[INFO] Maven EJB Plugin .................................. SUCCESS [27.599s]
[INFO] Maven GPG Plugin .................................. SUCCESS [9.821s]
[INFO] Maven Help Plugin ................................. SUCCESS [36.140s]
[INFO] Maven IDEA Plugin ................................. SUCCESS [7.412s]
[INFO] Maven Install Plugin .............................. SUCCESS [40.690s]
[INFO] Maven JAR Plugin .................................. SUCCESS [1:09.979s]
[INFO] Maven Jarsigner Plugin ............................ SUCCESS [24.651s]
[INFO] Maven Javadoc Plugin .............................. FAILURE [1:06.057s]
[INFO] Maven Linkcheck Plugin ............................ SUCCESS [2.437s]
[INFO] Maven One Plugin .................................. SUCCESS [1.236s]
[INFO] Maven Patch Plugin ................................ SUCCESS [12.920s]
[INFO] Maven PDF Plugin .................................. SUCCESS [32.083s]
[INFO] Maven PMD Plugin .................................. SUCCESS [37.367s]
[INFO] Maven RAR Plugin .................................. SUCCESS [10.224s]
[INFO] Maven Reactor Plugin .............................. SUCCESS [2.124s]
[INFO] Maven Repository Plugin ........................... SUCCESS [37.365s]
[INFO] Maven Resources Plugin ............................ SUCCESS [55.289s]
[INFO] Maven Site Plugin 3 ............................... SUCCESS [6:40.449s]
[INFO] Maven Source Plugin ............................... SUCCESS [44.637s]
[INFO] Maven Stage Plugin ................................ SUCCESS [1.601s]
[INFO] Maven Toolchains Plugin ........................... SUCCESS [1.596s]
[INFO] Maven Verifier Plugin ............................. SUCCESS [15.487s]
[INFO] Maven WAR Plugin .................................. SUCCESS [1:17.101s]
[INFO] SCM Publish Maven Plugin .......................... SUCCESS [1:08.878s]
[INFO] Maven Invoker Plugin .............................. SUCCESS [4:02.355s]
[INFO] Maven Project Info Reports Plugin ................. SUCCESS [2:27.836s]
[INFO] Maven Remote Resources Plugin ..................... SUCCESS [52.462s]
[INFO] Maven Shade Plugin ................................ SUCCESS [3:01.624s]
[INFO] Maven Plugins Aggregator .......................... SUCCESS [0.034s]
[INFO] ------------------------------------------------------------------------
[INFO] BUILD FAILURE
[INFO] ------------------------------------------------------------------------
[INFO] Total time: 59:59.736s
[INFO] Finished at: Thu Sep 27 22:18:45 UTC 2012
[INFO] Final Memory: 82M/318M
[INFO] ------------------------------------------------------------------------
[WARNING] The requested profile "apache.snapshots" could not be activated because it does not exist.
[ERROR] Failed to execute goal org.apache.maven.plugins:maven-surefire-plugin:2.12:test (default-test) on project maven-changelog-plugin: There are test failures.
[ERROR]
[ERROR] Please refer to <https://builds.apache.org/job/maven-plugins-ITs-m3/ws/maven-changelog-plugin/target/surefire-reports> for the individual test results.
[ERROR] -> [Help 1]
[ERROR] Failed to execute goal org.apache.maven.plugins:maven-surefire-plugin:2.12:test (default-test) on project maven-javadoc-plugin: There are test failures.
[ERROR]
[ERROR] Please refer to <https://builds.apache.org/job/maven-plugins-ITs-m3/ws/maven-javadoc-plugin/target/surefire-reports> for the individual test results.
[ERROR] -> [Help 1]
[ERROR]
[ERROR] To see the full stack trace of the errors, re-run Maven with the -e switch.
[ERROR] Re-run Maven using the -X switch to enable full debug logging.
[ERROR]
[ERROR] For more information about the errors and possible solutions, please read the following articles:
[ERROR] [Help 1] http://cwiki.apache.org/confluence/display/MAVEN/MojoFailureException
[ERROR]
[ERROR] After correcting the problems, you can resume the build with the command
[ERROR] mvn <goals> -rf :maven-changelog-plugin
Build step 'Invoke top-level Maven targets' marked build as failure
Recording test results
Build failed in Jenkins: maven-plugins-ITs-m3 #677
Posted by Apache Jenkins Server <je...@builds.apache.org>.
See <https://builds.apache.org/job/maven-plugins-ITs-m3/677/changes>
Changes:
[krosenvold] [MWAR-292] Added flag recompressZippedFiles
------------------------------------------
[...truncated 9769 lines...]
Tests run: 1, Failures: 0, Errors: 0, Skipped: 0, Time elapsed: 0.025 sec
Running org.apache.maven.plugins.shade.mojo.ArtifactIdTest
Tests run: 2, Failures: 0, Errors: 0, Skipped: 0, Time elapsed: 0.002 sec
Running org.apache.maven.plugins.shade.DefaultShaderTest
Tests run: 4, Failures: 0, Errors: 0, Skipped: 0, Time elapsed: 0.845 sec
Running org.apache.maven.plugins.shade.resource.AppendingTransformerTest
Tests run: 1, Failures: 0, Errors: 0, Skipped: 0, Time elapsed: 0.001 sec
Running org.apache.maven.plugins.shade.resource.ApacheNoticeResourceTransformerTest
Tests run: 1, Failures: 0, Errors: 0, Skipped: 0, Time elapsed: 0.001 sec
Running org.apache.maven.plugins.shade.resource.XmlAppendingTransformerTest
Tests run: 1, Failures: 0, Errors: 0, Skipped: 0, Time elapsed: 0.005 sec
Running org.apache.maven.plugins.shade.resource.ApacheLicenseResourceTransformerTest
Tests run: 1, Failures: 0, Errors: 0, Skipped: 0, Time elapsed: 0 sec
Running org.apache.maven.plugins.shade.resource.ComponentsXmlResourceTransformerTest
Tests run: 1, Failures: 0, Errors: 0, Skipped: 0, Time elapsed: 0.063 sec
Running org.apache.maven.plugins.shade.filter.SimpleFilterTest
Tests run: 1, Failures: 0, Errors: 0, Skipped: 0, Time elapsed: 0 sec
Running org.apache.maven.plugins.shade.relocation.SimpleRelocatorParameterTest
Tests run: 2, Failures: 0, Errors: 0, Skipped: 0, Time elapsed: 0.001 sec
Running org.apache.maven.plugins.shade.relocation.SimpleRelocatorTest
Tests run: 7, Failures: 0, Errors: 0, Skipped: 0, Time elapsed: 0.002 sec
Results :
Tests run: 27, Failures: 0, Errors: 0, Skipped: 0
[INFO]
[INFO] --- maven-jar-plugin:2.4:jar (default-jar) @ maven-shade-plugin ---
[INFO] Building jar: <https://builds.apache.org/job/maven-plugins-ITs-m3/ws/maven-shade-plugin/target/maven-shade-plugin-2.0.1-SNAPSHOT.jar>
[INFO]
[INFO] --- maven-plugin-plugin:3.1:addPluginArtifactMetadata (default-addPluginArtifactMetadata) @ maven-shade-plugin ---
[INFO]
[INFO] --- maven-jar-plugin:2.4:test-jar (default) @ maven-shade-plugin ---
[INFO] Building jar: <https://builds.apache.org/job/maven-plugins-ITs-m3/ws/maven-shade-plugin/target/maven-shade-plugin-2.0.1-SNAPSHOT-tests.jar>
[INFO]
[INFO] --- maven-invoker-plugin:1.6:install (integration-test) @ maven-shade-plugin ---
[INFO] Installing <https://builds.apache.org/job/maven-plugins-ITs-m3/ws/maven-shade-plugin/pom.xml> to <https://builds.apache.org/job/maven-plugins-ITs-m3/ws/maven-shade-plugin/target/local-repo/org/apache/maven/plugins/maven-shade-plugin/2.0.1-SNAPSHOT/maven-shade-plugin-2.0.1-SNAPSHOT.pom>
[INFO] Installing <https://builds.apache.org/job/maven-plugins-ITs-m3/ws/maven-shade-plugin/target/maven-shade-plugin-2.0.1-SNAPSHOT.jar> to <https://builds.apache.org/job/maven-plugins-ITs-m3/ws/maven-shade-plugin/target/local-repo/org/apache/maven/plugins/maven-shade-plugin/2.0.1-SNAPSHOT/maven-shade-plugin-2.0.1-SNAPSHOT.jar>
[INFO] Installing <https://builds.apache.org/job/maven-plugins-ITs-m3/ws/maven-shade-plugin/target/maven-shade-plugin-2.0.1-SNAPSHOT-tests.jar> to <https://builds.apache.org/job/maven-plugins-ITs-m3/ws/maven-shade-plugin/target/local-repo/org/apache/maven/plugins/maven-shade-plugin/2.0.1-SNAPSHOT/maven-shade-plugin-2.0.1-SNAPSHOT-tests.jar>
[INFO]
[INFO] --- maven-invoker-plugin:1.6:integration-test (integration-test) @ maven-shade-plugin ---
[INFO] Building: xml-transformer-ignores-dtd/pom.xml
[INFO] run script <https://builds.apache.org/job/maven-plugins-ITs-m3/ws/maven-shade-plugin/target/it/xml-transformer-ignores-dtd/verify.bsh>
[INFO] ..SUCCESS (4.6 s)
[INFO] Building: attach-after-lifecycle-fork/pom.xml
[INFO] run script <https://builds.apache.org/job/maven-plugins-ITs-m3/ws/maven-shade-plugin/target/it/attach-after-lifecycle-fork/setup.bsh>
[INFO] run script <https://builds.apache.org/job/maven-plugins-ITs-m3/ws/maven-shade-plugin/target/it/attach-after-lifecycle-fork/verify.bsh>
[INFO] ..SUCCESS (3.6 s)
[INFO] Building: duplicate-classes-without-reloc/pom.xml
[INFO] ..SUCCESS (2.8 s)
[INFO] Building: filter-artifact-contents/pom.xml
[INFO] run script <https://builds.apache.org/job/maven-plugins-ITs-m3/ws/maven-shade-plugin/target/it/filter-artifact-contents/verify.bsh>
[INFO] ..SUCCESS (3.7 s)
[INFO] Building: component-descriptor-relocation/pom.xml
[INFO] ..SUCCESS (4.7 s)
[INFO] Building: finalNameShade/pom.xml
[INFO] run script <https://builds.apache.org/job/maven-plugins-ITs-m3/ws/maven-shade-plugin/target/it/finalNameShade/setup.bsh>
[INFO] run script <https://builds.apache.org/job/maven-plugins-ITs-m3/ws/maven-shade-plugin/target/it/finalNameShade/verify.bsh>
[INFO] ..SUCCESS (3.6 s)
[INFO] Building: manifest-retained/pom.xml
[INFO] run script <https://builds.apache.org/job/maven-plugins-ITs-m3/ws/maven-shade-plugin/target/it/manifest-retained/verify.bsh>
[INFO] ..SUCCESS (4.6 s)
[INFO] Building: manifest-transformed/pom.xml
[INFO] run script <https://builds.apache.org/job/maven-plugins-ITs-m3/ws/maven-shade-plugin/target/it/manifest-transformed/verify.bsh>
[INFO] ..SUCCESS (4.6 s)
[INFO] Building: services-resource-transformer/pom.xml
[INFO] run script <https://builds.apache.org/job/maven-plugins-ITs-m3/ws/maven-shade-plugin/target/it/services-resource-transformer/verify.bsh>
[INFO] ..SUCCESS (3.7 s)
[INFO] Building: pom-packaging/pom.xml
[INFO] run script <https://builds.apache.org/job/maven-plugins-ITs-m3/ws/maven-shade-plugin/target/it/pom-packaging/verify.bsh>
[INFO] ..SUCCESS (2.5 s)
[INFO] Building: non-runtime-scope-excluded/pom.xml
[INFO] run script <https://builds.apache.org/job/maven-plugins-ITs-m3/ws/maven-shade-plugin/target/it/non-runtime-scope-excluded/verify.bsh>
[INFO] ..SUCCESS (3.6 s)
[INFO] Building: reloc-anno/pom.xml
[INFO] ..SUCCESS (3.4 s)
[INFO] Building: mini-jar-respect-includes/pom.xml
[INFO] run script <https://builds.apache.org/job/maven-plugins-ITs-m3/ws/maven-shade-plugin/target/it/mini-jar-respect-includes/verify.bsh>
[INFO] ..SUCCESS (4.3 s)
[INFO] Building: empty-relocation-pattern/pom.xml
[INFO] ..SUCCESS (3.5 s)
[INFO] Building: finalNameBuild/pom.xml
[INFO] run script <https://builds.apache.org/job/maven-plugins-ITs-m3/ws/maven-shade-plugin/target/it/finalNameBuild/setup.bsh>
[INFO] run script <https://builds.apache.org/job/maven-plugins-ITs-m3/ws/maven-shade-plugin/target/it/finalNameBuild/verify.bsh>
[INFO] ..SUCCESS (3.5 s)
[INFO] Building: attached-artifact-type/pom.xml
[INFO] ..SUCCESS (3.3 s)
[INFO] Building: empty-relocation-shaded-pattern/pom.xml
[INFO] ..SUCCESS (3.3 s)
[INFO] Building: reloc-includes-excludes/pom.xml
[INFO] run script <https://builds.apache.org/job/maven-plugins-ITs-m3/ws/maven-shade-plugin/target/it/reloc-includes-excludes/verify.bsh>
[INFO] ..SUCCESS (4.2 s)
[INFO] Building: rerun-with-reloc/pom.xml
[INFO] ..SUCCESS (4.7 s)
[INFO] Building: implicit-inclusion-of-project-artifact/pom.xml
[INFO] run script <https://builds.apache.org/job/maven-plugins-ITs-m3/ws/maven-shade-plugin/target/it/implicit-inclusion-of-project-artifact/verify.bsh>
[INFO] ..SUCCESS (3.8 s)
[INFO] Building: duplicate-classes-with-reloc/pom.xml
[INFO] ..SUCCESS (2.8 s)
[INFO] Building: dep-reduced-pom/pom.xml
[INFO] run script <https://builds.apache.org/job/maven-plugins-ITs-m3/ws/maven-shade-plugin/target/it/dep-reduced-pom/verify.groovy>
[INFO] ..SUCCESS (3.7 s)
[INFO] Building: rerun-without-reloc/pom.xml
[INFO] ..SUCCESS (3.5 s)
[INFO] Building: finalNameBuild-attached/pom.xml
[INFO] run script <https://builds.apache.org/job/maven-plugins-ITs-m3/ws/maven-shade-plugin/target/it/finalNameBuild-attached/setup.bsh>
[INFO] run script <https://builds.apache.org/job/maven-plugins-ITs-m3/ws/maven-shade-plugin/target/it/finalNameBuild-attached/verify.bsh>
[INFO] ..SUCCESS (3.5 s)
[INFO] Building: finalNameShade-attached/pom.xml
[INFO] run script <https://builds.apache.org/job/maven-plugins-ITs-m3/ws/maven-shade-plugin/target/it/finalNameShade-attached/setup.bsh>
[INFO] run script <https://builds.apache.org/job/maven-plugins-ITs-m3/ws/maven-shade-plugin/target/it/finalNameShade-attached/verify.bsh>
[INFO] ..SUCCESS (3.5 s)
[INFO] Building: shadePomDependency/pom.xml
[INFO] ..SUCCESS (4.5 s)
[INFO] Building: artifact-includes-excludes/pom.xml
[INFO] run script <https://builds.apache.org/job/maven-plugins-ITs-m3/ws/maven-shade-plugin/target/it/artifact-includes-excludes/verify.bsh>
[INFO] ..SUCCESS (3.7 s)
[INFO] Building: reloc-enum-ref-from-anno/pom.xml
[INFO] ..SUCCESS (3.3 s)
[INFO] Building: mini-jar-package-info/pom.xml
[INFO] run script <https://builds.apache.org/job/maven-plugins-ITs-m3/ws/maven-shade-plugin/target/it/mini-jar-package-info/verify.bsh>
[INFO] ..SUCCESS (4.4 s)
[INFO] Building: project-with-reactors-included/pom.xml
[INFO] run script <https://builds.apache.org/job/maven-plugins-ITs-m3/ws/maven-shade-plugin/target/it/project-with-reactors-included/verify.bsh>
[INFO] ..SUCCESS (5.3 s)
[INFO] Building: dep-reduced-pom-with-local-parent/pom.xml
[INFO] ..SUCCESS (2.8 s)
[INFO] Building: mini-jar/pom.xml
[INFO] run script <https://builds.apache.org/job/maven-plugins-ITs-m3/ws/maven-shade-plugin/target/it/mini-jar/verify.bsh>
[INFO] ..SUCCESS (4.0 s)
[INFO] Building: dep-reduced-pom-unique/pom.xml
[INFO] run script <https://builds.apache.org/job/maven-plugins-ITs-m3/ws/maven-shade-plugin/target/it/dep-reduced-pom-unique/verify.groovy>
[INFO] ..SUCCESS (4.0 s)
[INFO] Building: mini-jar-malformed-dependencies/pom.xml
[INFO] ..SUCCESS (6.6 s)
[INFO] Building: reloc-abs-resource-path/pom.xml
[INFO] ..SUCCESS (6.1 s)
[INFO] Building: MSHADE-105/pom.xml
[INFO] run script <https://builds.apache.org/job/maven-plugins-ITs-m3/ws/maven-shade-plugin/target/it/MSHADE-105/verify.bsh>
[INFO] ..SUCCESS (8.1 s)
[INFO] Building: mshade-123/pom.xml
[INFO] ..SUCCESS (5.5 s)
[INFO] Building: reloc-class-from-string-pool/pom.xml
[INFO] ..SUCCESS (3.2 s)
[INFO] Building: users-shader-impl/pom.xml
[INFO] run script <https://builds.apache.org/job/maven-plugins-ITs-m3/ws/maven-shade-plugin/target/it/users-shader-impl/verify.groovy>
[INFO] ..SUCCESS (4.1 s)
[INFO] Building: empty-apache-notice-transform/pom.xml
[INFO] ..SUCCESS (4.2 s)
[INFO] Building: dep-reduced-pom-relocated-result/pom.xml
[INFO] ..SUCCESS (2.7 s)
[INFO]
[INFO] --- maven-invoker-plugin:1.6:verify (integration-test) @ maven-shade-plugin ---
[INFO] -------------------------------------------------
[INFO] Build Summary:
[INFO] Passed: 41, Failed: 0, Errors: 0, Skipped: 0
[INFO] -------------------------------------------------
[INFO]
[INFO] --- maven-install-plugin:2.3.1:install (default-install) @ maven-shade-plugin ---
[INFO] Installing <https://builds.apache.org/job/maven-plugins-ITs-m3/ws/maven-shade-plugin/target/maven-shade-plugin-2.0.1-SNAPSHOT.jar> to /home/jenkins/.m2/repository/org/apache/maven/plugins/maven-shade-plugin/2.0.1-SNAPSHOT/maven-shade-plugin-2.0.1-SNAPSHOT.jar
[INFO] Installing <https://builds.apache.org/job/maven-plugins-ITs-m3/ws/maven-shade-plugin/pom.xml> to /home/jenkins/.m2/repository/org/apache/maven/plugins/maven-shade-plugin/2.0.1-SNAPSHOT/maven-shade-plugin-2.0.1-SNAPSHOT.pom
[INFO] Installing <https://builds.apache.org/job/maven-plugins-ITs-m3/ws/maven-shade-plugin/target/maven-shade-plugin-2.0.1-SNAPSHOT-tests.jar> to /home/jenkins/.m2/repository/org/apache/maven/plugins/maven-shade-plugin/2.0.1-SNAPSHOT/maven-shade-plugin-2.0.1-SNAPSHOT-tests.jar
[INFO]
[INFO] ------------------------------------------------------------------------
[INFO] Building Maven Plugins Aggregator 1-SNAPSHOT
[INFO] ------------------------------------------------------------------------
[INFO]
[INFO] --- maven-clean-plugin:2.4.1:clean (default-clean) @ maven-plugins-aggregator ---
[INFO] Deleting <https://builds.apache.org/job/maven-plugins-ITs-m3/ws/target>
[INFO]
[INFO] --- maven-remote-resources-plugin:1.1:process (default) @ maven-plugins-aggregator ---
[INFO]
[INFO] --- maven-install-plugin:2.3.1:install (default-install) @ maven-plugins-aggregator ---
[INFO] Installing <https://builds.apache.org/job/maven-plugins-ITs-m3/ws/pom.xml> to /home/jenkins/.m2/repository/org/apache/maven/plugins/maven-plugins-aggregator/1-SNAPSHOT/maven-plugins-aggregator-1-SNAPSHOT.pom
[INFO] ------------------------------------------------------------------------
[INFO] Reactor Summary:
[INFO]
[INFO] Maven Plugins ..................................... SUCCESS [17.076s]
[INFO] Maven ACR Plugin .................................. SUCCESS [23.083s]
[INFO] Maven Ant Plugin .................................. SUCCESS [1:08.952s]
[INFO] Maven AntRun Plugin ............................... SUCCESS [58.428s]
[INFO] Maven Eclipse Plugin .............................. SUCCESS [6:43.097s]
[INFO] Maven Assembly Plugin ............................. SUCCESS [11:19.261s]
[INFO] Maven Changelog Plugin ............................ FAILURE [7.782s]
[INFO] Maven Changes Report Plugin ....................... SUCCESS [1:03.446s]
[INFO] Maven Checkstyle Plugin ........................... SUCCESS [1:44.718s]
[INFO] Maven Clean Plugin ................................ SUCCESS [20.567s]
[INFO] Maven Compiler Plugin ............................. SUCCESS [55.717s]
[INFO] Maven Dependency Plugin ........................... SUCCESS [2:16.162s]
[INFO] Maven Deploy Plugin ............................... SUCCESS [1:05.605s]
[INFO] Maven DOAP Plugin ................................. SUCCESS [18.584s]
[INFO] Maven Documentation Checker Plugin ................ SUCCESS [8.134s]
[INFO] Maven EAR Plugin .................................. SUCCESS [4:00.521s]
[INFO] Maven EJB Plugin .................................. SUCCESS [28.663s]
[INFO] Maven GPG Plugin .................................. SUCCESS [10.852s]
[INFO] Maven Help Plugin ................................. SUCCESS [36.987s]
[INFO] Maven IDEA Plugin ................................. SUCCESS [8.044s]
[INFO] Maven Install Plugin .............................. SUCCESS [40.916s]
[INFO] Maven JAR Plugin .................................. SUCCESS [1:09.511s]
[INFO] Maven Jarsigner Plugin ............................ SUCCESS [25.881s]
[INFO] Maven Javadoc Plugin .............................. FAILURE [1:12.278s]
[INFO] Maven Linkcheck Plugin ............................ SUCCESS [2.589s]
[INFO] Maven One Plugin .................................. SUCCESS [1.336s]
[INFO] Maven Patch Plugin ................................ SUCCESS [12.526s]
[INFO] Maven PDF Plugin .................................. SUCCESS [2:33.619s]
[INFO] Maven PMD Plugin .................................. SUCCESS [38.928s]
[INFO] Maven RAR Plugin .................................. SUCCESS [11.068s]
[INFO] Maven Reactor Plugin .............................. SUCCESS [2.515s]
[INFO] Maven Repository Plugin ........................... SUCCESS [39.282s]
[INFO] Maven Resources Plugin ............................ SUCCESS [55.573s]
[INFO] Maven Site Plugin 3 ............................... SUCCESS [6:09.828s]
[INFO] Maven Source Plugin ............................... SUCCESS [44.228s]
[INFO] Maven Stage Plugin ................................ SUCCESS [2.167s]
[INFO] Maven Toolchains Plugin ........................... SUCCESS [2.108s]
[INFO] Maven Verifier Plugin ............................. SUCCESS [16.315s]
[INFO] Maven WAR Plugin .................................. SUCCESS [1:17.524s]
[INFO] SCM Publish Maven Plugin .......................... SUCCESS [1:04.896s]
[INFO] Maven Invoker Plugin .............................. SUCCESS [4:01.545s]
[INFO] Maven Project Info Reports Plugin ................. SUCCESS [2:20.800s]
[INFO] Maven Remote Resources Plugin ..................... SUCCESS [56.458s]
[INFO] Maven Shade Plugin ................................ SUCCESS [2:58.755s]
[INFO] Maven Plugins Aggregator .......................... SUCCESS [0.044s]
[INFO] ------------------------------------------------------------------------
[INFO] BUILD FAILURE
[INFO] ------------------------------------------------------------------------
[INFO] Total time: 1:02:57.715s
[INFO] Finished at: Thu Sep 27 21:07:55 UTC 2012
[INFO] Final Memory: 82M/307M
[INFO] ------------------------------------------------------------------------
[WARNING] The requested profile "apache.snapshots" could not be activated because it does not exist.
[ERROR] Failed to execute goal org.apache.maven.plugins:maven-surefire-plugin:2.12:test (default-test) on project maven-changelog-plugin: There are test failures.
[ERROR]
[ERROR] Please refer to <https://builds.apache.org/job/maven-plugins-ITs-m3/ws/maven-changelog-plugin/target/surefire-reports> for the individual test results.
[ERROR] -> [Help 1]
[ERROR] Failed to execute goal org.apache.maven.plugins:maven-surefire-plugin:2.12:test (default-test) on project maven-javadoc-plugin: There are test failures.
[ERROR]
[ERROR] Please refer to <https://builds.apache.org/job/maven-plugins-ITs-m3/ws/maven-javadoc-plugin/target/surefire-reports> for the individual test results.
[ERROR] -> [Help 1]
[ERROR]
[ERROR] To see the full stack trace of the errors, re-run Maven with the -e switch.
[ERROR] Re-run Maven using the -X switch to enable full debug logging.
[ERROR]
[ERROR] For more information about the errors and possible solutions, please read the following articles:
[ERROR] [Help 1] http://cwiki.apache.org/confluence/display/MAVEN/MojoFailureException
[ERROR]
[ERROR] After correcting the problems, you can resume the build with the command
[ERROR] mvn <goals> -rf :maven-changelog-plugin
Build step 'Invoke top-level Maven targets' marked build as failure
Recording test results
Build failed in Jenkins: maven-plugins-ITs-m3 #676
Posted by Apache Jenkins Server <je...@builds.apache.org>.
See <https://builds.apache.org/job/maven-plugins-ITs-m3/676/changes>
Changes:
[olamy] add contributor
[olamy] [MCHECKSTYLE-181] Upgrade to Checkstyle 5.6
Submitted by Baron Roberts
fix its as checkstyle are now modified in svn.
[olamy] [MCHECKSTYLE-181] Upgrade to Checkstyle 5.6
Submitted by Baron Roberts
Remove DoubleCheckedLocking as not anymore suppoted by checkstyle 5.6
------------------------------------------
[...truncated 9803 lines...]
Tests run: 1, Failures: 0, Errors: 0, Skipped: 0, Time elapsed: 0.021 sec
Running org.apache.maven.plugins.shade.mojo.ArtifactIdTest
Tests run: 2, Failures: 0, Errors: 0, Skipped: 0, Time elapsed: 0.002 sec
Running org.apache.maven.plugins.shade.DefaultShaderTest
Tests run: 4, Failures: 0, Errors: 0, Skipped: 0, Time elapsed: 0.866 sec
Running org.apache.maven.plugins.shade.resource.AppendingTransformerTest
Tests run: 1, Failures: 0, Errors: 0, Skipped: 0, Time elapsed: 0.001 sec
Running org.apache.maven.plugins.shade.resource.ApacheNoticeResourceTransformerTest
Tests run: 1, Failures: 0, Errors: 0, Skipped: 0, Time elapsed: 0.001 sec
Running org.apache.maven.plugins.shade.resource.XmlAppendingTransformerTest
Tests run: 1, Failures: 0, Errors: 0, Skipped: 0, Time elapsed: 0.005 sec
Running org.apache.maven.plugins.shade.resource.ApacheLicenseResourceTransformerTest
Tests run: 1, Failures: 0, Errors: 0, Skipped: 0, Time elapsed: 0.001 sec
Running org.apache.maven.plugins.shade.resource.ComponentsXmlResourceTransformerTest
Tests run: 1, Failures: 0, Errors: 0, Skipped: 0, Time elapsed: 0.061 sec
Running org.apache.maven.plugins.shade.filter.SimpleFilterTest
Tests run: 1, Failures: 0, Errors: 0, Skipped: 0, Time elapsed: 0.001 sec
Running org.apache.maven.plugins.shade.relocation.SimpleRelocatorParameterTest
Tests run: 2, Failures: 0, Errors: 0, Skipped: 0, Time elapsed: 0.001 sec
Running org.apache.maven.plugins.shade.relocation.SimpleRelocatorTest
Tests run: 7, Failures: 0, Errors: 0, Skipped: 0, Time elapsed: 0.002 sec
Results :
Tests run: 27, Failures: 0, Errors: 0, Skipped: 0
[INFO]
[INFO] --- maven-jar-plugin:2.4:jar (default-jar) @ maven-shade-plugin ---
[INFO] Building jar: <https://builds.apache.org/job/maven-plugins-ITs-m3/ws/maven-shade-plugin/target/maven-shade-plugin-2.0.1-SNAPSHOT.jar>
[INFO]
[INFO] --- maven-plugin-plugin:3.1:addPluginArtifactMetadata (default-addPluginArtifactMetadata) @ maven-shade-plugin ---
[INFO]
[INFO] --- maven-jar-plugin:2.4:test-jar (default) @ maven-shade-plugin ---
[INFO] Building jar: <https://builds.apache.org/job/maven-plugins-ITs-m3/ws/maven-shade-plugin/target/maven-shade-plugin-2.0.1-SNAPSHOT-tests.jar>
[INFO]
[INFO] --- maven-invoker-plugin:1.6:install (integration-test) @ maven-shade-plugin ---
[INFO] Installing <https://builds.apache.org/job/maven-plugins-ITs-m3/ws/maven-shade-plugin/pom.xml> to <https://builds.apache.org/job/maven-plugins-ITs-m3/ws/maven-shade-plugin/target/local-repo/org/apache/maven/plugins/maven-shade-plugin/2.0.1-SNAPSHOT/maven-shade-plugin-2.0.1-SNAPSHOT.pom>
[INFO] Installing <https://builds.apache.org/job/maven-plugins-ITs-m3/ws/maven-shade-plugin/target/maven-shade-plugin-2.0.1-SNAPSHOT.jar> to <https://builds.apache.org/job/maven-plugins-ITs-m3/ws/maven-shade-plugin/target/local-repo/org/apache/maven/plugins/maven-shade-plugin/2.0.1-SNAPSHOT/maven-shade-plugin-2.0.1-SNAPSHOT.jar>
[INFO] Installing <https://builds.apache.org/job/maven-plugins-ITs-m3/ws/maven-shade-plugin/target/maven-shade-plugin-2.0.1-SNAPSHOT-tests.jar> to <https://builds.apache.org/job/maven-plugins-ITs-m3/ws/maven-shade-plugin/target/local-repo/org/apache/maven/plugins/maven-shade-plugin/2.0.1-SNAPSHOT/maven-shade-plugin-2.0.1-SNAPSHOT-tests.jar>
[INFO]
[INFO] --- maven-invoker-plugin:1.6:integration-test (integration-test) @ maven-shade-plugin ---
[INFO] Building: xml-transformer-ignores-dtd/pom.xml
[INFO] run script <https://builds.apache.org/job/maven-plugins-ITs-m3/ws/maven-shade-plugin/target/it/xml-transformer-ignores-dtd/verify.bsh>
[INFO] ..SUCCESS (4.6 s)
[INFO] Building: attach-after-lifecycle-fork/pom.xml
[INFO] run script <https://builds.apache.org/job/maven-plugins-ITs-m3/ws/maven-shade-plugin/target/it/attach-after-lifecycle-fork/setup.bsh>
[INFO] run script <https://builds.apache.org/job/maven-plugins-ITs-m3/ws/maven-shade-plugin/target/it/attach-after-lifecycle-fork/verify.bsh>
[INFO] ..SUCCESS (4.1 s)
[INFO] Building: duplicate-classes-without-reloc/pom.xml
[INFO] ..SUCCESS (2.9 s)
[INFO] Building: filter-artifact-contents/pom.xml
[INFO] run script <https://builds.apache.org/job/maven-plugins-ITs-m3/ws/maven-shade-plugin/target/it/filter-artifact-contents/verify.bsh>
[INFO] ..SUCCESS (3.6 s)
[INFO] Building: component-descriptor-relocation/pom.xml
[INFO] ..SUCCESS (4.4 s)
[INFO] Building: finalNameShade/pom.xml
[INFO] run script <https://builds.apache.org/job/maven-plugins-ITs-m3/ws/maven-shade-plugin/target/it/finalNameShade/setup.bsh>
[INFO] run script <https://builds.apache.org/job/maven-plugins-ITs-m3/ws/maven-shade-plugin/target/it/finalNameShade/verify.bsh>
[INFO] ..SUCCESS (3.5 s)
[INFO] Building: manifest-retained/pom.xml
[INFO] run script <https://builds.apache.org/job/maven-plugins-ITs-m3/ws/maven-shade-plugin/target/it/manifest-retained/verify.bsh>
[INFO] ..SUCCESS (4.9 s)
[INFO] Building: manifest-transformed/pom.xml
[INFO] run script <https://builds.apache.org/job/maven-plugins-ITs-m3/ws/maven-shade-plugin/target/it/manifest-transformed/verify.bsh>
[INFO] ..SUCCESS (4.7 s)
[INFO] Building: services-resource-transformer/pom.xml
[INFO] run script <https://builds.apache.org/job/maven-plugins-ITs-m3/ws/maven-shade-plugin/target/it/services-resource-transformer/verify.bsh>
[INFO] ..SUCCESS (3.6 s)
[INFO] Building: pom-packaging/pom.xml
[INFO] run script <https://builds.apache.org/job/maven-plugins-ITs-m3/ws/maven-shade-plugin/target/it/pom-packaging/verify.bsh>
[INFO] ..SUCCESS (2.6 s)
[INFO] Building: non-runtime-scope-excluded/pom.xml
[INFO] run script <https://builds.apache.org/job/maven-plugins-ITs-m3/ws/maven-shade-plugin/target/it/non-runtime-scope-excluded/verify.bsh>
[INFO] ..SUCCESS (3.7 s)
[INFO] Building: reloc-anno/pom.xml
[INFO] ..SUCCESS (3.4 s)
[INFO] Building: mini-jar-respect-includes/pom.xml
[INFO] run script <https://builds.apache.org/job/maven-plugins-ITs-m3/ws/maven-shade-plugin/target/it/mini-jar-respect-includes/verify.bsh>
[INFO] ..SUCCESS (4.4 s)
[INFO] Building: empty-relocation-pattern/pom.xml
[INFO] ..SUCCESS (3.6 s)
[INFO] Building: finalNameBuild/pom.xml
[INFO] run script <https://builds.apache.org/job/maven-plugins-ITs-m3/ws/maven-shade-plugin/target/it/finalNameBuild/setup.bsh>
[INFO] run script <https://builds.apache.org/job/maven-plugins-ITs-m3/ws/maven-shade-plugin/target/it/finalNameBuild/verify.bsh>
[INFO] ..SUCCESS (3.6 s)
[INFO] Building: attached-artifact-type/pom.xml
[INFO] ..SUCCESS (4.1 s)
[INFO] Building: empty-relocation-shaded-pattern/pom.xml
[INFO] ..SUCCESS (3.7 s)
[INFO] Building: reloc-includes-excludes/pom.xml
[INFO] run script <https://builds.apache.org/job/maven-plugins-ITs-m3/ws/maven-shade-plugin/target/it/reloc-includes-excludes/verify.bsh>
[INFO] ..SUCCESS (4.3 s)
[INFO] Building: rerun-with-reloc/pom.xml
[INFO] ..SUCCESS (5.6 s)
[INFO] Building: implicit-inclusion-of-project-artifact/pom.xml
[INFO] run script <https://builds.apache.org/job/maven-plugins-ITs-m3/ws/maven-shade-plugin/target/it/implicit-inclusion-of-project-artifact/verify.bsh>
[INFO] ..SUCCESS (3.8 s)
[INFO] Building: duplicate-classes-with-reloc/pom.xml
[INFO] ..SUCCESS (2.9 s)
[INFO] Building: dep-reduced-pom/pom.xml
[INFO] run script <https://builds.apache.org/job/maven-plugins-ITs-m3/ws/maven-shade-plugin/target/it/dep-reduced-pom/verify.groovy>
[INFO] ..SUCCESS (3.8 s)
[INFO] Building: rerun-without-reloc/pom.xml
[INFO] ..SUCCESS (3.6 s)
[INFO] Building: finalNameBuild-attached/pom.xml
[INFO] run script <https://builds.apache.org/job/maven-plugins-ITs-m3/ws/maven-shade-plugin/target/it/finalNameBuild-attached/setup.bsh>
[INFO] run script <https://builds.apache.org/job/maven-plugins-ITs-m3/ws/maven-shade-plugin/target/it/finalNameBuild-attached/verify.bsh>
[INFO] ..SUCCESS (3.6 s)
[INFO] Building: finalNameShade-attached/pom.xml
[INFO] run script <https://builds.apache.org/job/maven-plugins-ITs-m3/ws/maven-shade-plugin/target/it/finalNameShade-attached/setup.bsh>
[INFO] run script <https://builds.apache.org/job/maven-plugins-ITs-m3/ws/maven-shade-plugin/target/it/finalNameShade-attached/verify.bsh>
[INFO] ..SUCCESS (3.6 s)
[INFO] Building: shadePomDependency/pom.xml
[INFO] ..SUCCESS (4.6 s)
[INFO] Building: artifact-includes-excludes/pom.xml
[INFO] run script <https://builds.apache.org/job/maven-plugins-ITs-m3/ws/maven-shade-plugin/target/it/artifact-includes-excludes/verify.bsh>
[INFO] ..SUCCESS (3.8 s)
[INFO] Building: reloc-enum-ref-from-anno/pom.xml
[INFO] ..SUCCESS (3.5 s)
[INFO] Building: mini-jar-package-info/pom.xml
[INFO] run script <https://builds.apache.org/job/maven-plugins-ITs-m3/ws/maven-shade-plugin/target/it/mini-jar-package-info/verify.bsh>
[INFO] ..SUCCESS (4.4 s)
[INFO] Building: project-with-reactors-included/pom.xml
[INFO] run script <https://builds.apache.org/job/maven-plugins-ITs-m3/ws/maven-shade-plugin/target/it/project-with-reactors-included/verify.bsh>
[INFO] ..SUCCESS (5.5 s)
[INFO] Building: dep-reduced-pom-with-local-parent/pom.xml
[INFO] ..SUCCESS (2.8 s)
[INFO] Building: mini-jar/pom.xml
[INFO] run script <https://builds.apache.org/job/maven-plugins-ITs-m3/ws/maven-shade-plugin/target/it/mini-jar/verify.bsh>
[INFO] ..SUCCESS (4.0 s)
[INFO] Building: dep-reduced-pom-unique/pom.xml
[INFO] run script <https://builds.apache.org/job/maven-plugins-ITs-m3/ws/maven-shade-plugin/target/it/dep-reduced-pom-unique/verify.groovy>
[INFO] ..SUCCESS (4.3 s)
[INFO] Building: mini-jar-malformed-dependencies/pom.xml
[INFO] ..SUCCESS (8.0 s)
[INFO] Building: reloc-abs-resource-path/pom.xml
[INFO] ..SUCCESS (6.4 s)
[INFO] Building: MSHADE-105/pom.xml
[INFO] run script <https://builds.apache.org/job/maven-plugins-ITs-m3/ws/maven-shade-plugin/target/it/MSHADE-105/verify.bsh>
[INFO] ..SUCCESS (9.0 s)
[INFO] Building: mshade-123/pom.xml
[INFO] ..SUCCESS (5.9 s)
[INFO] Building: reloc-class-from-string-pool/pom.xml
[INFO] ..SUCCESS (3.3 s)
[INFO] Building: users-shader-impl/pom.xml
[INFO] run script <https://builds.apache.org/job/maven-plugins-ITs-m3/ws/maven-shade-plugin/target/it/users-shader-impl/verify.groovy>
[INFO] ..SUCCESS (4.0 s)
[INFO] Building: empty-apache-notice-transform/pom.xml
[INFO] ..SUCCESS (4.2 s)
[INFO] Building: dep-reduced-pom-relocated-result/pom.xml
[INFO] ..SUCCESS (2.8 s)
[INFO]
[INFO] --- maven-invoker-plugin:1.6:verify (integration-test) @ maven-shade-plugin ---
[INFO] -------------------------------------------------
[INFO] Build Summary:
[INFO] Passed: 41, Failed: 0, Errors: 0, Skipped: 0
[INFO] -------------------------------------------------
[INFO]
[INFO] --- maven-install-plugin:2.3.1:install (default-install) @ maven-shade-plugin ---
[INFO] Installing <https://builds.apache.org/job/maven-plugins-ITs-m3/ws/maven-shade-plugin/target/maven-shade-plugin-2.0.1-SNAPSHOT.jar> to /home/jenkins/.m2/repository/org/apache/maven/plugins/maven-shade-plugin/2.0.1-SNAPSHOT/maven-shade-plugin-2.0.1-SNAPSHOT.jar
[INFO] Installing <https://builds.apache.org/job/maven-plugins-ITs-m3/ws/maven-shade-plugin/pom.xml> to /home/jenkins/.m2/repository/org/apache/maven/plugins/maven-shade-plugin/2.0.1-SNAPSHOT/maven-shade-plugin-2.0.1-SNAPSHOT.pom
[INFO] Installing <https://builds.apache.org/job/maven-plugins-ITs-m3/ws/maven-shade-plugin/target/maven-shade-plugin-2.0.1-SNAPSHOT-tests.jar> to /home/jenkins/.m2/repository/org/apache/maven/plugins/maven-shade-plugin/2.0.1-SNAPSHOT/maven-shade-plugin-2.0.1-SNAPSHOT-tests.jar
[INFO]
[INFO] ------------------------------------------------------------------------
[INFO] Building Maven Plugins Aggregator 1-SNAPSHOT
[INFO] ------------------------------------------------------------------------
[INFO]
[INFO] --- maven-clean-plugin:2.4.1:clean (default-clean) @ maven-plugins-aggregator ---
[INFO] Deleting <https://builds.apache.org/job/maven-plugins-ITs-m3/ws/target>
[INFO]
[INFO] --- maven-remote-resources-plugin:1.1:process (default) @ maven-plugins-aggregator ---
[INFO]
[INFO] --- maven-install-plugin:2.3.1:install (default-install) @ maven-plugins-aggregator ---
[INFO] Installing <https://builds.apache.org/job/maven-plugins-ITs-m3/ws/pom.xml> to /home/jenkins/.m2/repository/org/apache/maven/plugins/maven-plugins-aggregator/1-SNAPSHOT/maven-plugins-aggregator-1-SNAPSHOT.pom
[INFO] ------------------------------------------------------------------------
[INFO] Reactor Summary:
[INFO]
[INFO] Maven Plugins ..................................... SUCCESS [7.348s]
[INFO] Maven ACR Plugin .................................. SUCCESS [27.534s]
[INFO] Maven Ant Plugin .................................. SUCCESS [1:14.089s]
[INFO] Maven AntRun Plugin ............................... SUCCESS [1:02.366s]
[INFO] Maven Eclipse Plugin .............................. SUCCESS [7:11.328s]
[INFO] Maven Assembly Plugin ............................. SUCCESS [11:30.691s]
[INFO] Maven Changelog Plugin ............................ FAILURE [7.569s]
[INFO] Maven Changes Report Plugin ....................... SUCCESS [1:01.342s]
[INFO] Maven Checkstyle Plugin ........................... SUCCESS [1:44.913s]
[INFO] Maven Clean Plugin ................................ SUCCESS [20.911s]
[INFO] Maven Compiler Plugin ............................. SUCCESS [56.607s]
[INFO] Maven Dependency Plugin ........................... SUCCESS [2:18.816s]
[INFO] Maven Deploy Plugin ............................... SUCCESS [1:08.309s]
[INFO] Maven DOAP Plugin ................................. SUCCESS [18.208s]
[INFO] Maven Documentation Checker Plugin ................ SUCCESS [7.315s]
[INFO] Maven EAR Plugin .................................. SUCCESS [3:57.791s]
[INFO] Maven EJB Plugin .................................. SUCCESS [29.242s]
[INFO] Maven GPG Plugin .................................. SUCCESS [11.011s]
[INFO] Maven Help Plugin ................................. SUCCESS [38.598s]
[INFO] Maven IDEA Plugin ................................. SUCCESS [8.335s]
[INFO] Maven Install Plugin .............................. SUCCESS [41.978s]
[INFO] Maven JAR Plugin .................................. SUCCESS [1:11.862s]
[INFO] Maven Jarsigner Plugin ............................ SUCCESS [26.271s]
[INFO] Maven Javadoc Plugin .............................. FAILURE [1:27.533s]
[INFO] Maven Linkcheck Plugin ............................ SUCCESS [2.790s]
[INFO] Maven One Plugin .................................. SUCCESS [1.788s]
[INFO] Maven Patch Plugin ................................ SUCCESS [12.898s]
[INFO] Maven PDF Plugin .................................. SUCCESS [32.599s]
[INFO] Maven PMD Plugin .................................. SUCCESS [41.582s]
[INFO] Maven RAR Plugin .................................. SUCCESS [11.076s]
[INFO] Maven Reactor Plugin .............................. SUCCESS [2.668s]
[INFO] Maven Repository Plugin ........................... SUCCESS [39.872s]
[INFO] Maven Resources Plugin ............................ SUCCESS [56.959s]
[INFO] Maven Site Plugin 3 ............................... SUCCESS [6:53.600s]
[INFO] Maven Source Plugin ............................... SUCCESS [47.122s]
[INFO] Maven Stage Plugin ................................ SUCCESS [2.250s]
[INFO] Maven Toolchains Plugin ........................... SUCCESS [2.098s]
[INFO] Maven Verifier Plugin ............................. SUCCESS [16.803s]
[INFO] Maven WAR Plugin .................................. SUCCESS [1:19.981s]
[INFO] SCM Publish Maven Plugin .......................... SUCCESS [1:09.751s]
[INFO] Maven Invoker Plugin .............................. SUCCESS [4:08.838s]
[INFO] Maven Project Info Reports Plugin ................. SUCCESS [2:32.404s]
[INFO] Maven Remote Resources Plugin ..................... SUCCESS [56.633s]
[INFO] Maven Shade Plugin ................................ SUCCESS [3:08.349s]
[INFO] Maven Plugins Aggregator .......................... SUCCESS [0.035s]
[INFO] ------------------------------------------------------------------------
[INFO] BUILD FAILURE
[INFO] ------------------------------------------------------------------------
[INFO] Total time: 1:03:31.260s
[INFO] Finished at: Thu Sep 27 15:08:55 UTC 2012
[INFO] Final Memory: 90M/320M
[INFO] ------------------------------------------------------------------------
[WARNING] The requested profile "apache.snapshots" could not be activated because it does not exist.
[ERROR] Failed to execute goal org.apache.maven.plugins:maven-surefire-plugin:2.12:test (default-test) on project maven-changelog-plugin: There are test failures.
[ERROR]
[ERROR] Please refer to <https://builds.apache.org/job/maven-plugins-ITs-m3/ws/maven-changelog-plugin/target/surefire-reports> for the individual test results.
[ERROR] -> [Help 1]
[ERROR] Failed to execute goal org.apache.maven.plugins:maven-surefire-plugin:2.12:test (default-test) on project maven-javadoc-plugin: There are test failures.
[ERROR]
[ERROR] Please refer to <https://builds.apache.org/job/maven-plugins-ITs-m3/ws/maven-javadoc-plugin/target/surefire-reports> for the individual test results.
[ERROR] -> [Help 1]
[ERROR]
[ERROR] To see the full stack trace of the errors, re-run Maven with the -e switch.
[ERROR] Re-run Maven using the -X switch to enable full debug logging.
[ERROR]
[ERROR] For more information about the errors and possible solutions, please read the following articles:
[ERROR] [Help 1] http://cwiki.apache.org/confluence/display/MAVEN/MojoFailureException
[ERROR]
[ERROR] After correcting the problems, you can resume the build with the command
[ERROR] mvn <goals> -rf :maven-changelog-plugin
Build step 'Invoke top-level Maven targets' marked build as failure
Recording test results
Build failed in Jenkins: maven-plugins-ITs-m3 #675
Posted by Apache Jenkins Server <je...@builds.apache.org>.
See <https://builds.apache.org/job/maven-plugins-ITs-m3/675/changes>
Changes:
[dennisl] [MSITE-644] NullPointerException when site URL is not defined in distributionManagement
[krosenvold] o Updated to jdk7 comatible xstream version
------------------------------------------
[...truncated 9804 lines...]
Tests run: 1, Failures: 0, Errors: 0, Skipped: 0, Time elapsed: 0.002 sec
Running org.apache.maven.plugins.shade.mojo.ArtifactIdTest
Tests run: 2, Failures: 0, Errors: 0, Skipped: 0, Time elapsed: 0.001 sec
Running org.apache.maven.plugins.shade.filter.SimpleFilterTest
Tests run: 1, Failures: 0, Errors: 0, Skipped: 0, Time elapsed: 0 sec
Running org.apache.maven.plugins.shade.resource.AppendingTransformerTest
Tests run: 1, Failures: 0, Errors: 0, Skipped: 0, Time elapsed: 0.001 sec
Running org.apache.maven.plugins.shade.resource.ApacheNoticeResourceTransformerTest
Tests run: 1, Failures: 0, Errors: 0, Skipped: 0, Time elapsed: 0.001 sec
Running org.apache.maven.plugins.shade.resource.ApacheLicenseResourceTransformerTest
Tests run: 1, Failures: 0, Errors: 0, Skipped: 0, Time elapsed: 0.001 sec
Running org.apache.maven.plugins.shade.resource.XmlAppendingTransformerTest
Tests run: 1, Failures: 0, Errors: 0, Skipped: 0, Time elapsed: 0.005 sec
Running org.apache.maven.plugins.shade.resource.ComponentsXmlResourceTransformerTest
Tests run: 1, Failures: 0, Errors: 0, Skipped: 0, Time elapsed: 0.065 sec
Running org.apache.maven.plugins.shade.relocation.SimpleRelocatorParameterTest
Tests run: 2, Failures: 0, Errors: 0, Skipped: 0, Time elapsed: 0.001 sec
Running org.apache.maven.plugins.shade.relocation.SimpleRelocatorTest
Tests run: 7, Failures: 0, Errors: 0, Skipped: 0, Time elapsed: 0.003 sec
Running org.apache.maven.plugins.shade.DefaultShaderTest
Tests run: 4, Failures: 0, Errors: 0, Skipped: 0, Time elapsed: 0.828 sec
Results :
Tests run: 27, Failures: 0, Errors: 0, Skipped: 0
[INFO]
[INFO] --- maven-jar-plugin:2.4:jar (default-jar) @ maven-shade-plugin ---
[INFO] Building jar: <https://builds.apache.org/job/maven-plugins-ITs-m3/ws/maven-shade-plugin/target/maven-shade-plugin-2.0.1-SNAPSHOT.jar>
[INFO]
[INFO] --- maven-plugin-plugin:3.1:addPluginArtifactMetadata (default-addPluginArtifactMetadata) @ maven-shade-plugin ---
[INFO]
[INFO] --- maven-jar-plugin:2.4:test-jar (default) @ maven-shade-plugin ---
[INFO] Building jar: <https://builds.apache.org/job/maven-plugins-ITs-m3/ws/maven-shade-plugin/target/maven-shade-plugin-2.0.1-SNAPSHOT-tests.jar>
[INFO]
[INFO] --- maven-invoker-plugin:1.6:install (integration-test) @ maven-shade-plugin ---
[INFO] Installing <https://builds.apache.org/job/maven-plugins-ITs-m3/ws/maven-shade-plugin/pom.xml> to <https://builds.apache.org/job/maven-plugins-ITs-m3/ws/maven-shade-plugin/target/local-repo/org/apache/maven/plugins/maven-shade-plugin/2.0.1-SNAPSHOT/maven-shade-plugin-2.0.1-SNAPSHOT.pom>
[INFO] Installing <https://builds.apache.org/job/maven-plugins-ITs-m3/ws/maven-shade-plugin/target/maven-shade-plugin-2.0.1-SNAPSHOT.jar> to <https://builds.apache.org/job/maven-plugins-ITs-m3/ws/maven-shade-plugin/target/local-repo/org/apache/maven/plugins/maven-shade-plugin/2.0.1-SNAPSHOT/maven-shade-plugin-2.0.1-SNAPSHOT.jar>
[INFO] Installing <https://builds.apache.org/job/maven-plugins-ITs-m3/ws/maven-shade-plugin/target/maven-shade-plugin-2.0.1-SNAPSHOT-tests.jar> to <https://builds.apache.org/job/maven-plugins-ITs-m3/ws/maven-shade-plugin/target/local-repo/org/apache/maven/plugins/maven-shade-plugin/2.0.1-SNAPSHOT/maven-shade-plugin-2.0.1-SNAPSHOT-tests.jar>
[INFO]
[INFO] --- maven-invoker-plugin:1.6:integration-test (integration-test) @ maven-shade-plugin ---
[INFO] Building: shadePomDependency/pom.xml
[INFO] ..SUCCESS (5.5 s)
[INFO] Building: finalNameShade-attached/pom.xml
[INFO] run script <https://builds.apache.org/job/maven-plugins-ITs-m3/ws/maven-shade-plugin/target/it/finalNameShade-attached/setup.bsh>
[INFO] run script <https://builds.apache.org/job/maven-plugins-ITs-m3/ws/maven-shade-plugin/target/it/finalNameShade-attached/verify.bsh>
[INFO] ..SUCCESS (6.7 s)
[INFO] Building: attached-artifact-type/pom.xml
[INFO] ..SUCCESS (3.4 s)
[INFO] Building: project-with-reactors-included/pom.xml
[INFO] run script <https://builds.apache.org/job/maven-plugins-ITs-m3/ws/maven-shade-plugin/target/it/project-with-reactors-included/verify.bsh>
[INFO] ..SUCCESS (5.3 s)
[INFO] Building: pom-packaging/pom.xml
[INFO] run script <https://builds.apache.org/job/maven-plugins-ITs-m3/ws/maven-shade-plugin/target/it/pom-packaging/verify.bsh>
[INFO] ..SUCCESS (2.6 s)
[INFO] Building: users-shader-impl/pom.xml
[INFO] run script <https://builds.apache.org/job/maven-plugins-ITs-m3/ws/maven-shade-plugin/target/it/users-shader-impl/verify.groovy>
[INFO] ..SUCCESS (4.1 s)
[INFO] Building: mini-jar-respect-includes/pom.xml
[INFO] run script <https://builds.apache.org/job/maven-plugins-ITs-m3/ws/maven-shade-plugin/target/it/mini-jar-respect-includes/verify.bsh>
[INFO] ..SUCCESS (4.5 s)
[INFO] Building: reloc-includes-excludes/pom.xml
[INFO] run script <https://builds.apache.org/job/maven-plugins-ITs-m3/ws/maven-shade-plugin/target/it/reloc-includes-excludes/verify.bsh>
[INFO] ..SUCCESS (4.2 s)
[INFO] Building: manifest-retained/pom.xml
[INFO] run script <https://builds.apache.org/job/maven-plugins-ITs-m3/ws/maven-shade-plugin/target/it/manifest-retained/verify.bsh>
[INFO] ..SUCCESS (4.9 s)
[INFO] Building: implicit-inclusion-of-project-artifact/pom.xml
[INFO] run script <https://builds.apache.org/job/maven-plugins-ITs-m3/ws/maven-shade-plugin/target/it/implicit-inclusion-of-project-artifact/verify.bsh>
[INFO] ..SUCCESS (3.9 s)
[INFO] Building: dep-reduced-pom-relocated-result/pom.xml
[INFO] ..SUCCESS (2.8 s)
[INFO] Building: dep-reduced-pom-with-local-parent/pom.xml
[INFO] ..SUCCESS (2.7 s)
[INFO] Building: rerun-without-reloc/pom.xml
[INFO] ..SUCCESS (3.5 s)
[INFO] Building: finalNameBuild-attached/pom.xml
[INFO] run script <https://builds.apache.org/job/maven-plugins-ITs-m3/ws/maven-shade-plugin/target/it/finalNameBuild-attached/setup.bsh>
[INFO] run script <https://builds.apache.org/job/maven-plugins-ITs-m3/ws/maven-shade-plugin/target/it/finalNameBuild-attached/verify.bsh>
[INFO] ..SUCCESS (3.6 s)
[INFO] Building: empty-apache-notice-transform/pom.xml
[INFO] ..SUCCESS (4.3 s)
[INFO] Building: MSHADE-105/pom.xml
[INFO] run script <https://builds.apache.org/job/maven-plugins-ITs-m3/ws/maven-shade-plugin/target/it/MSHADE-105/verify.bsh>
[INFO] ..SUCCESS (7.6 s)
[INFO] Building: reloc-anno/pom.xml
[INFO] ..SUCCESS (3.5 s)
[INFO] Building: component-descriptor-relocation/pom.xml
[INFO] ..SUCCESS (4.1 s)
[INFO] Building: mini-jar-package-info/pom.xml
[INFO] run script <https://builds.apache.org/job/maven-plugins-ITs-m3/ws/maven-shade-plugin/target/it/mini-jar-package-info/verify.bsh>
[INFO] ..SUCCESS (4.5 s)
[INFO] Building: dep-reduced-pom/pom.xml
[INFO] run script <https://builds.apache.org/job/maven-plugins-ITs-m3/ws/maven-shade-plugin/target/it/dep-reduced-pom/verify.groovy>
[INFO] ..SUCCESS (3.6 s)
[INFO] Building: mshade-123/pom.xml
[INFO] ..SUCCESS (5.5 s)
[INFO] Building: reloc-enum-ref-from-anno/pom.xml
[INFO] ..SUCCESS (3.3 s)
[INFO] Building: rerun-with-reloc/pom.xml
[INFO] ..SUCCESS (5.0 s)
[INFO] Building: mini-jar/pom.xml
[INFO] run script <https://builds.apache.org/job/maven-plugins-ITs-m3/ws/maven-shade-plugin/target/it/mini-jar/verify.bsh>
[INFO] ..SUCCESS (4.0 s)
[INFO] Building: xml-transformer-ignores-dtd/pom.xml
[INFO] run script <https://builds.apache.org/job/maven-plugins-ITs-m3/ws/maven-shade-plugin/target/it/xml-transformer-ignores-dtd/verify.bsh>
[INFO] ..SUCCESS (3.6 s)
[INFO] Building: duplicate-classes-with-reloc/pom.xml
[INFO] ..SUCCESS (2.9 s)
[INFO] Building: finalNameShade/pom.xml
[INFO] run script <https://builds.apache.org/job/maven-plugins-ITs-m3/ws/maven-shade-plugin/target/it/finalNameShade/setup.bsh>
[INFO] run script <https://builds.apache.org/job/maven-plugins-ITs-m3/ws/maven-shade-plugin/target/it/finalNameShade/verify.bsh>
[INFO] ..SUCCESS (3.7 s)
[INFO] Building: finalNameBuild/pom.xml
[INFO] run script <https://builds.apache.org/job/maven-plugins-ITs-m3/ws/maven-shade-plugin/target/it/finalNameBuild/setup.bsh>
[INFO] run script <https://builds.apache.org/job/maven-plugins-ITs-m3/ws/maven-shade-plugin/target/it/finalNameBuild/verify.bsh>
[INFO] ..SUCCESS (3.6 s)
[INFO] Building: filter-artifact-contents/pom.xml
[INFO] run script <https://builds.apache.org/job/maven-plugins-ITs-m3/ws/maven-shade-plugin/target/it/filter-artifact-contents/verify.bsh>
[INFO] ..SUCCESS (3.7 s)
[INFO] Building: artifact-includes-excludes/pom.xml
[INFO] run script <https://builds.apache.org/job/maven-plugins-ITs-m3/ws/maven-shade-plugin/target/it/artifact-includes-excludes/verify.bsh>
[INFO] ..SUCCESS (3.6 s)
[INFO] Building: non-runtime-scope-excluded/pom.xml
[INFO] run script <https://builds.apache.org/job/maven-plugins-ITs-m3/ws/maven-shade-plugin/target/it/non-runtime-scope-excluded/verify.bsh>
[INFO] ..SUCCESS (3.7 s)
[INFO] Building: manifest-transformed/pom.xml
[INFO] run script <https://builds.apache.org/job/maven-plugins-ITs-m3/ws/maven-shade-plugin/target/it/manifest-transformed/verify.bsh>
[INFO] ..SUCCESS (4.6 s)
[INFO] Building: dep-reduced-pom-unique/pom.xml
[INFO] run script <https://builds.apache.org/job/maven-plugins-ITs-m3/ws/maven-shade-plugin/target/it/dep-reduced-pom-unique/verify.groovy>
[INFO] ..SUCCESS (4.0 s)
[INFO] Building: reloc-abs-resource-path/pom.xml
[INFO] ..SUCCESS (5.3 s)
[INFO] Building: services-resource-transformer/pom.xml
[INFO] run script <https://builds.apache.org/job/maven-plugins-ITs-m3/ws/maven-shade-plugin/target/it/services-resource-transformer/verify.bsh>
[INFO] ..SUCCESS (3.7 s)
[INFO] Building: reloc-class-from-string-pool/pom.xml
[INFO] ..SUCCESS (3.4 s)
[INFO] Building: attach-after-lifecycle-fork/pom.xml
[INFO] run script <https://builds.apache.org/job/maven-plugins-ITs-m3/ws/maven-shade-plugin/target/it/attach-after-lifecycle-fork/setup.bsh>
[INFO] run script <https://builds.apache.org/job/maven-plugins-ITs-m3/ws/maven-shade-plugin/target/it/attach-after-lifecycle-fork/verify.bsh>
[INFO] ..SUCCESS (3.0 s)
[INFO] Building: mini-jar-malformed-dependencies/pom.xml
[INFO] ..SUCCESS (6.8 s)
[INFO] Building: duplicate-classes-without-reloc/pom.xml
[INFO] ..SUCCESS (2.8 s)
[INFO] Building: empty-relocation-shaded-pattern/pom.xml
[INFO] ..SUCCESS (3.5 s)
[INFO] Building: empty-relocation-pattern/pom.xml
[INFO] ..SUCCESS (3.4 s)
[INFO]
[INFO] --- maven-invoker-plugin:1.6:verify (integration-test) @ maven-shade-plugin ---
[INFO] -------------------------------------------------
[INFO] Build Summary:
[INFO] Passed: 41, Failed: 0, Errors: 0, Skipped: 0
[INFO] -------------------------------------------------
[INFO]
[INFO] --- maven-install-plugin:2.3.1:install (default-install) @ maven-shade-plugin ---
[INFO] Installing <https://builds.apache.org/job/maven-plugins-ITs-m3/ws/maven-shade-plugin/target/maven-shade-plugin-2.0.1-SNAPSHOT.jar> to /home/jenkins/.m2/repository/org/apache/maven/plugins/maven-shade-plugin/2.0.1-SNAPSHOT/maven-shade-plugin-2.0.1-SNAPSHOT.jar
[INFO] Installing <https://builds.apache.org/job/maven-plugins-ITs-m3/ws/maven-shade-plugin/pom.xml> to /home/jenkins/.m2/repository/org/apache/maven/plugins/maven-shade-plugin/2.0.1-SNAPSHOT/maven-shade-plugin-2.0.1-SNAPSHOT.pom
[INFO] Installing <https://builds.apache.org/job/maven-plugins-ITs-m3/ws/maven-shade-plugin/target/maven-shade-plugin-2.0.1-SNAPSHOT-tests.jar> to /home/jenkins/.m2/repository/org/apache/maven/plugins/maven-shade-plugin/2.0.1-SNAPSHOT/maven-shade-plugin-2.0.1-SNAPSHOT-tests.jar
[INFO]
[INFO] ------------------------------------------------------------------------
[INFO] Building Maven Plugins Aggregator 1-SNAPSHOT
[INFO] ------------------------------------------------------------------------
[INFO]
[INFO] --- maven-clean-plugin:2.4.1:clean (default-clean) @ maven-plugins-aggregator ---
[INFO] Deleting <https://builds.apache.org/job/maven-plugins-ITs-m3/ws/target>
[INFO]
[INFO] --- maven-remote-resources-plugin:1.1:process (default) @ maven-plugins-aggregator ---
[INFO]
[INFO] --- maven-install-plugin:2.3.1:install (default-install) @ maven-plugins-aggregator ---
[INFO] Installing <https://builds.apache.org/job/maven-plugins-ITs-m3/ws/pom.xml> to /home/jenkins/.m2/repository/org/apache/maven/plugins/maven-plugins-aggregator/1-SNAPSHOT/maven-plugins-aggregator-1-SNAPSHOT.pom
[INFO] ------------------------------------------------------------------------
[INFO] Reactor Summary:
[INFO]
[INFO] Maven Plugins ..................................... SUCCESS [9.984s]
[INFO] Maven ACR Plugin .................................. SUCCESS [43.583s]
[INFO] Maven Ant Plugin .................................. SUCCESS [1:09.787s]
[INFO] Maven AntRun Plugin ............................... SUCCESS [56.209s]
[INFO] Maven Eclipse Plugin .............................. SUCCESS [6:43.055s]
[INFO] Maven Assembly Plugin ............................. SUCCESS [11:17.221s]
[INFO] Maven Changelog Plugin ............................ FAILURE [8.145s]
[INFO] Maven Changes Report Plugin ....................... SUCCESS [1:00.368s]
[INFO] Maven Checkstyle Plugin ........................... SUCCESS [1:42.212s]
[INFO] Maven Clean Plugin ................................ SUCCESS [20.548s]
[INFO] Maven Compiler Plugin ............................. SUCCESS [59.965s]
[INFO] Maven Dependency Plugin ........................... SUCCESS [2:15.394s]
[INFO] Maven Deploy Plugin ............................... SUCCESS [1:03.675s]
[INFO] Maven DOAP Plugin ................................. SUCCESS [17.745s]
[INFO] Maven Documentation Checker Plugin ................ SUCCESS [7.164s]
[INFO] Maven EAR Plugin .................................. SUCCESS [3:54.986s]
[INFO] Maven EJB Plugin .................................. SUCCESS [28.052s]
[INFO] Maven GPG Plugin .................................. SUCCESS [10.638s]
[INFO] Maven Help Plugin ................................. SUCCESS [35.542s]
[INFO] Maven IDEA Plugin ................................. SUCCESS [10.635s]
[INFO] Maven Install Plugin .............................. SUCCESS [41.271s]
[INFO] Maven JAR Plugin .................................. SUCCESS [1:10.243s]
[INFO] Maven Jarsigner Plugin ............................ SUCCESS [25.834s]
[INFO] Maven Javadoc Plugin .............................. FAILURE [1:29.983s]
[INFO] Maven Linkcheck Plugin ............................ SUCCESS [2.984s]
[INFO] Maven One Plugin .................................. SUCCESS [1.724s]
[INFO] Maven Patch Plugin ................................ SUCCESS [13.412s]
[INFO] Maven PDF Plugin .................................. SUCCESS [38.626s]
[INFO] Maven PMD Plugin .................................. SUCCESS [52.639s]
[INFO] Maven RAR Plugin .................................. SUCCESS [11.145s]
[INFO] Maven Reactor Plugin .............................. SUCCESS [2.806s]
[INFO] Maven Repository Plugin ........................... SUCCESS [43.210s]
[INFO] Maven Resources Plugin ............................ SUCCESS [57.357s]
[INFO] Maven Site Plugin 3 ............................... SUCCESS [7:05.506s]
[INFO] Maven Source Plugin ............................... SUCCESS [46.427s]
[INFO] Maven Stage Plugin ................................ SUCCESS [2.765s]
[INFO] Maven Toolchains Plugin ........................... SUCCESS [2.479s]
[INFO] Maven Verifier Plugin ............................. SUCCESS [15.678s]
[INFO] Maven WAR Plugin .................................. SUCCESS [1:24.693s]
[INFO] SCM Publish Maven Plugin .......................... SUCCESS [1:17.922s]
[INFO] Maven Invoker Plugin .............................. SUCCESS [4:09.248s]
[INFO] Maven Project Info Reports Plugin ................. SUCCESS [2:26.829s]
[INFO] Maven Remote Resources Plugin ..................... SUCCESS [1:03.222s]
[INFO] Maven Shade Plugin ................................ SUCCESS [3:11.516s]
[INFO] Maven Plugins Aggregator .......................... SUCCESS [0.068s]
[INFO] ------------------------------------------------------------------------
[INFO] BUILD FAILURE
[INFO] ------------------------------------------------------------------------
[INFO] Total time: 1:03:33.826s
[INFO] Finished at: Thu Sep 27 00:16:30 UTC 2012
[INFO] Final Memory: 98M/419M
[INFO] ------------------------------------------------------------------------
[WARNING] The requested profile "apache.snapshots" could not be activated because it does not exist.
[ERROR] Failed to execute goal org.apache.maven.plugins:maven-surefire-plugin:2.12:test (default-test) on project maven-changelog-plugin: There are test failures.
[ERROR]
[ERROR] Please refer to <https://builds.apache.org/job/maven-plugins-ITs-m3/ws/maven-changelog-plugin/target/surefire-reports> for the individual test results.
[ERROR] -> [Help 1]
[ERROR] Failed to execute goal org.apache.maven.plugins:maven-surefire-plugin:2.12:test (default-test) on project maven-javadoc-plugin: There are test failures.
[ERROR]
[ERROR] Please refer to <https://builds.apache.org/job/maven-plugins-ITs-m3/ws/maven-javadoc-plugin/target/surefire-reports> for the individual test results.
[ERROR] -> [Help 1]
[ERROR]
[ERROR] To see the full stack trace of the errors, re-run Maven with the -e switch.
[ERROR] Re-run Maven using the -X switch to enable full debug logging.
[ERROR]
[ERROR] For more information about the errors and possible solutions, please read the following articles:
[ERROR] [Help 1] http://cwiki.apache.org/confluence/display/MAVEN/MojoFailureException
[ERROR]
[ERROR] After correcting the problems, you can resume the build with the command
[ERROR] mvn <goals> -rf :maven-changelog-plugin
Build step 'Invoke top-level Maven targets' marked build as failure
Recording test results
Build failed in Jenkins: maven-plugins-ITs-m3 #674
Posted by Apache Jenkins Server <je...@builds.apache.org>.
See <https://builds.apache.org/job/maven-plugins-ITs-m3/674/changes>
Changes:
[struberg] MCOMPILER-21 use maven-shared-utils ReaderFactory
------------------------------------------
[...truncated 9661 lines...]
Running org.apache.maven.plugins.shade.mojo.RelativizePathTest
Tests run: 1, Failures: 0, Errors: 0, Skipped: 0, Time elapsed: 0.018 sec
Running org.apache.maven.plugins.shade.mojo.ArtifactSelectorTest
Tests run: 1, Failures: 0, Errors: 0, Skipped: 0, Time elapsed: 0.001 sec
Running org.apache.maven.plugins.shade.mojo.ArtifactIdTest
Tests run: 2, Failures: 0, Errors: 0, Skipped: 0, Time elapsed: 0.002 sec
Running org.apache.maven.plugins.shade.filter.SimpleFilterTest
Tests run: 1, Failures: 0, Errors: 0, Skipped: 0, Time elapsed: 0.001 sec
Running org.apache.maven.plugins.shade.relocation.SimpleRelocatorTest
Tests run: 7, Failures: 0, Errors: 0, Skipped: 0, Time elapsed: 0.003 sec
Running org.apache.maven.plugins.shade.relocation.SimpleRelocatorParameterTest
Tests run: 2, Failures: 0, Errors: 0, Skipped: 0, Time elapsed: 0 sec
Results :
Tests run: 27, Failures: 0, Errors: 0, Skipped: 0
[INFO]
[INFO] --- maven-jar-plugin:2.4:jar (default-jar) @ maven-shade-plugin ---
[INFO] Building jar: <https://builds.apache.org/job/maven-plugins-ITs-m3/ws/maven-shade-plugin/target/maven-shade-plugin-2.0.1-SNAPSHOT.jar>
[INFO]
[INFO] --- maven-plugin-plugin:3.1:addPluginArtifactMetadata (default-addPluginArtifactMetadata) @ maven-shade-plugin ---
[INFO]
[INFO] --- maven-jar-plugin:2.4:test-jar (default) @ maven-shade-plugin ---
[INFO] Building jar: <https://builds.apache.org/job/maven-plugins-ITs-m3/ws/maven-shade-plugin/target/maven-shade-plugin-2.0.1-SNAPSHOT-tests.jar>
[INFO]
[INFO] --- maven-invoker-plugin:1.6:install (integration-test) @ maven-shade-plugin ---
[INFO] Installing <https://builds.apache.org/job/maven-plugins-ITs-m3/ws/maven-shade-plugin/pom.xml> to <https://builds.apache.org/job/maven-plugins-ITs-m3/ws/maven-shade-plugin/target/local-repo/org/apache/maven/plugins/maven-shade-plugin/2.0.1-SNAPSHOT/maven-shade-plugin-2.0.1-SNAPSHOT.pom>
[INFO] Installing <https://builds.apache.org/job/maven-plugins-ITs-m3/ws/maven-shade-plugin/target/maven-shade-plugin-2.0.1-SNAPSHOT.jar> to <https://builds.apache.org/job/maven-plugins-ITs-m3/ws/maven-shade-plugin/target/local-repo/org/apache/maven/plugins/maven-shade-plugin/2.0.1-SNAPSHOT/maven-shade-plugin-2.0.1-SNAPSHOT.jar>
[INFO] Installing <https://builds.apache.org/job/maven-plugins-ITs-m3/ws/maven-shade-plugin/target/maven-shade-plugin-2.0.1-SNAPSHOT-tests.jar> to <https://builds.apache.org/job/maven-plugins-ITs-m3/ws/maven-shade-plugin/target/local-repo/org/apache/maven/plugins/maven-shade-plugin/2.0.1-SNAPSHOT/maven-shade-plugin-2.0.1-SNAPSHOT-tests.jar>
[INFO]
[INFO] --- maven-invoker-plugin:1.6:integration-test (integration-test) @ maven-shade-plugin ---
[INFO] Building: artifact-includes-excludes/pom.xml
[INFO] run script <https://builds.apache.org/job/maven-plugins-ITs-m3/ws/maven-shade-plugin/target/it/artifact-includes-excludes/verify.bsh>
[INFO] ..SUCCESS (5.8 s)
[INFO] Building: dep-reduced-pom-with-local-parent/pom.xml
[INFO] ..SUCCESS (4.2 s)
[INFO] Building: implicit-inclusion-of-project-artifact/pom.xml
[INFO] run script <https://builds.apache.org/job/maven-plugins-ITs-m3/ws/maven-shade-plugin/target/it/implicit-inclusion-of-project-artifact/verify.bsh>
[INFO] ..SUCCESS (3.8 s)
[INFO] Building: reloc-class-from-string-pool/pom.xml
[INFO] ..SUCCESS (3.3 s)
[INFO] Building: dep-reduced-pom-unique/pom.xml
[INFO] run script <https://builds.apache.org/job/maven-plugins-ITs-m3/ws/maven-shade-plugin/target/it/dep-reduced-pom-unique/verify.groovy>
[INFO] ..SUCCESS (4.2 s)
[INFO] Building: non-runtime-scope-excluded/pom.xml
[INFO] run script <https://builds.apache.org/job/maven-plugins-ITs-m3/ws/maven-shade-plugin/target/it/non-runtime-scope-excluded/verify.bsh>
[INFO] ..SUCCESS (3.7 s)
[INFO] Building: manifest-transformed/pom.xml
[INFO] run script <https://builds.apache.org/job/maven-plugins-ITs-m3/ws/maven-shade-plugin/target/it/manifest-transformed/verify.bsh>
[INFO] ..SUCCESS (4.7 s)
[INFO] Building: duplicate-classes-without-reloc/pom.xml
[INFO] ..SUCCESS (3.0 s)
[INFO] Building: mini-jar-respect-includes/pom.xml
[INFO] run script <https://builds.apache.org/job/maven-plugins-ITs-m3/ws/maven-shade-plugin/target/it/mini-jar-respect-includes/verify.bsh>
[INFO] ..SUCCESS (4.8 s)
[INFO] Building: pom-packaging/pom.xml
[INFO] run script <https://builds.apache.org/job/maven-plugins-ITs-m3/ws/maven-shade-plugin/target/it/pom-packaging/verify.bsh>
[INFO] ..SUCCESS (2.5 s)
[INFO] Building: xml-transformer-ignores-dtd/pom.xml
[INFO] run script <https://builds.apache.org/job/maven-plugins-ITs-m3/ws/maven-shade-plugin/target/it/xml-transformer-ignores-dtd/verify.bsh>
[INFO] ..SUCCESS (3.6 s)
[INFO] Building: empty-relocation-shaded-pattern/pom.xml
[INFO] ..SUCCESS (3.4 s)
[INFO] Building: mshade-123/pom.xml
[INFO] ..SUCCESS (5.6 s)
[INFO] Building: manifest-retained/pom.xml
[INFO] run script <https://builds.apache.org/job/maven-plugins-ITs-m3/ws/maven-shade-plugin/target/it/manifest-retained/verify.bsh>
[INFO] ..SUCCESS (4.7 s)
[INFO] Building: finalNameBuild/pom.xml
[INFO] run script <https://builds.apache.org/job/maven-plugins-ITs-m3/ws/maven-shade-plugin/target/it/finalNameBuild/setup.bsh>
[INFO] run script <https://builds.apache.org/job/maven-plugins-ITs-m3/ws/maven-shade-plugin/target/it/finalNameBuild/verify.bsh>
[INFO] ..SUCCESS (3.6 s)
[INFO] Building: finalNameShade/pom.xml
[INFO] run script <https://builds.apache.org/job/maven-plugins-ITs-m3/ws/maven-shade-plugin/target/it/finalNameShade/setup.bsh>
[INFO] run script <https://builds.apache.org/job/maven-plugins-ITs-m3/ws/maven-shade-plugin/target/it/finalNameShade/verify.bsh>
[INFO] ..SUCCESS (3.6 s)
[INFO] Building: reloc-abs-resource-path/pom.xml
[INFO] ..SUCCESS (5.7 s)
[INFO] Building: empty-apache-notice-transform/pom.xml
[INFO] ..SUCCESS (4.3 s)
[INFO] Building: services-resource-transformer/pom.xml
[INFO] run script <https://builds.apache.org/job/maven-plugins-ITs-m3/ws/maven-shade-plugin/target/it/services-resource-transformer/verify.bsh>
[INFO] ..SUCCESS (3.6 s)
[INFO] Building: mini-jar-package-info/pom.xml
[INFO] run script <https://builds.apache.org/job/maven-plugins-ITs-m3/ws/maven-shade-plugin/target/it/mini-jar-package-info/verify.bsh>
[INFO] ..SUCCESS (4.6 s)
[INFO] Building: rerun-without-reloc/pom.xml
[INFO] ..SUCCESS (3.5 s)
[INFO] Building: shadePomDependency/pom.xml
[INFO] ..SUCCESS (4.7 s)
[INFO] Building: reloc-includes-excludes/pom.xml
[INFO] run script <https://builds.apache.org/job/maven-plugins-ITs-m3/ws/maven-shade-plugin/target/it/reloc-includes-excludes/verify.bsh>
[INFO] ..SUCCESS (4.2 s)
[INFO] Building: finalNameShade-attached/pom.xml
[INFO] run script <https://builds.apache.org/job/maven-plugins-ITs-m3/ws/maven-shade-plugin/target/it/finalNameShade-attached/setup.bsh>
[INFO] run script <https://builds.apache.org/job/maven-plugins-ITs-m3/ws/maven-shade-plugin/target/it/finalNameShade-attached/verify.bsh>
[INFO] ..SUCCESS (3.5 s)
[INFO] Building: component-descriptor-relocation/pom.xml
[INFO] ..SUCCESS (4.0 s)
[INFO] Building: users-shader-impl/pom.xml
[INFO] run script <https://builds.apache.org/job/maven-plugins-ITs-m3/ws/maven-shade-plugin/target/it/users-shader-impl/verify.groovy>
[INFO] ..SUCCESS (4.2 s)
[INFO] Building: mini-jar-malformed-dependencies/pom.xml
[INFO] ..SUCCESS (8.0 s)
[INFO] Building: finalNameBuild-attached/pom.xml
[INFO] run script <https://builds.apache.org/job/maven-plugins-ITs-m3/ws/maven-shade-plugin/target/it/finalNameBuild-attached/setup.bsh>
[INFO] run script <https://builds.apache.org/job/maven-plugins-ITs-m3/ws/maven-shade-plugin/target/it/finalNameBuild-attached/verify.bsh>
[INFO] ..SUCCESS (3.5 s)
[INFO] Building: attach-after-lifecycle-fork/pom.xml
[INFO] run script <https://builds.apache.org/job/maven-plugins-ITs-m3/ws/maven-shade-plugin/target/it/attach-after-lifecycle-fork/setup.bsh>
[INFO] run script <https://builds.apache.org/job/maven-plugins-ITs-m3/ws/maven-shade-plugin/target/it/attach-after-lifecycle-fork/verify.bsh>
[INFO] ..SUCCESS (3.0 s)
[INFO] Building: empty-relocation-pattern/pom.xml
[INFO] ..SUCCESS (3.5 s)
[INFO] Building: mini-jar/pom.xml
[INFO] run script <https://builds.apache.org/job/maven-plugins-ITs-m3/ws/maven-shade-plugin/target/it/mini-jar/verify.bsh>
[INFO] ..SUCCESS (4.0 s)
[INFO] Building: reloc-anno/pom.xml
[INFO] ..SUCCESS (3.4 s)
[INFO] Building: MSHADE-105/pom.xml
[INFO] run script <https://builds.apache.org/job/maven-plugins-ITs-m3/ws/maven-shade-plugin/target/it/MSHADE-105/verify.bsh>
[INFO] ..SUCCESS (9.3 s)
[INFO] Building: dep-reduced-pom-relocated-result/pom.xml
[INFO] ..SUCCESS (3.1 s)
[INFO] Building: attached-artifact-type/pom.xml
[INFO] ..SUCCESS (3.7 s)
[INFO] Building: dep-reduced-pom/pom.xml
[INFO] run script <https://builds.apache.org/job/maven-plugins-ITs-m3/ws/maven-shade-plugin/target/it/dep-reduced-pom/verify.groovy>
[INFO] ..SUCCESS (3.7 s)
[INFO] Building: rerun-with-reloc/pom.xml
[INFO] ..SUCCESS (5.3 s)
[INFO] Building: duplicate-classes-with-reloc/pom.xml
[INFO] ..SUCCESS (2.9 s)
[INFO] Building: filter-artifact-contents/pom.xml
[INFO] run script <https://builds.apache.org/job/maven-plugins-ITs-m3/ws/maven-shade-plugin/target/it/filter-artifact-contents/verify.bsh>
[INFO] ..SUCCESS (3.7 s)
[INFO] Building: project-with-reactors-included/pom.xml
[INFO] run script <https://builds.apache.org/job/maven-plugins-ITs-m3/ws/maven-shade-plugin/target/it/project-with-reactors-included/verify.bsh>
[INFO] ..SUCCESS (5.1 s)
[INFO] Building: reloc-enum-ref-from-anno/pom.xml
[INFO] ..SUCCESS (3.4 s)
[INFO]
[INFO] --- maven-invoker-plugin:1.6:verify (integration-test) @ maven-shade-plugin ---
[INFO] -------------------------------------------------
[INFO] Build Summary:
[INFO] Passed: 41, Failed: 0, Errors: 0, Skipped: 0
[INFO] -------------------------------------------------
[INFO]
[INFO] --- maven-install-plugin:2.3.1:install (default-install) @ maven-shade-plugin ---
[INFO] Installing <https://builds.apache.org/job/maven-plugins-ITs-m3/ws/maven-shade-plugin/target/maven-shade-plugin-2.0.1-SNAPSHOT.jar> to /home/jenkins/.m2/repository/org/apache/maven/plugins/maven-shade-plugin/2.0.1-SNAPSHOT/maven-shade-plugin-2.0.1-SNAPSHOT.jar
[INFO] Installing <https://builds.apache.org/job/maven-plugins-ITs-m3/ws/maven-shade-plugin/pom.xml> to /home/jenkins/.m2/repository/org/apache/maven/plugins/maven-shade-plugin/2.0.1-SNAPSHOT/maven-shade-plugin-2.0.1-SNAPSHOT.pom
[INFO] Installing <https://builds.apache.org/job/maven-plugins-ITs-m3/ws/maven-shade-plugin/target/maven-shade-plugin-2.0.1-SNAPSHOT-tests.jar> to /home/jenkins/.m2/repository/org/apache/maven/plugins/maven-shade-plugin/2.0.1-SNAPSHOT/maven-shade-plugin-2.0.1-SNAPSHOT-tests.jar
[INFO]
[INFO] ------------------------------------------------------------------------
[INFO] Building Maven Plugins Aggregator 1-SNAPSHOT
[INFO] ------------------------------------------------------------------------
[INFO]
[INFO] --- maven-clean-plugin:2.4.1:clean (default-clean) @ maven-plugins-aggregator ---
[INFO] Deleting <https://builds.apache.org/job/maven-plugins-ITs-m3/ws/target>
[INFO]
[INFO] --- maven-remote-resources-plugin:1.1:process (default) @ maven-plugins-aggregator ---
[INFO]
[INFO] --- maven-install-plugin:2.3.1:install (default-install) @ maven-plugins-aggregator ---
[INFO] Installing <https://builds.apache.org/job/maven-plugins-ITs-m3/ws/pom.xml> to /home/jenkins/.m2/repository/org/apache/maven/plugins/maven-plugins-aggregator/1-SNAPSHOT/maven-plugins-aggregator-1-SNAPSHOT.pom
[INFO] ------------------------------------------------------------------------
[INFO] Reactor Summary:
[INFO]
[INFO] Maven Plugins ..................................... SUCCESS [52.452s]
[INFO] Maven ACR Plugin .................................. SUCCESS [23.859s]
[INFO] Maven Ant Plugin .................................. SUCCESS [1:18.339s]
[INFO] Maven AntRun Plugin ............................... SUCCESS [54.542s]
[INFO] Maven Eclipse Plugin .............................. SUCCESS [6:48.611s]
[INFO] Maven Assembly Plugin ............................. SUCCESS [11:18.419s]
[INFO] Maven Changelog Plugin ............................ FAILURE [10.663s]
[INFO] Maven Changes Report Plugin ....................... SUCCESS [1:03.943s]
[INFO] Maven Checkstyle Plugin ........................... SUCCESS [1:43.026s]
[INFO] Maven Clean Plugin ................................ SUCCESS [21.201s]
[INFO] Maven Compiler Plugin ............................. FAILURE [8.578s]
[INFO] Maven Dependency Plugin ........................... SUCCESS [2:16.104s]
[INFO] Maven Deploy Plugin ............................... SUCCESS [1:16.901s]
[INFO] Maven DOAP Plugin ................................. SUCCESS [18.975s]
[INFO] Maven Documentation Checker Plugin ................ FAILURE [6.747s]
[INFO] Maven EAR Plugin .................................. SUCCESS [3:59.158s]
[INFO] Maven EJB Plugin .................................. SUCCESS [28.579s]
[INFO] Maven GPG Plugin .................................. SUCCESS [11.361s]
[INFO] Maven Help Plugin ................................. SUCCESS [35.497s]
[INFO] Maven IDEA Plugin ................................. SUCCESS [8.411s]
[INFO] Maven Install Plugin .............................. SUCCESS [43.619s]
[INFO] Maven JAR Plugin .................................. SUCCESS [1:18.443s]
[INFO] Maven Jarsigner Plugin ............................ SUCCESS [26.640s]
[INFO] Maven Javadoc Plugin .............................. FAILURE [1:24.286s]
[INFO] Maven Linkcheck Plugin ............................ SUCCESS [3.888s]
[INFO] Maven One Plugin .................................. SUCCESS [2.311s]
[INFO] Maven Patch Plugin ................................ SUCCESS [14.027s]
[INFO] Maven PDF Plugin .................................. SUCCESS [2:35.786s]
[INFO] Maven PMD Plugin .................................. SUCCESS [48.514s]
[INFO] Maven RAR Plugin .................................. SUCCESS [14.676s]
[INFO] Maven Reactor Plugin .............................. SUCCESS [3.252s]
[INFO] Maven Repository Plugin ........................... SUCCESS [54.419s]
[INFO] Maven Resources Plugin ............................ SUCCESS [58.250s]
[INFO] Maven Site Plugin 3 ............................... SUCCESS [7:05.689s]
[INFO] Maven Source Plugin ............................... SUCCESS [49.852s]
[INFO] Maven Stage Plugin ................................ SUCCESS [2.629s]
[INFO] Maven Toolchains Plugin ........................... SUCCESS [2.378s]
[INFO] Maven Verifier Plugin ............................. SUCCESS [15.937s]
[INFO] Maven WAR Plugin .................................. SUCCESS [1:24.575s]
[INFO] SCM Publish Maven Plugin .......................... SUCCESS [1:17.257s]
[INFO] Maven Invoker Plugin .............................. SUCCESS [4:13.249s]
[INFO] Maven Project Info Reports Plugin ................. SUCCESS [2:33.640s]
[INFO] Maven Remote Resources Plugin ..................... SUCCESS [1:00.845s]
[INFO] Maven Shade Plugin ................................ SUCCESS [3:21.959s]
[INFO] Maven Plugins Aggregator .......................... SUCCESS [0.169s]
[INFO] ------------------------------------------------------------------------
[INFO] BUILD FAILURE
[INFO] ------------------------------------------------------------------------
[INFO] Total time: 1:06:23.504s
[INFO] Finished at: Wed Sep 26 16:22:17 UTC 2012
[INFO] Final Memory: 97M/415M
[INFO] ------------------------------------------------------------------------
[WARNING] The requested profile "apache.snapshots" could not be activated because it does not exist.
[ERROR] Failed to execute goal org.apache.maven.plugins:maven-surefire-plugin:2.12:test (default-test) on project maven-changelog-plugin: There are test failures.
[ERROR]
[ERROR] Please refer to <https://builds.apache.org/job/maven-plugins-ITs-m3/ws/maven-changelog-plugin/target/surefire-reports> for the individual test results.
[ERROR] -> [Help 1]
[ERROR] Failed to execute goal org.apache.maven.plugins:maven-compiler-plugin:2.5.1:compile (default-compile) on project maven-compiler-plugin: Compilation failure: Compilation failure:
[ERROR] <https://builds.apache.org/job/maven-plugins-ITs-m3/ws/maven-compiler-plugin/src/main/java/org/apache/maven/plugin/AbstractCompilerMojo.java>:[41,37] cannot find symbol
[ERROR] symbol : class ReaderFactory
[ERROR] location: package org.apache.maven.shared.utils
[ERROR] <https://builds.apache.org/job/maven-plugins-ITs-m3/ws/maven-compiler-plugin/src/main/java/org/apache/maven/plugin/AbstractCompilerMojo.java>:[657,88] cannot find symbol
[ERROR] symbol : variable ReaderFactory
[ERROR] location: class org.apache.maven.plugin.AbstractCompilerMojo
[ERROR] -> [Help 1]
[ERROR] Failed to execute goal org.apache.maven.plugins:maven-invoker-plugin:1.6:verify (integration-test) on project maven-docck-plugin: 1 build failed. See console output above for details. -> [Help 1]
[ERROR] Failed to execute goal org.apache.maven.plugins:maven-surefire-plugin:2.12:test (default-test) on project maven-javadoc-plugin: There are test failures.
[ERROR]
[ERROR] Please refer to <https://builds.apache.org/job/maven-plugins-ITs-m3/ws/maven-javadoc-plugin/target/surefire-reports> for the individual test results.
[ERROR] -> [Help 1]
[ERROR]
[ERROR] To see the full stack trace of the errors, re-run Maven with the -e switch.
[ERROR] Re-run Maven using the -X switch to enable full debug logging.
[ERROR]
[ERROR] For more information about the errors and possible solutions, please read the following articles:
[ERROR] [Help 1] http://cwiki.apache.org/confluence/display/MAVEN/MojoFailureException
[ERROR]
[ERROR] After correcting the problems, you can resume the build with the command
[ERROR] mvn <goals> -rf :maven-changelog-plugin
Build step 'Invoke top-level Maven targets' marked build as failure
Recording test results
Build failed in Jenkins: maven-plugins-ITs-m3 #673
Posted by Apache Jenkins Server <je...@builds.apache.org>.
See <https://builds.apache.org/job/maven-plugins-ITs-m3/673/changes>
Changes:
[krosenvold] o Restores archiver to release version, updated plexus versions
------------------------------------------
[...truncated 9812 lines...]
Tests run: 1, Failures: 0, Errors: 0, Skipped: 0, Time elapsed: 0.037 sec
Running org.apache.maven.plugins.shade.mojo.ArtifactIdTest
Tests run: 2, Failures: 0, Errors: 0, Skipped: 0, Time elapsed: 0.004 sec
Running org.apache.maven.plugins.shade.DefaultShaderTest
Tests run: 4, Failures: 0, Errors: 0, Skipped: 0, Time elapsed: 0.835 sec
Running org.apache.maven.plugins.shade.resource.AppendingTransformerTest
Tests run: 1, Failures: 0, Errors: 0, Skipped: 0, Time elapsed: 0.002 sec
Running org.apache.maven.plugins.shade.resource.ApacheNoticeResourceTransformerTest
Tests run: 1, Failures: 0, Errors: 0, Skipped: 0, Time elapsed: 0.001 sec
Running org.apache.maven.plugins.shade.resource.XmlAppendingTransformerTest
Tests run: 1, Failures: 0, Errors: 0, Skipped: 0, Time elapsed: 0.005 sec
Running org.apache.maven.plugins.shade.resource.ApacheLicenseResourceTransformerTest
Tests run: 1, Failures: 0, Errors: 0, Skipped: 0, Time elapsed: 0 sec
Running org.apache.maven.plugins.shade.resource.ComponentsXmlResourceTransformerTest
Tests run: 1, Failures: 0, Errors: 0, Skipped: 0, Time elapsed: 0.064 sec
Running org.apache.maven.plugins.shade.filter.SimpleFilterTest
Tests run: 1, Failures: 0, Errors: 0, Skipped: 0, Time elapsed: 0 sec
Running org.apache.maven.plugins.shade.relocation.SimpleRelocatorParameterTest
Tests run: 2, Failures: 0, Errors: 0, Skipped: 0, Time elapsed: 0 sec
Running org.apache.maven.plugins.shade.relocation.SimpleRelocatorTest
Tests run: 7, Failures: 0, Errors: 0, Skipped: 0, Time elapsed: 0.003 sec
Results :
Tests run: 27, Failures: 0, Errors: 0, Skipped: 0
[INFO]
[INFO] --- maven-jar-plugin:2.4:jar (default-jar) @ maven-shade-plugin ---
[INFO] Building jar: <https://builds.apache.org/job/maven-plugins-ITs-m3/ws/maven-shade-plugin/target/maven-shade-plugin-2.0.1-SNAPSHOT.jar>
[INFO]
[INFO] --- maven-plugin-plugin:3.1:addPluginArtifactMetadata (default-addPluginArtifactMetadata) @ maven-shade-plugin ---
[INFO]
[INFO] --- maven-jar-plugin:2.4:test-jar (default) @ maven-shade-plugin ---
[INFO] Building jar: <https://builds.apache.org/job/maven-plugins-ITs-m3/ws/maven-shade-plugin/target/maven-shade-plugin-2.0.1-SNAPSHOT-tests.jar>
[INFO]
[INFO] --- maven-invoker-plugin:1.6:install (integration-test) @ maven-shade-plugin ---
[INFO] Installing <https://builds.apache.org/job/maven-plugins-ITs-m3/ws/maven-shade-plugin/pom.xml> to <https://builds.apache.org/job/maven-plugins-ITs-m3/ws/maven-shade-plugin/target/local-repo/org/apache/maven/plugins/maven-shade-plugin/2.0.1-SNAPSHOT/maven-shade-plugin-2.0.1-SNAPSHOT.pom>
[INFO] Installing <https://builds.apache.org/job/maven-plugins-ITs-m3/ws/maven-shade-plugin/target/maven-shade-plugin-2.0.1-SNAPSHOT.jar> to <https://builds.apache.org/job/maven-plugins-ITs-m3/ws/maven-shade-plugin/target/local-repo/org/apache/maven/plugins/maven-shade-plugin/2.0.1-SNAPSHOT/maven-shade-plugin-2.0.1-SNAPSHOT.jar>
[INFO] Installing <https://builds.apache.org/job/maven-plugins-ITs-m3/ws/maven-shade-plugin/target/maven-shade-plugin-2.0.1-SNAPSHOT-tests.jar> to <https://builds.apache.org/job/maven-plugins-ITs-m3/ws/maven-shade-plugin/target/local-repo/org/apache/maven/plugins/maven-shade-plugin/2.0.1-SNAPSHOT/maven-shade-plugin-2.0.1-SNAPSHOT-tests.jar>
[INFO]
[INFO] --- maven-invoker-plugin:1.6:integration-test (integration-test) @ maven-shade-plugin ---
[INFO] Building: xml-transformer-ignores-dtd/pom.xml
[INFO] run script <https://builds.apache.org/job/maven-plugins-ITs-m3/ws/maven-shade-plugin/target/it/xml-transformer-ignores-dtd/verify.bsh>
[INFO] ..SUCCESS (4.6 s)
[INFO] Building: attach-after-lifecycle-fork/pom.xml
[INFO] run script <https://builds.apache.org/job/maven-plugins-ITs-m3/ws/maven-shade-plugin/target/it/attach-after-lifecycle-fork/setup.bsh>
[INFO] run script <https://builds.apache.org/job/maven-plugins-ITs-m3/ws/maven-shade-plugin/target/it/attach-after-lifecycle-fork/verify.bsh>
[INFO] ..SUCCESS (3.7 s)
[INFO] Building: duplicate-classes-without-reloc/pom.xml
[INFO] ..SUCCESS (2.9 s)
[INFO] Building: filter-artifact-contents/pom.xml
[INFO] run script <https://builds.apache.org/job/maven-plugins-ITs-m3/ws/maven-shade-plugin/target/it/filter-artifact-contents/verify.bsh>
[INFO] ..SUCCESS (3.7 s)
[INFO] Building: component-descriptor-relocation/pom.xml
[INFO] ..SUCCESS (4.3 s)
[INFO] Building: finalNameShade/pom.xml
[INFO] run script <https://builds.apache.org/job/maven-plugins-ITs-m3/ws/maven-shade-plugin/target/it/finalNameShade/setup.bsh>
[INFO] run script <https://builds.apache.org/job/maven-plugins-ITs-m3/ws/maven-shade-plugin/target/it/finalNameShade/verify.bsh>
[INFO] ..SUCCESS (3.6 s)
[INFO] Building: manifest-retained/pom.xml
[INFO] run script <https://builds.apache.org/job/maven-plugins-ITs-m3/ws/maven-shade-plugin/target/it/manifest-retained/verify.bsh>
[INFO] ..SUCCESS (4.7 s)
[INFO] Building: manifest-transformed/pom.xml
[INFO] run script <https://builds.apache.org/job/maven-plugins-ITs-m3/ws/maven-shade-plugin/target/it/manifest-transformed/verify.bsh>
[INFO] ..SUCCESS (4.8 s)
[INFO] Building: services-resource-transformer/pom.xml
[INFO] run script <https://builds.apache.org/job/maven-plugins-ITs-m3/ws/maven-shade-plugin/target/it/services-resource-transformer/verify.bsh>
[INFO] ..SUCCESS (3.7 s)
[INFO] Building: pom-packaging/pom.xml
[INFO] run script <https://builds.apache.org/job/maven-plugins-ITs-m3/ws/maven-shade-plugin/target/it/pom-packaging/verify.bsh>
[INFO] ..SUCCESS (2.5 s)
[INFO] Building: non-runtime-scope-excluded/pom.xml
[INFO] run script <https://builds.apache.org/job/maven-plugins-ITs-m3/ws/maven-shade-plugin/target/it/non-runtime-scope-excluded/verify.bsh>
[INFO] ..SUCCESS (3.7 s)
[INFO] Building: reloc-anno/pom.xml
[INFO] ..SUCCESS (3.5 s)
[INFO] Building: mini-jar-respect-includes/pom.xml
[INFO] run script <https://builds.apache.org/job/maven-plugins-ITs-m3/ws/maven-shade-plugin/target/it/mini-jar-respect-includes/verify.bsh>
[INFO] ..SUCCESS (4.4 s)
[INFO] Building: empty-relocation-pattern/pom.xml
[INFO] ..SUCCESS (3.4 s)
[INFO] Building: finalNameBuild/pom.xml
[INFO] run script <https://builds.apache.org/job/maven-plugins-ITs-m3/ws/maven-shade-plugin/target/it/finalNameBuild/setup.bsh>
[INFO] run script <https://builds.apache.org/job/maven-plugins-ITs-m3/ws/maven-shade-plugin/target/it/finalNameBuild/verify.bsh>
[INFO] ..SUCCESS (3.7 s)
[INFO] Building: attached-artifact-type/pom.xml
[INFO] ..SUCCESS (3.8 s)
[INFO] Building: empty-relocation-shaded-pattern/pom.xml
[INFO] ..SUCCESS (3.8 s)
[INFO] Building: reloc-includes-excludes/pom.xml
[INFO] run script <https://builds.apache.org/job/maven-plugins-ITs-m3/ws/maven-shade-plugin/target/it/reloc-includes-excludes/verify.bsh>
[INFO] ..SUCCESS (4.2 s)
[INFO] Building: rerun-with-reloc/pom.xml
[INFO] ..SUCCESS (5.0 s)
[INFO] Building: implicit-inclusion-of-project-artifact/pom.xml
[INFO] run script <https://builds.apache.org/job/maven-plugins-ITs-m3/ws/maven-shade-plugin/target/it/implicit-inclusion-of-project-artifact/verify.bsh>
[INFO] ..SUCCESS (3.8 s)
[INFO] Building: duplicate-classes-with-reloc/pom.xml
[INFO] ..SUCCESS (2.9 s)
[INFO] Building: dep-reduced-pom/pom.xml
[INFO] run script <https://builds.apache.org/job/maven-plugins-ITs-m3/ws/maven-shade-plugin/target/it/dep-reduced-pom/verify.groovy>
[INFO] ..SUCCESS (3.7 s)
[INFO] Building: rerun-without-reloc/pom.xml
[INFO] ..SUCCESS (3.6 s)
[INFO] Building: finalNameBuild-attached/pom.xml
[INFO] run script <https://builds.apache.org/job/maven-plugins-ITs-m3/ws/maven-shade-plugin/target/it/finalNameBuild-attached/setup.bsh>
[INFO] run script <https://builds.apache.org/job/maven-plugins-ITs-m3/ws/maven-shade-plugin/target/it/finalNameBuild-attached/verify.bsh>
[INFO] ..SUCCESS (3.4 s)
[INFO] Building: finalNameShade-attached/pom.xml
[INFO] run script <https://builds.apache.org/job/maven-plugins-ITs-m3/ws/maven-shade-plugin/target/it/finalNameShade-attached/setup.bsh>
[INFO] run script <https://builds.apache.org/job/maven-plugins-ITs-m3/ws/maven-shade-plugin/target/it/finalNameShade-attached/verify.bsh>
[INFO] ..SUCCESS (3.7 s)
[INFO] Building: shadePomDependency/pom.xml
[INFO] ..SUCCESS (4.5 s)
[INFO] Building: artifact-includes-excludes/pom.xml
[INFO] run script <https://builds.apache.org/job/maven-plugins-ITs-m3/ws/maven-shade-plugin/target/it/artifact-includes-excludes/verify.bsh>
[INFO] ..SUCCESS (3.8 s)
[INFO] Building: reloc-enum-ref-from-anno/pom.xml
[INFO] ..SUCCESS (3.7 s)
[INFO] Building: mini-jar-package-info/pom.xml
[INFO] run script <https://builds.apache.org/job/maven-plugins-ITs-m3/ws/maven-shade-plugin/target/it/mini-jar-package-info/verify.bsh>
[INFO] ..SUCCESS (4.4 s)
[INFO] Building: project-with-reactors-included/pom.xml
[INFO] run script <https://builds.apache.org/job/maven-plugins-ITs-m3/ws/maven-shade-plugin/target/it/project-with-reactors-included/verify.bsh>
[INFO] ..SUCCESS (5.4 s)
[INFO] Building: dep-reduced-pom-with-local-parent/pom.xml
[INFO] ..SUCCESS (2.7 s)
[INFO] Building: mini-jar/pom.xml
[INFO] run script <https://builds.apache.org/job/maven-plugins-ITs-m3/ws/maven-shade-plugin/target/it/mini-jar/verify.bsh>
[INFO] ..SUCCESS (4.0 s)
[INFO] Building: dep-reduced-pom-unique/pom.xml
[INFO] run script <https://builds.apache.org/job/maven-plugins-ITs-m3/ws/maven-shade-plugin/target/it/dep-reduced-pom-unique/verify.groovy>
[INFO] ..SUCCESS (4.0 s)
[INFO] Building: mini-jar-malformed-dependencies/pom.xml
[INFO] ..SUCCESS (6.8 s)
[INFO] Building: reloc-abs-resource-path/pom.xml
[INFO] ..SUCCESS (6.2 s)
[INFO] Building: MSHADE-105/pom.xml
[INFO] run script <https://builds.apache.org/job/maven-plugins-ITs-m3/ws/maven-shade-plugin/target/it/MSHADE-105/verify.bsh>
[INFO] ..SUCCESS (7.8 s)
[INFO] Building: mshade-123/pom.xml
[INFO] ..SUCCESS (5.6 s)
[INFO] Building: reloc-class-from-string-pool/pom.xml
[INFO] ..SUCCESS (3.3 s)
[INFO] Building: users-shader-impl/pom.xml
[INFO] run script <https://builds.apache.org/job/maven-plugins-ITs-m3/ws/maven-shade-plugin/target/it/users-shader-impl/verify.groovy>
[INFO] ..SUCCESS (4.2 s)
[INFO] Building: empty-apache-notice-transform/pom.xml
[INFO] ..SUCCESS (4.3 s)
[INFO] Building: dep-reduced-pom-relocated-result/pom.xml
[INFO] ..SUCCESS (2.7 s)
[INFO]
[INFO] --- maven-invoker-plugin:1.6:verify (integration-test) @ maven-shade-plugin ---
[INFO] -------------------------------------------------
[INFO] Build Summary:
[INFO] Passed: 41, Failed: 0, Errors: 0, Skipped: 0
[INFO] -------------------------------------------------
[INFO]
[INFO] --- maven-install-plugin:2.3.1:install (default-install) @ maven-shade-plugin ---
[INFO] Installing <https://builds.apache.org/job/maven-plugins-ITs-m3/ws/maven-shade-plugin/target/maven-shade-plugin-2.0.1-SNAPSHOT.jar> to /home/jenkins/.m2/repository/org/apache/maven/plugins/maven-shade-plugin/2.0.1-SNAPSHOT/maven-shade-plugin-2.0.1-SNAPSHOT.jar
[INFO] Installing <https://builds.apache.org/job/maven-plugins-ITs-m3/ws/maven-shade-plugin/pom.xml> to /home/jenkins/.m2/repository/org/apache/maven/plugins/maven-shade-plugin/2.0.1-SNAPSHOT/maven-shade-plugin-2.0.1-SNAPSHOT.pom
[INFO] Installing <https://builds.apache.org/job/maven-plugins-ITs-m3/ws/maven-shade-plugin/target/maven-shade-plugin-2.0.1-SNAPSHOT-tests.jar> to /home/jenkins/.m2/repository/org/apache/maven/plugins/maven-shade-plugin/2.0.1-SNAPSHOT/maven-shade-plugin-2.0.1-SNAPSHOT-tests.jar
[INFO]
[INFO] ------------------------------------------------------------------------
[INFO] Building Maven Plugins Aggregator 1-SNAPSHOT
[INFO] ------------------------------------------------------------------------
[INFO]
[INFO] --- maven-clean-plugin:2.4.1:clean (default-clean) @ maven-plugins-aggregator ---
[INFO] Deleting <https://builds.apache.org/job/maven-plugins-ITs-m3/ws/target>
[INFO]
[INFO] --- maven-remote-resources-plugin:1.1:process (default) @ maven-plugins-aggregator ---
[INFO]
[INFO] --- maven-install-plugin:2.3.1:install (default-install) @ maven-plugins-aggregator ---
[INFO] Installing <https://builds.apache.org/job/maven-plugins-ITs-m3/ws/pom.xml> to /home/jenkins/.m2/repository/org/apache/maven/plugins/maven-plugins-aggregator/1-SNAPSHOT/maven-plugins-aggregator-1-SNAPSHOT.pom
[INFO] ------------------------------------------------------------------------
[INFO] Reactor Summary:
[INFO]
[INFO] Maven Plugins ..................................... SUCCESS [3.087s]
[INFO] Maven ACR Plugin .................................. SUCCESS [22.267s]
[INFO] Maven Ant Plugin .................................. SUCCESS [1:09.627s]
[INFO] Maven AntRun Plugin ............................... SUCCESS [56.748s]
[INFO] Maven Eclipse Plugin .............................. SUCCESS [6:52.358s]
[INFO] Maven Assembly Plugin ............................. SUCCESS [11:12.555s]
[INFO] Maven Changelog Plugin ............................ FAILURE [7.028s]
[INFO] Maven Changes Report Plugin ....................... SUCCESS [59.791s]
[INFO] Maven Checkstyle Plugin ........................... SUCCESS [1:42.253s]
[INFO] Maven Clean Plugin ................................ SUCCESS [20.377s]
[INFO] Maven Compiler Plugin ............................. SUCCESS [56.654s]
[INFO] Maven Dependency Plugin ........................... SUCCESS [2:14.640s]
[INFO] Maven Deploy Plugin ............................... SUCCESS [1:07.913s]
[INFO] Maven DOAP Plugin ................................. SUCCESS [17.996s]
[INFO] Maven Documentation Checker Plugin ................ SUCCESS [5.990s]
[INFO] Maven EAR Plugin .................................. SUCCESS [3:54.799s]
[INFO] Maven EJB Plugin .................................. SUCCESS [28.341s]
[INFO] Maven GPG Plugin .................................. SUCCESS [10.459s]
[INFO] Maven Help Plugin ................................. SUCCESS [36.099s]
[INFO] Maven IDEA Plugin ................................. SUCCESS [7.890s]
[INFO] Maven Install Plugin .............................. SUCCESS [40.966s]
[INFO] Maven JAR Plugin .................................. SUCCESS [1:10.322s]
[INFO] Maven Jarsigner Plugin ............................ SUCCESS [25.879s]
[INFO] Maven Javadoc Plugin .............................. FAILURE [1:24.632s]
[INFO] Maven Linkcheck Plugin ............................ SUCCESS [2.594s]
[INFO] Maven One Plugin .................................. SUCCESS [2.086s]
[INFO] Maven Patch Plugin ................................ SUCCESS [12.848s]
[INFO] Maven PDF Plugin .................................. SUCCESS [33.566s]
[INFO] Maven PMD Plugin .................................. SUCCESS [44.345s]
[INFO] Maven RAR Plugin .................................. SUCCESS [10.736s]
[INFO] Maven Reactor Plugin .............................. SUCCESS [2.384s]
[INFO] Maven Repository Plugin ........................... SUCCESS [39.616s]
[INFO] Maven Resources Plugin ............................ SUCCESS [56.041s]
[INFO] Maven Site Plugin 3 ............................... SUCCESS [6:32.146s]
[INFO] Maven Source Plugin ............................... SUCCESS [45.740s]
[INFO] Maven Stage Plugin ................................ SUCCESS [2.837s]
[INFO] Maven Toolchains Plugin ........................... SUCCESS [1.968s]
[INFO] Maven Verifier Plugin ............................. SUCCESS [16.036s]
[INFO] Maven WAR Plugin .................................. SUCCESS [1:17.757s]
[INFO] SCM Publish Maven Plugin .......................... SUCCESS [1:05.446s]
[INFO] Maven Invoker Plugin .............................. SUCCESS [4:04.224s]
[INFO] Maven Project Info Reports Plugin ................. SUCCESS [2:24.699s]
[INFO] Maven Remote Resources Plugin ..................... SUCCESS [57.003s]
[INFO] Maven Shade Plugin ................................ SUCCESS [3:03.062s]
[INFO] Maven Plugins Aggregator .......................... SUCCESS [0.053s]
[INFO] ------------------------------------------------------------------------
[INFO] BUILD FAILURE
[INFO] ------------------------------------------------------------------------
[INFO] Total time: 1:01:24.995s
[INFO] Finished at: Wed Sep 26 08:31:20 UTC 2012
[INFO] Final Memory: 82M/312M
[INFO] ------------------------------------------------------------------------
[WARNING] The requested profile "apache.snapshots" could not be activated because it does not exist.
[ERROR] Failed to execute goal org.apache.maven.plugins:maven-surefire-plugin:2.12:test (default-test) on project maven-changelog-plugin: There are test failures.
[ERROR]
[ERROR] Please refer to <https://builds.apache.org/job/maven-plugins-ITs-m3/ws/maven-changelog-plugin/target/surefire-reports> for the individual test results.
[ERROR] -> [Help 1]
[ERROR] Failed to execute goal org.apache.maven.plugins:maven-surefire-plugin:2.12:test (default-test) on project maven-javadoc-plugin: There are test failures.
[ERROR]
[ERROR] Please refer to <https://builds.apache.org/job/maven-plugins-ITs-m3/ws/maven-javadoc-plugin/target/surefire-reports> for the individual test results.
[ERROR] -> [Help 1]
[ERROR]
[ERROR] To see the full stack trace of the errors, re-run Maven with the -e switch.
[ERROR] Re-run Maven using the -X switch to enable full debug logging.
[ERROR]
[ERROR] For more information about the errors and possible solutions, please read the following articles:
[ERROR] [Help 1] http://cwiki.apache.org/confluence/display/MAVEN/MojoFailureException
[ERROR]
[ERROR] After correcting the problems, you can resume the build with the command
[ERROR] mvn <goals> -rf :maven-changelog-plugin
Build step 'Invoke top-level Maven targets' marked build as failure
Recording test results
Build failed in Jenkins: maven-plugins-ITs-m3 #672
Posted by Apache Jenkins Server <je...@builds.apache.org>.
See <https://builds.apache.org/job/maven-plugins-ITs-m3/672/changes>
Changes:
[dennisl] [MWAR-275] An incomplete fix for the NPE bugs in WebappStructure.java
------------------------------------------
[...truncated 9947 lines...]
Tests run: 1, Failures: 0, Errors: 0, Skipped: 0, Time elapsed: 0.006 sec
Running org.apache.maven.plugins.shade.resource.AppendingTransformerTest
Tests run: 1, Failures: 0, Errors: 0, Skipped: 0, Time elapsed: 0.001 sec
Running org.apache.maven.plugins.shade.resource.ApacheNoticeResourceTransformerTest
Tests run: 1, Failures: 0, Errors: 0, Skipped: 0, Time elapsed: 0.002 sec
Running org.apache.maven.plugins.shade.resource.ComponentsXmlResourceTransformerTest
Tests run: 1, Failures: 0, Errors: 0, Skipped: 0, Time elapsed: 0.062 sec
Running org.apache.maven.plugins.shade.mojo.ShadeMojoTest
Tests run: 4, Failures: 0, Errors: 0, Skipped: 0, Time elapsed: 1.576 sec
Running org.apache.maven.plugins.shade.mojo.RelativizePathTest
Tests run: 1, Failures: 0, Errors: 0, Skipped: 0, Time elapsed: 0.047 sec
Running org.apache.maven.plugins.shade.mojo.ArtifactSelectorTest
Tests run: 1, Failures: 0, Errors: 0, Skipped: 0, Time elapsed: 0.002 sec
Running org.apache.maven.plugins.shade.mojo.ArtifactIdTest
Tests run: 2, Failures: 0, Errors: 0, Skipped: 0, Time elapsed: 0.002 sec
Running org.apache.maven.plugins.shade.filter.SimpleFilterTest
Tests run: 1, Failures: 0, Errors: 0, Skipped: 0, Time elapsed: 0 sec
Running org.apache.maven.plugins.shade.relocation.SimpleRelocatorTest
Tests run: 7, Failures: 0, Errors: 0, Skipped: 0, Time elapsed: 0.003 sec
Running org.apache.maven.plugins.shade.relocation.SimpleRelocatorParameterTest
Tests run: 2, Failures: 0, Errors: 0, Skipped: 0, Time elapsed: 0 sec
Results :
Tests run: 27, Failures: 0, Errors: 0, Skipped: 0
[INFO]
[INFO] --- maven-jar-plugin:2.4:jar (default-jar) @ maven-shade-plugin ---
[INFO] Building jar: <https://builds.apache.org/job/maven-plugins-ITs-m3/ws/maven-shade-plugin/target/maven-shade-plugin-2.0.1-SNAPSHOT.jar>
[INFO]
[INFO] --- maven-plugin-plugin:3.1:addPluginArtifactMetadata (default-addPluginArtifactMetadata) @ maven-shade-plugin ---
[INFO]
[INFO] --- maven-jar-plugin:2.4:test-jar (default) @ maven-shade-plugin ---
[INFO] Building jar: <https://builds.apache.org/job/maven-plugins-ITs-m3/ws/maven-shade-plugin/target/maven-shade-plugin-2.0.1-SNAPSHOT-tests.jar>
[INFO]
[INFO] --- maven-invoker-plugin:1.6:install (integration-test) @ maven-shade-plugin ---
[INFO] Installing <https://builds.apache.org/job/maven-plugins-ITs-m3/ws/maven-shade-plugin/pom.xml> to <https://builds.apache.org/job/maven-plugins-ITs-m3/ws/maven-shade-plugin/target/local-repo/org/apache/maven/plugins/maven-shade-plugin/2.0.1-SNAPSHOT/maven-shade-plugin-2.0.1-SNAPSHOT.pom>
[INFO] Installing <https://builds.apache.org/job/maven-plugins-ITs-m3/ws/maven-shade-plugin/target/maven-shade-plugin-2.0.1-SNAPSHOT.jar> to <https://builds.apache.org/job/maven-plugins-ITs-m3/ws/maven-shade-plugin/target/local-repo/org/apache/maven/plugins/maven-shade-plugin/2.0.1-SNAPSHOT/maven-shade-plugin-2.0.1-SNAPSHOT.jar>
[INFO] Installing <https://builds.apache.org/job/maven-plugins-ITs-m3/ws/maven-shade-plugin/target/maven-shade-plugin-2.0.1-SNAPSHOT-tests.jar> to <https://builds.apache.org/job/maven-plugins-ITs-m3/ws/maven-shade-plugin/target/local-repo/org/apache/maven/plugins/maven-shade-plugin/2.0.1-SNAPSHOT/maven-shade-plugin-2.0.1-SNAPSHOT-tests.jar>
[INFO]
[INFO] --- maven-invoker-plugin:1.6:integration-test (integration-test) @ maven-shade-plugin ---
[INFO] Building: artifact-includes-excludes/pom.xml
[INFO] run script <https://builds.apache.org/job/maven-plugins-ITs-m3/ws/maven-shade-plugin/target/it/artifact-includes-excludes/verify.bsh>
[INFO] ..SUCCESS (6.1 s)
[INFO] Building: dep-reduced-pom-with-local-parent/pom.xml
[INFO] ..SUCCESS (3.7 s)
[INFO] Building: implicit-inclusion-of-project-artifact/pom.xml
[INFO] run script <https://builds.apache.org/job/maven-plugins-ITs-m3/ws/maven-shade-plugin/target/it/implicit-inclusion-of-project-artifact/verify.bsh>
[INFO] ..SUCCESS (3.8 s)
[INFO] Building: reloc-class-from-string-pool/pom.xml
[INFO] ..SUCCESS (3.3 s)
[INFO] Building: dep-reduced-pom-unique/pom.xml
[INFO] run script <https://builds.apache.org/job/maven-plugins-ITs-m3/ws/maven-shade-plugin/target/it/dep-reduced-pom-unique/verify.groovy>
[INFO] ..SUCCESS (3.9 s)
[INFO] Building: non-runtime-scope-excluded/pom.xml
[INFO] run script <https://builds.apache.org/job/maven-plugins-ITs-m3/ws/maven-shade-plugin/target/it/non-runtime-scope-excluded/verify.bsh>
[INFO] ..SUCCESS (3.6 s)
[INFO] Building: manifest-transformed/pom.xml
[INFO] run script <https://builds.apache.org/job/maven-plugins-ITs-m3/ws/maven-shade-plugin/target/it/manifest-transformed/verify.bsh>
[INFO] ..SUCCESS (4.9 s)
[INFO] Building: duplicate-classes-without-reloc/pom.xml
[INFO] ..SUCCESS (2.8 s)
[INFO] Building: mini-jar-respect-includes/pom.xml
[INFO] run script <https://builds.apache.org/job/maven-plugins-ITs-m3/ws/maven-shade-plugin/target/it/mini-jar-respect-includes/verify.bsh>
[INFO] ..SUCCESS (4.7 s)
[INFO] Building: pom-packaging/pom.xml
[INFO] run script <https://builds.apache.org/job/maven-plugins-ITs-m3/ws/maven-shade-plugin/target/it/pom-packaging/verify.bsh>
[INFO] ..SUCCESS (2.4 s)
[INFO] Building: xml-transformer-ignores-dtd/pom.xml
[INFO] run script <https://builds.apache.org/job/maven-plugins-ITs-m3/ws/maven-shade-plugin/target/it/xml-transformer-ignores-dtd/verify.bsh>
[INFO] ..SUCCESS (3.4 s)
[INFO] Building: empty-relocation-shaded-pattern/pom.xml
[INFO] ..SUCCESS (3.4 s)
[INFO] Building: mshade-123/pom.xml
[INFO] ..SUCCESS (5.7 s)
[INFO] Building: manifest-retained/pom.xml
[INFO] run script <https://builds.apache.org/job/maven-plugins-ITs-m3/ws/maven-shade-plugin/target/it/manifest-retained/verify.bsh>
[INFO] ..SUCCESS (4.4 s)
[INFO] Building: finalNameBuild/pom.xml
[INFO] run script <https://builds.apache.org/job/maven-plugins-ITs-m3/ws/maven-shade-plugin/target/it/finalNameBuild/setup.bsh>
[INFO] run script <https://builds.apache.org/job/maven-plugins-ITs-m3/ws/maven-shade-plugin/target/it/finalNameBuild/verify.bsh>
[INFO] ..SUCCESS (3.5 s)
[INFO] Building: finalNameShade/pom.xml
[INFO] run script <https://builds.apache.org/job/maven-plugins-ITs-m3/ws/maven-shade-plugin/target/it/finalNameShade/setup.bsh>
[INFO] run script <https://builds.apache.org/job/maven-plugins-ITs-m3/ws/maven-shade-plugin/target/it/finalNameShade/verify.bsh>
[INFO] ..SUCCESS (3.5 s)
[INFO] Building: reloc-abs-resource-path/pom.xml
[INFO] ..SUCCESS (5.4 s)
[INFO] Building: empty-apache-notice-transform/pom.xml
[INFO] ..SUCCESS (4.1 s)
[INFO] Building: services-resource-transformer/pom.xml
[INFO] run script <https://builds.apache.org/job/maven-plugins-ITs-m3/ws/maven-shade-plugin/target/it/services-resource-transformer/verify.bsh>
[INFO] ..SUCCESS (3.5 s)
[INFO] Building: mini-jar-package-info/pom.xml
[INFO] run script <https://builds.apache.org/job/maven-plugins-ITs-m3/ws/maven-shade-plugin/target/it/mini-jar-package-info/verify.bsh>
[INFO] ..SUCCESS (4.4 s)
[INFO] Building: rerun-without-reloc/pom.xml
[INFO] ..SUCCESS (3.6 s)
[INFO] Building: shadePomDependency/pom.xml
[INFO] ..SUCCESS (4.7 s)
[INFO] Building: reloc-includes-excludes/pom.xml
[INFO] run script <https://builds.apache.org/job/maven-plugins-ITs-m3/ws/maven-shade-plugin/target/it/reloc-includes-excludes/verify.bsh>
[INFO] ..SUCCESS (4.0 s)
[INFO] Building: finalNameShade-attached/pom.xml
[INFO] run script <https://builds.apache.org/job/maven-plugins-ITs-m3/ws/maven-shade-plugin/target/it/finalNameShade-attached/setup.bsh>
[INFO] run script <https://builds.apache.org/job/maven-plugins-ITs-m3/ws/maven-shade-plugin/target/it/finalNameShade-attached/verify.bsh>
[INFO] ..SUCCESS (3.5 s)
[INFO] Building: component-descriptor-relocation/pom.xml
[INFO] ..SUCCESS (4.1 s)
[INFO] Building: users-shader-impl/pom.xml
[INFO] run script <https://builds.apache.org/job/maven-plugins-ITs-m3/ws/maven-shade-plugin/target/it/users-shader-impl/verify.groovy>
[INFO] ..SUCCESS (4.2 s)
[INFO] Building: mini-jar-malformed-dependencies/pom.xml
[INFO] ..SUCCESS (6.9 s)
[INFO] Building: finalNameBuild-attached/pom.xml
[INFO] run script <https://builds.apache.org/job/maven-plugins-ITs-m3/ws/maven-shade-plugin/target/it/finalNameBuild-attached/setup.bsh>
[INFO] run script <https://builds.apache.org/job/maven-plugins-ITs-m3/ws/maven-shade-plugin/target/it/finalNameBuild-attached/verify.bsh>
[INFO] ..SUCCESS (3.5 s)
[INFO] Building: attach-after-lifecycle-fork/pom.xml
[INFO] run script <https://builds.apache.org/job/maven-plugins-ITs-m3/ws/maven-shade-plugin/target/it/attach-after-lifecycle-fork/setup.bsh>
[INFO] run script <https://builds.apache.org/job/maven-plugins-ITs-m3/ws/maven-shade-plugin/target/it/attach-after-lifecycle-fork/verify.bsh>
[INFO] ..SUCCESS (2.9 s)
[INFO] Building: empty-relocation-pattern/pom.xml
[INFO] ..SUCCESS (3.4 s)
[INFO] Building: mini-jar/pom.xml
[INFO] run script <https://builds.apache.org/job/maven-plugins-ITs-m3/ws/maven-shade-plugin/target/it/mini-jar/verify.bsh>
[INFO] ..SUCCESS (4.0 s)
[INFO] Building: reloc-anno/pom.xml
[INFO] ..SUCCESS (3.3 s)
[INFO] Building: MSHADE-105/pom.xml
[INFO] run script <https://builds.apache.org/job/maven-plugins-ITs-m3/ws/maven-shade-plugin/target/it/MSHADE-105/verify.bsh>
[INFO] ..SUCCESS (7.8 s)
[INFO] Building: dep-reduced-pom-relocated-result/pom.xml
[INFO] ..SUCCESS (2.7 s)
[INFO] Building: attached-artifact-type/pom.xml
[INFO] ..SUCCESS (3.3 s)
[INFO] Building: dep-reduced-pom/pom.xml
[INFO] run script <https://builds.apache.org/job/maven-plugins-ITs-m3/ws/maven-shade-plugin/target/it/dep-reduced-pom/verify.groovy>
[INFO] ..SUCCESS (3.5 s)
[INFO] Building: rerun-with-reloc/pom.xml
[INFO] ..SUCCESS (5.1 s)
[INFO] Building: duplicate-classes-with-reloc/pom.xml
[INFO] ..SUCCESS (2.7 s)
[INFO] Building: filter-artifact-contents/pom.xml
[INFO] run script <https://builds.apache.org/job/maven-plugins-ITs-m3/ws/maven-shade-plugin/target/it/filter-artifact-contents/verify.bsh>
[INFO] ..SUCCESS (3.6 s)
[INFO] Building: project-with-reactors-included/pom.xml
[INFO] run script <https://builds.apache.org/job/maven-plugins-ITs-m3/ws/maven-shade-plugin/target/it/project-with-reactors-included/verify.bsh>
[INFO] ..SUCCESS (5.2 s)
[INFO] Building: reloc-enum-ref-from-anno/pom.xml
[INFO] ..SUCCESS (3.3 s)
[INFO]
[INFO] --- maven-invoker-plugin:1.6:verify (integration-test) @ maven-shade-plugin ---
[INFO] -------------------------------------------------
[INFO] Build Summary:
[INFO] Passed: 41, Failed: 0, Errors: 0, Skipped: 0
[INFO] -------------------------------------------------
[INFO]
[INFO] --- maven-install-plugin:2.3.1:install (default-install) @ maven-shade-plugin ---
[INFO] Installing <https://builds.apache.org/job/maven-plugins-ITs-m3/ws/maven-shade-plugin/target/maven-shade-plugin-2.0.1-SNAPSHOT.jar> to /home/jenkins/.m2/repository/org/apache/maven/plugins/maven-shade-plugin/2.0.1-SNAPSHOT/maven-shade-plugin-2.0.1-SNAPSHOT.jar
[INFO] Installing <https://builds.apache.org/job/maven-plugins-ITs-m3/ws/maven-shade-plugin/pom.xml> to /home/jenkins/.m2/repository/org/apache/maven/plugins/maven-shade-plugin/2.0.1-SNAPSHOT/maven-shade-plugin-2.0.1-SNAPSHOT.pom
[INFO] Installing <https://builds.apache.org/job/maven-plugins-ITs-m3/ws/maven-shade-plugin/target/maven-shade-plugin-2.0.1-SNAPSHOT-tests.jar> to /home/jenkins/.m2/repository/org/apache/maven/plugins/maven-shade-plugin/2.0.1-SNAPSHOT/maven-shade-plugin-2.0.1-SNAPSHOT-tests.jar
[INFO]
[INFO] ------------------------------------------------------------------------
[INFO] Building Maven Plugins Aggregator 1-SNAPSHOT
[INFO] ------------------------------------------------------------------------
[INFO]
[INFO] --- maven-clean-plugin:2.4.1:clean (default-clean) @ maven-plugins-aggregator ---
[INFO] Deleting <https://builds.apache.org/job/maven-plugins-ITs-m3/ws/target>
[INFO]
[INFO] --- maven-remote-resources-plugin:1.1:process (default) @ maven-plugins-aggregator ---
[INFO]
[INFO] --- maven-install-plugin:2.3.1:install (default-install) @ maven-plugins-aggregator ---
[INFO] Installing <https://builds.apache.org/job/maven-plugins-ITs-m3/ws/pom.xml> to /home/jenkins/.m2/repository/org/apache/maven/plugins/maven-plugins-aggregator/1-SNAPSHOT/maven-plugins-aggregator-1-SNAPSHOT.pom
[INFO] ------------------------------------------------------------------------
[INFO] Reactor Summary:
[INFO]
[INFO] Maven Plugins ..................................... SUCCESS [6.248s]
[INFO] Maven ACR Plugin .................................. SUCCESS [31.309s]
[INFO] Maven Ant Plugin .................................. SUCCESS [1:17.343s]
[INFO] Maven AntRun Plugin ............................... SUCCESS [59.412s]
[INFO] Maven Eclipse Plugin .............................. SUCCESS [6:51.255s]
[INFO] Maven Assembly Plugin ............................. SUCCESS [11:21.466s]
[INFO] Maven Changelog Plugin ............................ FAILURE [14.102s]
[INFO] Maven Changes Report Plugin ....................... SUCCESS [1:06.796s]
[INFO] Maven Checkstyle Plugin ........................... SUCCESS [1:43.369s]
[INFO] Maven Clean Plugin ................................ SUCCESS [20.703s]
[INFO] Maven Compiler Plugin ............................. SUCCESS [58.568s]
[INFO] Maven Dependency Plugin ........................... SUCCESS [2:12.669s]
[INFO] Maven Deploy Plugin ............................... SUCCESS [1:06.430s]
[INFO] Maven DOAP Plugin ................................. SUCCESS [19.463s]
[INFO] Maven Documentation Checker Plugin ................ SUCCESS [7.082s]
[INFO] Maven EAR Plugin .................................. SUCCESS [3:54.273s]
[INFO] Maven EJB Plugin .................................. SUCCESS [27.338s]
[INFO] Maven GPG Plugin .................................. SUCCESS [10.750s]
[INFO] Maven Help Plugin ................................. SUCCESS [34.902s]
[INFO] Maven IDEA Plugin ................................. SUCCESS [8.478s]
[INFO] Maven Install Plugin .............................. SUCCESS [41.842s]
[INFO] Maven JAR Plugin .................................. SUCCESS [1:11.712s]
[INFO] Maven Jarsigner Plugin ............................ SUCCESS [25.286s]
[INFO] Maven Javadoc Plugin .............................. FAILURE [1:39.083s]
[INFO] Maven Linkcheck Plugin ............................ SUCCESS [2.931s]
[INFO] Maven One Plugin .................................. SUCCESS [2.336s]
[INFO] Maven Patch Plugin ................................ SUCCESS [13.654s]
[INFO] Maven PDF Plugin .................................. SUCCESS [2:04.939s]
[INFO] Maven PMD Plugin .................................. SUCCESS [49.412s]
[INFO] Maven RAR Plugin .................................. SUCCESS [13.266s]
[INFO] Maven Reactor Plugin .............................. SUCCESS [2.664s]
[INFO] Maven Repository Plugin ........................... SUCCESS [46.215s]
[INFO] Maven Resources Plugin ............................ SUCCESS [59.114s]
[INFO] Maven Site Plugin 3 ............................... SUCCESS [6:48.942s]
[INFO] Maven Source Plugin ............................... SUCCESS [51.520s]
[INFO] Maven Stage Plugin ................................ SUCCESS [3.002s]
[INFO] Maven Toolchains Plugin ........................... SUCCESS [2.048s]
[INFO] Maven Verifier Plugin ............................. SUCCESS [16.512s]
[INFO] Maven WAR Plugin .................................. SUCCESS [1:41.118s]
[INFO] SCM Publish Maven Plugin .......................... SUCCESS [1:18.669s]
[INFO] Maven Invoker Plugin .............................. SUCCESS [4:14.789s]
[INFO] Maven Project Info Reports Plugin ................. SUCCESS [2:33.896s]
[INFO] Maven Remote Resources Plugin ..................... SUCCESS [1:08.971s]
[INFO] Maven Shade Plugin ................................ SUCCESS [3:08.976s]
[INFO] Maven Plugins Aggregator .......................... SUCCESS [0.101s]
[INFO] ------------------------------------------------------------------------
[INFO] BUILD FAILURE
[INFO] ------------------------------------------------------------------------
[INFO] Total time: 1:05:54.435s
[INFO] Finished at: Wed Sep 26 00:17:00 UTC 2012
[INFO] Final Memory: 98M/415M
[INFO] ------------------------------------------------------------------------
[WARNING] The requested profile "apache.snapshots" could not be activated because it does not exist.
[ERROR] Failed to execute goal org.apache.maven.plugins:maven-surefire-plugin:2.12:test (default-test) on project maven-changelog-plugin: There are test failures.
[ERROR]
[ERROR] Please refer to <https://builds.apache.org/job/maven-plugins-ITs-m3/ws/maven-changelog-plugin/target/surefire-reports> for the individual test results.
[ERROR] -> [Help 1]
[ERROR] Failed to execute goal org.apache.maven.plugins:maven-surefire-plugin:2.12:test (default-test) on project maven-javadoc-plugin: There are test failures.
[ERROR]
[ERROR] Please refer to <https://builds.apache.org/job/maven-plugins-ITs-m3/ws/maven-javadoc-plugin/target/surefire-reports> for the individual test results.
[ERROR] -> [Help 1]
[ERROR]
[ERROR] To see the full stack trace of the errors, re-run Maven with the -e switch.
[ERROR] Re-run Maven using the -X switch to enable full debug logging.
[ERROR]
[ERROR] For more information about the errors and possible solutions, please read the following articles:
[ERROR] [Help 1] http://cwiki.apache.org/confluence/display/MAVEN/MojoFailureException
[ERROR]
[ERROR] After correcting the problems, you can resume the build with the command
[ERROR] mvn <goals> -rf :maven-changelog-plugin
Build step 'Invoke top-level Maven targets' marked build as failure
Recording test results
Build failed in Jenkins: maven-plugins-ITs-m3 #671
Posted by Apache Jenkins Server <je...@builds.apache.org>.
See <https://builds.apache.org/job/maven-plugins-ITs-m3/671/changes>
Changes:
[dennisl] [MWAR-241] Overlay and an empty classifier
[dennisl] [MWAR-246] NullPointerException Processing Web Resources
Submitted by: Michael Glauche
Reviewed by: Dennis Lundberg
[dennisl] [MWAR-291] Update skinny war documentation to reference <defaultLibBundleDir> instead of <defaultJavaBundleDir>
[olamy] next version will be 1.0-SNAPSHOT
[olamy] [MSTAGE-16] Stage plugin doesn't work with maven3.
[olamy] upgrade dependencies, exclusion not anymore needed
[olamy] upgrade wagon version
[olamy] more generics
------------------------------------------
[...truncated 9809 lines...]
Running org.apache.maven.plugins.shade.mojo.ArtifactIdTest
Tests run: 2, Failures: 0, Errors: 0, Skipped: 0, Time elapsed: 0.001 sec
Running org.apache.maven.plugins.shade.DefaultShaderTest
Tests run: 4, Failures: 0, Errors: 0, Skipped: 0, Time elapsed: 0.53 sec
Running org.apache.maven.plugins.shade.relocation.SimpleRelocatorTest
Tests run: 7, Failures: 0, Errors: 0, Skipped: 0, Time elapsed: 0.002 sec
Running org.apache.maven.plugins.shade.relocation.SimpleRelocatorParameterTest
Tests run: 2, Failures: 0, Errors: 0, Skipped: 0, Time elapsed: 0 sec
Running org.apache.maven.plugins.shade.filter.SimpleFilterTest
Tests run: 1, Failures: 0, Errors: 0, Skipped: 0, Time elapsed: 0 sec
Running org.apache.maven.plugins.shade.resource.AppendingTransformerTest
Tests run: 1, Failures: 0, Errors: 0, Skipped: 0, Time elapsed: 0 sec
Running org.apache.maven.plugins.shade.resource.ApacheLicenseResourceTransformerTest
Tests run: 1, Failures: 0, Errors: 0, Skipped: 0, Time elapsed: 0 sec
Running org.apache.maven.plugins.shade.resource.ApacheNoticeResourceTransformerTest
Tests run: 1, Failures: 0, Errors: 0, Skipped: 0, Time elapsed: 0.001 sec
Running org.apache.maven.plugins.shade.resource.ComponentsXmlResourceTransformerTest
Tests run: 1, Failures: 0, Errors: 0, Skipped: 0, Time elapsed: 0.04 sec
Running org.apache.maven.plugins.shade.resource.XmlAppendingTransformerTest
Tests run: 1, Failures: 0, Errors: 0, Skipped: 0, Time elapsed: 0.003 sec
Results :
Tests run: 27, Failures: 0, Errors: 0, Skipped: 0
[INFO]
[INFO] --- maven-jar-plugin:2.4:jar (default-jar) @ maven-shade-plugin ---
[INFO] Building jar: /x1/jenkins/jenkins-slave/workspace/maven-plugins-ITs-m3/maven-shade-plugin/target/maven-shade-plugin-2.0.1-SNAPSHOT.jar
[INFO]
[INFO] --- maven-plugin-plugin:3.1:addPluginArtifactMetadata (default-addPluginArtifactMetadata) @ maven-shade-plugin ---
[INFO]
[INFO] --- maven-jar-plugin:2.4:test-jar (default) @ maven-shade-plugin ---
[INFO] Building jar: /x1/jenkins/jenkins-slave/workspace/maven-plugins-ITs-m3/maven-shade-plugin/target/maven-shade-plugin-2.0.1-SNAPSHOT-tests.jar
[INFO]
[INFO] --- maven-invoker-plugin:1.6:install (integration-test) @ maven-shade-plugin ---
[INFO] Installing /x1/jenkins/jenkins-slave/workspace/maven-plugins-ITs-m3/maven-shade-plugin/pom.xml to /x1/jenkins/jenkins-slave/workspace/maven-plugins-ITs-m3/maven-shade-plugin/target/local-repo/org/apache/maven/plugins/maven-shade-plugin/2.0.1-SNAPSHOT/maven-shade-plugin-2.0.1-SNAPSHOT.pom
[INFO] Installing /x1/jenkins/jenkins-slave/workspace/maven-plugins-ITs-m3/maven-shade-plugin/target/maven-shade-plugin-2.0.1-SNAPSHOT.jar to /x1/jenkins/jenkins-slave/workspace/maven-plugins-ITs-m3/maven-shade-plugin/target/local-repo/org/apache/maven/plugins/maven-shade-plugin/2.0.1-SNAPSHOT/maven-shade-plugin-2.0.1-SNAPSHOT.jar
[INFO] Installing /x1/jenkins/jenkins-slave/workspace/maven-plugins-ITs-m3/maven-shade-plugin/target/maven-shade-plugin-2.0.1-SNAPSHOT-tests.jar to /x1/jenkins/jenkins-slave/workspace/maven-plugins-ITs-m3/maven-shade-plugin/target/local-repo/org/apache/maven/plugins/maven-shade-plugin/2.0.1-SNAPSHOT/maven-shade-plugin-2.0.1-SNAPSHOT-tests.jar
[INFO]
[INFO] --- maven-invoker-plugin:1.6:integration-test (integration-test) @ maven-shade-plugin ---
[INFO] Building: project-with-reactors-included/pom.xml
[INFO] run script /x1/jenkins/jenkins-slave/workspace/maven-plugins-ITs-m3/maven-shade-plugin/target/it/project-with-reactors-included/verify.bsh
[INFO] ..SUCCESS (5.4 s)
[INFO] Building: manifest-retained/pom.xml
[INFO] run script /x1/jenkins/jenkins-slave/workspace/maven-plugins-ITs-m3/maven-shade-plugin/target/it/manifest-retained/verify.bsh
[INFO] ..SUCCESS (3.9 s)
[INFO] Building: duplicate-classes-with-reloc/pom.xml
[INFO] ..SUCCESS (2.4 s)
[INFO] Building: dep-reduced-pom/pom.xml
[INFO] run script /x1/jenkins/jenkins-slave/workspace/maven-plugins-ITs-m3/maven-shade-plugin/target/it/dep-reduced-pom/verify.groovy
[INFO] ..SUCCESS (2.8 s)
[INFO] Building: dep-reduced-pom-with-local-parent/pom.xml
[INFO] ..SUCCESS (2.3 s)
[INFO] Building: mshade-123/pom.xml
[INFO] ..SUCCESS (4.3 s)
[INFO] Building: finalNameBuild/pom.xml
[INFO] run script /x1/jenkins/jenkins-slave/workspace/maven-plugins-ITs-m3/maven-shade-plugin/target/it/finalNameBuild/setup.bsh
[INFO] run script /x1/jenkins/jenkins-slave/workspace/maven-plugins-ITs-m3/maven-shade-plugin/target/it/finalNameBuild/verify.bsh
[INFO] ..SUCCESS (3.0 s)
[INFO] Building: empty-relocation-pattern/pom.xml
[INFO] ..SUCCESS (2.6 s)
[INFO] Building: non-runtime-scope-excluded/pom.xml
[INFO] run script /x1/jenkins/jenkins-slave/workspace/maven-plugins-ITs-m3/maven-shade-plugin/target/it/non-runtime-scope-excluded/verify.bsh
[INFO] ..SUCCESS (2.9 s)
[INFO] Building: attach-after-lifecycle-fork/pom.xml
[INFO] run script /x1/jenkins/jenkins-slave/workspace/maven-plugins-ITs-m3/maven-shade-plugin/target/it/attach-after-lifecycle-fork/setup.bsh
[INFO] run script /x1/jenkins/jenkins-slave/workspace/maven-plugins-ITs-m3/maven-shade-plugin/target/it/attach-after-lifecycle-fork/verify.bsh
[INFO] ..SUCCESS (2.3 s)
[INFO] Building: empty-relocation-shaded-pattern/pom.xml
[INFO] ..SUCCESS (2.7 s)
[INFO] Building: MSHADE-105/pom.xml
[INFO] run script /x1/jenkins/jenkins-slave/workspace/maven-plugins-ITs-m3/maven-shade-plugin/target/it/MSHADE-105/verify.bsh
[INFO] ..SUCCESS (6.5 s)
[INFO] Building: rerun-without-reloc/pom.xml
[INFO] ..SUCCESS (3.0 s)
[INFO] Building: users-shader-impl/pom.xml
[INFO] run script /x1/jenkins/jenkins-slave/workspace/maven-plugins-ITs-m3/maven-shade-plugin/target/it/users-shader-impl/verify.groovy
[INFO] ..SUCCESS (3.5 s)
[INFO] Building: finalNameBuild-attached/pom.xml
[INFO] run script /x1/jenkins/jenkins-slave/workspace/maven-plugins-ITs-m3/maven-shade-plugin/target/it/finalNameBuild-attached/setup.bsh
[INFO] run script /x1/jenkins/jenkins-slave/workspace/maven-plugins-ITs-m3/maven-shade-plugin/target/it/finalNameBuild-attached/verify.bsh
[INFO] ..SUCCESS (2.7 s)
[INFO] Building: reloc-enum-ref-from-anno/pom.xml
[INFO] ..SUCCESS (2.7 s)
[INFO] Building: xml-transformer-ignores-dtd/pom.xml
[INFO] run script /x1/jenkins/jenkins-slave/workspace/maven-plugins-ITs-m3/maven-shade-plugin/target/it/xml-transformer-ignores-dtd/verify.bsh
[INFO] ..SUCCESS (3.0 s)
[INFO] Building: empty-apache-notice-transform/pom.xml
[INFO] ..SUCCESS (3.7 s)
[INFO] Building: duplicate-classes-without-reloc/pom.xml
[INFO] ..SUCCESS (2.1 s)
[INFO] Building: component-descriptor-relocation/pom.xml
[INFO] ..SUCCESS (3.2 s)
[INFO] Building: manifest-transformed/pom.xml
[INFO] run script /x1/jenkins/jenkins-slave/workspace/maven-plugins-ITs-m3/maven-shade-plugin/target/it/manifest-transformed/verify.bsh
[INFO] ..SUCCESS (3.5 s)
[INFO] Building: mini-jar-malformed-dependencies/pom.xml
[INFO] ..SUCCESS (5.2 s)
[INFO] Building: finalNameShade/pom.xml
[INFO] run script /x1/jenkins/jenkins-slave/workspace/maven-plugins-ITs-m3/maven-shade-plugin/target/it/finalNameShade/setup.bsh
[INFO] run script /x1/jenkins/jenkins-slave/workspace/maven-plugins-ITs-m3/maven-shade-plugin/target/it/finalNameShade/verify.bsh
[INFO] ..SUCCESS (3.0 s)
[INFO] Building: dep-reduced-pom-relocated-result/pom.xml
[INFO] ..SUCCESS (2.3 s)
[INFO] Building: reloc-abs-resource-path/pom.xml
[INFO] ..SUCCESS (4.3 s)
[INFO] Building: pom-packaging/pom.xml
[INFO] run script /x1/jenkins/jenkins-slave/workspace/maven-plugins-ITs-m3/maven-shade-plugin/target/it/pom-packaging/verify.bsh
[INFO] ..SUCCESS (2.1 s)
[INFO] Building: artifact-includes-excludes/pom.xml
[INFO] run script /x1/jenkins/jenkins-slave/workspace/maven-plugins-ITs-m3/maven-shade-plugin/target/it/artifact-includes-excludes/verify.bsh
[INFO] ..SUCCESS (3.0 s)
[INFO] Building: mini-jar-respect-includes/pom.xml
[INFO] run script /x1/jenkins/jenkins-slave/workspace/maven-plugins-ITs-m3/maven-shade-plugin/target/it/mini-jar-respect-includes/verify.bsh
[INFO] ..SUCCESS (3.5 s)
[INFO] Building: dep-reduced-pom-unique/pom.xml
[INFO] run script /x1/jenkins/jenkins-slave/workspace/maven-plugins-ITs-m3/maven-shade-plugin/target/it/dep-reduced-pom-unique/verify.groovy
[INFO] ..SUCCESS (3.2 s)
[INFO] Building: services-resource-transformer/pom.xml
[INFO] run script /x1/jenkins/jenkins-slave/workspace/maven-plugins-ITs-m3/maven-shade-plugin/target/it/services-resource-transformer/verify.bsh
[INFO] ..SUCCESS (3.1 s)
[INFO] Building: shadePomDependency/pom.xml
[INFO] ..SUCCESS (3.6 s)
[INFO] Building: reloc-includes-excludes/pom.xml
[INFO] run script /x1/jenkins/jenkins-slave/workspace/maven-plugins-ITs-m3/maven-shade-plugin/target/it/reloc-includes-excludes/verify.bsh
[INFO] ..SUCCESS (3.4 s)
[INFO] Building: rerun-with-reloc/pom.xml
[INFO] ..SUCCESS (3.9 s)
[INFO] Building: mini-jar-package-info/pom.xml
[INFO] run script /x1/jenkins/jenkins-slave/workspace/maven-plugins-ITs-m3/maven-shade-plugin/target/it/mini-jar-package-info/verify.bsh
[INFO] ..SUCCESS (3.6 s)
[INFO] Building: attached-artifact-type/pom.xml
[INFO] ..SUCCESS (2.6 s)
[INFO] Building: implicit-inclusion-of-project-artifact/pom.xml
[INFO] run script /x1/jenkins/jenkins-slave/workspace/maven-plugins-ITs-m3/maven-shade-plugin/target/it/implicit-inclusion-of-project-artifact/verify.bsh
[INFO] ..SUCCESS (3.3 s)
[INFO] Building: finalNameShade-attached/pom.xml
[INFO] run script /x1/jenkins/jenkins-slave/workspace/maven-plugins-ITs-m3/maven-shade-plugin/target/it/finalNameShade-attached/setup.bsh
[INFO] run script /x1/jenkins/jenkins-slave/workspace/maven-plugins-ITs-m3/maven-shade-plugin/target/it/finalNameShade-attached/verify.bsh
[INFO] ..SUCCESS (2.9 s)
[INFO] Building: mini-jar/pom.xml
[INFO] run script /x1/jenkins/jenkins-slave/workspace/maven-plugins-ITs-m3/maven-shade-plugin/target/it/mini-jar/verify.bsh
[INFO] ..SUCCESS (3.0 s)
[INFO] Building: reloc-anno/pom.xml
[INFO] ..SUCCESS (2.7 s)
[INFO] Building: filter-artifact-contents/pom.xml
[INFO] run script /x1/jenkins/jenkins-slave/workspace/maven-plugins-ITs-m3/maven-shade-plugin/target/it/filter-artifact-contents/verify.bsh
[INFO] ..SUCCESS (3.0 s)
[INFO] Building: reloc-class-from-string-pool/pom.xml
[INFO] ..SUCCESS (2.6 s)
[INFO]
[INFO] --- maven-invoker-plugin:1.6:verify (integration-test) @ maven-shade-plugin ---
[INFO] -------------------------------------------------
[INFO] Build Summary:
[INFO] Passed: 41, Failed: 0, Errors: 0, Skipped: 0
[INFO] -------------------------------------------------
[INFO]
[INFO] --- maven-install-plugin:2.3.1:install (default-install) @ maven-shade-plugin ---
[INFO] Installing /x1/jenkins/jenkins-slave/workspace/maven-plugins-ITs-m3/maven-shade-plugin/target/maven-shade-plugin-2.0.1-SNAPSHOT.jar to /home/jenkins/.m2/repository/org/apache/maven/plugins/maven-shade-plugin/2.0.1-SNAPSHOT/maven-shade-plugin-2.0.1-SNAPSHOT.jar
[INFO] Installing /x1/jenkins/jenkins-slave/workspace/maven-plugins-ITs-m3/maven-shade-plugin/pom.xml to /home/jenkins/.m2/repository/org/apache/maven/plugins/maven-shade-plugin/2.0.1-SNAPSHOT/maven-shade-plugin-2.0.1-SNAPSHOT.pom
[INFO] Installing /x1/jenkins/jenkins-slave/workspace/maven-plugins-ITs-m3/maven-shade-plugin/target/maven-shade-plugin-2.0.1-SNAPSHOT-tests.jar to /home/jenkins/.m2/repository/org/apache/maven/plugins/maven-shade-plugin/2.0.1-SNAPSHOT/maven-shade-plugin-2.0.1-SNAPSHOT-tests.jar
[INFO]
[INFO] ------------------------------------------------------------------------
[INFO] Building Maven Plugins Aggregator 1-SNAPSHOT
[INFO] ------------------------------------------------------------------------
[INFO]
[INFO] --- maven-clean-plugin:2.4.1:clean (default-clean) @ maven-plugins-aggregator ---
[INFO] Deleting /x1/jenkins/jenkins-slave/workspace/maven-plugins-ITs-m3/target
[INFO]
[INFO] --- maven-remote-resources-plugin:1.1:process (default) @ maven-plugins-aggregator ---
[INFO]
[INFO] --- maven-install-plugin:2.3.1:install (default-install) @ maven-plugins-aggregator ---
[INFO] Installing /x1/jenkins/jenkins-slave/workspace/maven-plugins-ITs-m3/pom.xml to /home/jenkins/.m2/repository/org/apache/maven/plugins/maven-plugins-aggregator/1-SNAPSHOT/maven-plugins-aggregator-1-SNAPSHOT.pom
[INFO] ------------------------------------------------------------------------
[INFO] Reactor Summary:
[INFO]
[INFO] Maven Plugins ..................................... SUCCESS [11.712s]
[INFO] Maven ACR Plugin .................................. SUCCESS [34.028s]
[INFO] Maven Ant Plugin .................................. SUCCESS [1:14.182s]
[INFO] Maven AntRun Plugin ............................... SUCCESS [44.356s]
[INFO] Maven Eclipse Plugin .............................. SUCCESS [5:24.376s]
[INFO] Maven Assembly Plugin ............................. SUCCESS [8:29.295s]
[INFO] Maven Changelog Plugin ............................ FAILURE [5.776s]
[INFO] Maven Changes Report Plugin ....................... SUCCESS [45.670s]
[INFO] Maven Checkstyle Plugin ........................... SUCCESS [1:15.171s]
[INFO] Maven Clean Plugin ................................ SUCCESS [16.603s]
[INFO] Maven Compiler Plugin ............................. SUCCESS [44.970s]
[INFO] Maven Dependency Plugin ........................... SUCCESS [1:33.814s]
[INFO] Maven Deploy Plugin ............................... SUCCESS [48.803s]
[INFO] Maven DOAP Plugin ................................. SUCCESS [12.915s]
[INFO] Maven Documentation Checker Plugin ................ FAILURE [10.258s]
[INFO] Maven EAR Plugin .................................. SUCCESS [3:04.004s]
[INFO] Maven EJB Plugin .................................. SUCCESS [20.160s]
[INFO] Maven GPG Plugin .................................. SUCCESS [8.534s]
[INFO] Maven Help Plugin ................................. SUCCESS [28.038s]
[INFO] Maven IDEA Plugin ................................. SUCCESS [5.373s]
[INFO] Maven Install Plugin .............................. SUCCESS [31.283s]
[INFO] Maven JAR Plugin .................................. SUCCESS [53.760s]
[INFO] Maven Jarsigner Plugin ............................ SUCCESS [19.393s]
[INFO] Maven Javadoc Plugin .............................. FAILURE [1:08.111s]
[INFO] Maven Linkcheck Plugin ............................ SUCCESS [2.479s]
[INFO] Maven One Plugin .................................. SUCCESS [2.238s]
[INFO] Maven Patch Plugin ................................ SUCCESS [11.929s]
[INFO] Maven PDF Plugin .................................. SUCCESS [26.197s]
[INFO] Maven PMD Plugin .................................. SUCCESS [29.292s]
[INFO] Maven RAR Plugin .................................. SUCCESS [8.804s]
[INFO] Maven Reactor Plugin .............................. SUCCESS [1.885s]
[INFO] Maven Repository Plugin ........................... SUCCESS [33.554s]
[INFO] Maven Resources Plugin ............................ SUCCESS [45.236s]
[INFO] Maven Site Plugin 3 ............................... SUCCESS [5:10.875s]
[INFO] Maven Source Plugin ............................... SUCCESS [34.650s]
[INFO] Maven Stage Plugin ................................ SUCCESS [1.768s]
[INFO] Maven Toolchains Plugin ........................... SUCCESS [1.343s]
[INFO] Maven Verifier Plugin ............................. SUCCESS [12.280s]
[INFO] Maven WAR Plugin .................................. SUCCESS [1:00.909s]
[INFO] SCM Publish Maven Plugin .......................... SUCCESS [47.142s]
[INFO] Maven Invoker Plugin .............................. SUCCESS [3:13.551s]
[INFO] Maven Project Info Reports Plugin ................. SUCCESS [3:36.903s]
[INFO] Maven Remote Resources Plugin ..................... SUCCESS [47.858s]
[INFO] Maven Shade Plugin ................................ SUCCESS [2:23.750s]
[INFO] Maven Plugins Aggregator .......................... SUCCESS [0.068s]
[INFO] ------------------------------------------------------------------------
[INFO] BUILD FAILURE
[INFO] ------------------------------------------------------------------------
[INFO] Total time: 50:06.754s
[INFO] Finished at: Tue Sep 25 22:35:14 GMT 2012
[INFO] Final Memory: 104M/542M
[INFO] ------------------------------------------------------------------------
[WARNING] The requested profile "apache.snapshots" could not be activated because it does not exist.
[ERROR] Failed to execute goal org.apache.maven.plugins:maven-surefire-plugin:2.12:test (default-test) on project maven-changelog-plugin: There are test failures.
[ERROR]
[ERROR] Please refer to /x1/jenkins/jenkins-slave/workspace/maven-plugins-ITs-m3/maven-changelog-plugin/target/surefire-reports for the individual test results.
[ERROR] -> [Help 1]
[ERROR] Failed to execute goal org.apache.maven.plugins:maven-invoker-plugin:1.6:verify (integration-test) on project maven-docck-plugin: 1 build failed. See console output above for details. -> [Help 1]
[ERROR] Failed to execute goal org.apache.maven.plugins:maven-surefire-plugin:2.12:test (default-test) on project maven-javadoc-plugin: There are test failures.
[ERROR]
[ERROR] Please refer to /x1/jenkins/jenkins-slave/workspace/maven-plugins-ITs-m3/maven-javadoc-plugin/target/surefire-reports for the individual test results.
[ERROR] -> [Help 1]
[ERROR]
[ERROR] To see the full stack trace of the errors, re-run Maven with the -e switch.
[ERROR] Re-run Maven using the -X switch to enable full debug logging.
[ERROR]
[ERROR] For more information about the errors and possible solutions, please read the following articles:
[ERROR] [Help 1] http://cwiki.apache.org/confluence/display/MAVEN/MojoFailureException
[ERROR]
[ERROR] After correcting the problems, you can resume the build with the command
[ERROR] mvn <goals> -rf :maven-changelog-plugin
Build step 'Invoke top-level Maven targets' marked build as failure
Recording test results
Build failed in Jenkins: maven-plugins-ITs-m3 #670
Posted by Apache Jenkins Server <je...@builds.apache.org>.
See <https://builds.apache.org/job/maven-plugins-ITs-m3/670/changes>
Changes:
[struberg] fix ignore rules
[struberg] MCOMPILER-179 revert back to old plexus-compiler 1.9.1
plexus-compiler 1.9.2 breaks the mcompiler-120 integration test
[struberg] MCOMPILER-21 add handling of file deletes and incremental build
------------------------------------------
[...truncated 9829 lines...]
Running org.apache.maven.plugins.shade.resource.AppendingTransformerTest
Tests run: 1, Failures: 0, Errors: 0, Skipped: 0, Time elapsed: 0.001 sec
Running org.apache.maven.plugins.shade.resource.ApacheNoticeResourceTransformerTest
Tests run: 1, Failures: 0, Errors: 0, Skipped: 0, Time elapsed: 0 sec
Running org.apache.maven.plugins.shade.resource.ComponentsXmlResourceTransformerTest
Tests run: 1, Failures: 0, Errors: 0, Skipped: 0, Time elapsed: 0.063 sec
Running org.apache.maven.plugins.shade.mojo.ShadeMojoTest
Tests run: 4, Failures: 0, Errors: 0, Skipped: 0, Time elapsed: 1.53 sec
Running org.apache.maven.plugins.shade.mojo.RelativizePathTest
Tests run: 1, Failures: 0, Errors: 0, Skipped: 0, Time elapsed: 0.021 sec
Running org.apache.maven.plugins.shade.mojo.ArtifactSelectorTest
Tests run: 1, Failures: 0, Errors: 0, Skipped: 0, Time elapsed: 0.001 sec
Running org.apache.maven.plugins.shade.mojo.ArtifactIdTest
Tests run: 2, Failures: 0, Errors: 0, Skipped: 0, Time elapsed: 0.001 sec
Running org.apache.maven.plugins.shade.filter.SimpleFilterTest
Tests run: 1, Failures: 0, Errors: 0, Skipped: 0, Time elapsed: 0 sec
Running org.apache.maven.plugins.shade.relocation.SimpleRelocatorTest
Tests run: 7, Failures: 0, Errors: 0, Skipped: 0, Time elapsed: 0.003 sec
Running org.apache.maven.plugins.shade.relocation.SimpleRelocatorParameterTest
Tests run: 2, Failures: 0, Errors: 0, Skipped: 0, Time elapsed: 0 sec
Results :
Tests run: 27, Failures: 0, Errors: 0, Skipped: 0
[INFO]
[INFO] --- maven-jar-plugin:2.4:jar (default-jar) @ maven-shade-plugin ---
[INFO] Building jar: <https://builds.apache.org/job/maven-plugins-ITs-m3/ws/maven-shade-plugin/target/maven-shade-plugin-2.0.1-SNAPSHOT.jar>
[INFO]
[INFO] --- maven-plugin-plugin:3.1:addPluginArtifactMetadata (default-addPluginArtifactMetadata) @ maven-shade-plugin ---
[INFO]
[INFO] --- maven-jar-plugin:2.4:test-jar (default) @ maven-shade-plugin ---
[INFO] Building jar: <https://builds.apache.org/job/maven-plugins-ITs-m3/ws/maven-shade-plugin/target/maven-shade-plugin-2.0.1-SNAPSHOT-tests.jar>
[INFO]
[INFO] --- maven-invoker-plugin:1.6:install (integration-test) @ maven-shade-plugin ---
[INFO] Installing <https://builds.apache.org/job/maven-plugins-ITs-m3/ws/maven-shade-plugin/pom.xml> to <https://builds.apache.org/job/maven-plugins-ITs-m3/ws/maven-shade-plugin/target/local-repo/org/apache/maven/plugins/maven-shade-plugin/2.0.1-SNAPSHOT/maven-shade-plugin-2.0.1-SNAPSHOT.pom>
[INFO] Installing <https://builds.apache.org/job/maven-plugins-ITs-m3/ws/maven-shade-plugin/target/maven-shade-plugin-2.0.1-SNAPSHOT.jar> to <https://builds.apache.org/job/maven-plugins-ITs-m3/ws/maven-shade-plugin/target/local-repo/org/apache/maven/plugins/maven-shade-plugin/2.0.1-SNAPSHOT/maven-shade-plugin-2.0.1-SNAPSHOT.jar>
[INFO] Installing <https://builds.apache.org/job/maven-plugins-ITs-m3/ws/maven-shade-plugin/target/maven-shade-plugin-2.0.1-SNAPSHOT-tests.jar> to <https://builds.apache.org/job/maven-plugins-ITs-m3/ws/maven-shade-plugin/target/local-repo/org/apache/maven/plugins/maven-shade-plugin/2.0.1-SNAPSHOT/maven-shade-plugin-2.0.1-SNAPSHOT-tests.jar>
[INFO]
[INFO] --- maven-invoker-plugin:1.6:integration-test (integration-test) @ maven-shade-plugin ---
[INFO] Building: artifact-includes-excludes/pom.xml
[INFO] run script <https://builds.apache.org/job/maven-plugins-ITs-m3/ws/maven-shade-plugin/target/it/artifact-includes-excludes/verify.bsh>
[INFO] ..SUCCESS (4.2 s)
[INFO] Building: dep-reduced-pom-with-local-parent/pom.xml
[INFO] ..SUCCESS (4.2 s)
[INFO] Building: implicit-inclusion-of-project-artifact/pom.xml
[INFO] run script <https://builds.apache.org/job/maven-plugins-ITs-m3/ws/maven-shade-plugin/target/it/implicit-inclusion-of-project-artifact/verify.bsh>
[INFO] ..SUCCESS (3.9 s)
[INFO] Building: reloc-class-from-string-pool/pom.xml
[INFO] ..SUCCESS (3.3 s)
[INFO] Building: dep-reduced-pom-unique/pom.xml
[INFO] run script <https://builds.apache.org/job/maven-plugins-ITs-m3/ws/maven-shade-plugin/target/it/dep-reduced-pom-unique/verify.groovy>
[INFO] ..SUCCESS (4.1 s)
[INFO] Building: non-runtime-scope-excluded/pom.xml
[INFO] run script <https://builds.apache.org/job/maven-plugins-ITs-m3/ws/maven-shade-plugin/target/it/non-runtime-scope-excluded/verify.bsh>
[INFO] ..SUCCESS (3.6 s)
[INFO] Building: manifest-transformed/pom.xml
[INFO] run script <https://builds.apache.org/job/maven-plugins-ITs-m3/ws/maven-shade-plugin/target/it/manifest-transformed/verify.bsh>
[INFO] ..SUCCESS (5.3 s)
[INFO] Building: duplicate-classes-without-reloc/pom.xml
[INFO] ..SUCCESS (2.9 s)
[INFO] Building: mini-jar-respect-includes/pom.xml
[INFO] run script <https://builds.apache.org/job/maven-plugins-ITs-m3/ws/maven-shade-plugin/target/it/mini-jar-respect-includes/verify.bsh>
[INFO] ..SUCCESS (4.5 s)
[INFO] Building: pom-packaging/pom.xml
[INFO] run script <https://builds.apache.org/job/maven-plugins-ITs-m3/ws/maven-shade-plugin/target/it/pom-packaging/verify.bsh>
[INFO] ..SUCCESS (2.5 s)
[INFO] Building: xml-transformer-ignores-dtd/pom.xml
[INFO] run script <https://builds.apache.org/job/maven-plugins-ITs-m3/ws/maven-shade-plugin/target/it/xml-transformer-ignores-dtd/verify.bsh>
[INFO] ..SUCCESS (3.6 s)
[INFO] Building: empty-relocation-shaded-pattern/pom.xml
[INFO] ..SUCCESS (3.4 s)
[INFO] Building: mshade-123/pom.xml
[INFO] ..SUCCESS (5.9 s)
[INFO] Building: manifest-retained/pom.xml
[INFO] run script <https://builds.apache.org/job/maven-plugins-ITs-m3/ws/maven-shade-plugin/target/it/manifest-retained/verify.bsh>
[INFO] ..SUCCESS (4.6 s)
[INFO] Building: finalNameBuild/pom.xml
[INFO] run script <https://builds.apache.org/job/maven-plugins-ITs-m3/ws/maven-shade-plugin/target/it/finalNameBuild/setup.bsh>
[INFO] run script <https://builds.apache.org/job/maven-plugins-ITs-m3/ws/maven-shade-plugin/target/it/finalNameBuild/verify.bsh>
[INFO] ..SUCCESS (3.4 s)
[INFO] Building: finalNameShade/pom.xml
[INFO] run script <https://builds.apache.org/job/maven-plugins-ITs-m3/ws/maven-shade-plugin/target/it/finalNameShade/setup.bsh>
[INFO] run script <https://builds.apache.org/job/maven-plugins-ITs-m3/ws/maven-shade-plugin/target/it/finalNameShade/verify.bsh>
[INFO] ..SUCCESS (3.4 s)
[INFO] Building: reloc-abs-resource-path/pom.xml
[INFO] ..SUCCESS (5.5 s)
[INFO] Building: empty-apache-notice-transform/pom.xml
[INFO] ..SUCCESS (4.1 s)
[INFO] Building: services-resource-transformer/pom.xml
[INFO] run script <https://builds.apache.org/job/maven-plugins-ITs-m3/ws/maven-shade-plugin/target/it/services-resource-transformer/verify.bsh>
[INFO] ..SUCCESS (3.6 s)
[INFO] Building: mini-jar-package-info/pom.xml
[INFO] run script <https://builds.apache.org/job/maven-plugins-ITs-m3/ws/maven-shade-plugin/target/it/mini-jar-package-info/verify.bsh>
[INFO] ..SUCCESS (4.5 s)
[INFO] Building: rerun-without-reloc/pom.xml
[INFO] ..SUCCESS (3.6 s)
[INFO] Building: shadePomDependency/pom.xml
[INFO] ..SUCCESS (4.5 s)
[INFO] Building: reloc-includes-excludes/pom.xml
[INFO] run script <https://builds.apache.org/job/maven-plugins-ITs-m3/ws/maven-shade-plugin/target/it/reloc-includes-excludes/verify.bsh>
[INFO] ..SUCCESS (4.2 s)
[INFO] Building: finalNameShade-attached/pom.xml
[INFO] run script <https://builds.apache.org/job/maven-plugins-ITs-m3/ws/maven-shade-plugin/target/it/finalNameShade-attached/setup.bsh>
[INFO] run script <https://builds.apache.org/job/maven-plugins-ITs-m3/ws/maven-shade-plugin/target/it/finalNameShade-attached/verify.bsh>
[INFO] ..SUCCESS (3.5 s)
[INFO] Building: component-descriptor-relocation/pom.xml
[INFO] ..SUCCESS (4.0 s)
[INFO] Building: users-shader-impl/pom.xml
[INFO] run script <https://builds.apache.org/job/maven-plugins-ITs-m3/ws/maven-shade-plugin/target/it/users-shader-impl/verify.groovy>
[INFO] ..SUCCESS (4.1 s)
[INFO] Building: mini-jar-malformed-dependencies/pom.xml
[INFO] ..SUCCESS (7.8 s)
[INFO] Building: finalNameBuild-attached/pom.xml
[INFO] run script <https://builds.apache.org/job/maven-plugins-ITs-m3/ws/maven-shade-plugin/target/it/finalNameBuild-attached/setup.bsh>
[INFO] run script <https://builds.apache.org/job/maven-plugins-ITs-m3/ws/maven-shade-plugin/target/it/finalNameBuild-attached/verify.bsh>
[INFO] ..SUCCESS (3.6 s)
[INFO] Building: attach-after-lifecycle-fork/pom.xml
[INFO] run script <https://builds.apache.org/job/maven-plugins-ITs-m3/ws/maven-shade-plugin/target/it/attach-after-lifecycle-fork/setup.bsh>
[INFO] run script <https://builds.apache.org/job/maven-plugins-ITs-m3/ws/maven-shade-plugin/target/it/attach-after-lifecycle-fork/verify.bsh>
[INFO] ..SUCCESS (2.9 s)
[INFO] Building: empty-relocation-pattern/pom.xml
[INFO] ..SUCCESS (3.4 s)
[INFO] Building: mini-jar/pom.xml
[INFO] run script <https://builds.apache.org/job/maven-plugins-ITs-m3/ws/maven-shade-plugin/target/it/mini-jar/verify.bsh>
[INFO] ..SUCCESS (4.0 s)
[INFO] Building: reloc-anno/pom.xml
[INFO] ..SUCCESS (3.3 s)
[INFO] Building: MSHADE-105/pom.xml
[INFO] run script <https://builds.apache.org/job/maven-plugins-ITs-m3/ws/maven-shade-plugin/target/it/MSHADE-105/verify.bsh>
[INFO] ..SUCCESS (8.3 s)
[INFO] Building: dep-reduced-pom-relocated-result/pom.xml
[INFO] ..SUCCESS (2.7 s)
[INFO] Building: attached-artifact-type/pom.xml
[INFO] ..SUCCESS (3.3 s)
[INFO] Building: dep-reduced-pom/pom.xml
[INFO] run script <https://builds.apache.org/job/maven-plugins-ITs-m3/ws/maven-shade-plugin/target/it/dep-reduced-pom/verify.groovy>
[INFO] ..SUCCESS (3.6 s)
[INFO] Building: rerun-with-reloc/pom.xml
[INFO] ..SUCCESS (4.7 s)
[INFO] Building: duplicate-classes-with-reloc/pom.xml
[INFO] ..SUCCESS (2.8 s)
[INFO] Building: filter-artifact-contents/pom.xml
[INFO] run script <https://builds.apache.org/job/maven-plugins-ITs-m3/ws/maven-shade-plugin/target/it/filter-artifact-contents/verify.bsh>
[INFO] ..SUCCESS (3.6 s)
[INFO] Building: project-with-reactors-included/pom.xml
[INFO] run script <https://builds.apache.org/job/maven-plugins-ITs-m3/ws/maven-shade-plugin/target/it/project-with-reactors-included/verify.bsh>
[INFO] ..SUCCESS (5.1 s)
[INFO] Building: reloc-enum-ref-from-anno/pom.xml
[INFO] ..SUCCESS (3.2 s)
[INFO]
[INFO] --- maven-invoker-plugin:1.6:verify (integration-test) @ maven-shade-plugin ---
[INFO] -------------------------------------------------
[INFO] Build Summary:
[INFO] Passed: 41, Failed: 0, Errors: 0, Skipped: 0
[INFO] -------------------------------------------------
[INFO]
[INFO] --- maven-install-plugin:2.3.1:install (default-install) @ maven-shade-plugin ---
[INFO] Installing <https://builds.apache.org/job/maven-plugins-ITs-m3/ws/maven-shade-plugin/target/maven-shade-plugin-2.0.1-SNAPSHOT.jar> to /home/jenkins/.m2/repository/org/apache/maven/plugins/maven-shade-plugin/2.0.1-SNAPSHOT/maven-shade-plugin-2.0.1-SNAPSHOT.jar
[INFO] Installing <https://builds.apache.org/job/maven-plugins-ITs-m3/ws/maven-shade-plugin/pom.xml> to /home/jenkins/.m2/repository/org/apache/maven/plugins/maven-shade-plugin/2.0.1-SNAPSHOT/maven-shade-plugin-2.0.1-SNAPSHOT.pom
[INFO] Installing <https://builds.apache.org/job/maven-plugins-ITs-m3/ws/maven-shade-plugin/target/maven-shade-plugin-2.0.1-SNAPSHOT-tests.jar> to /home/jenkins/.m2/repository/org/apache/maven/plugins/maven-shade-plugin/2.0.1-SNAPSHOT/maven-shade-plugin-2.0.1-SNAPSHOT-tests.jar
[INFO]
[INFO] ------------------------------------------------------------------------
[INFO] Building Maven Plugins Aggregator 1-SNAPSHOT
[INFO] ------------------------------------------------------------------------
[INFO]
[INFO] --- maven-clean-plugin:2.4.1:clean (default-clean) @ maven-plugins-aggregator ---
[INFO] Deleting <https://builds.apache.org/job/maven-plugins-ITs-m3/ws/target>
[INFO]
[INFO] --- maven-remote-resources-plugin:1.1:process (default) @ maven-plugins-aggregator ---
[INFO]
[INFO] --- maven-install-plugin:2.3.1:install (default-install) @ maven-plugins-aggregator ---
[INFO] Installing <https://builds.apache.org/job/maven-plugins-ITs-m3/ws/pom.xml> to /home/jenkins/.m2/repository/org/apache/maven/plugins/maven-plugins-aggregator/1-SNAPSHOT/maven-plugins-aggregator-1-SNAPSHOT.pom
[INFO] ------------------------------------------------------------------------
[INFO] Reactor Summary:
[INFO]
[INFO] Maven Plugins ..................................... SUCCESS [44.546s]
[INFO] Maven ACR Plugin .................................. SUCCESS [24.660s]
[INFO] Maven Ant Plugin .................................. SUCCESS [1:20.443s]
[INFO] Maven AntRun Plugin ............................... SUCCESS [56.984s]
[INFO] Maven Eclipse Plugin .............................. SUCCESS [6:43.759s]
[INFO] Maven Assembly Plugin ............................. SUCCESS [11:15.429s]
[INFO] Maven Changelog Plugin ............................ FAILURE [13.582s]
[INFO] Maven Changes Report Plugin ....................... SUCCESS [1:06.401s]
[INFO] Maven Checkstyle Plugin ........................... SUCCESS [1:45.750s]
[INFO] Maven Clean Plugin ................................ SUCCESS [21.294s]
[INFO] Maven Compiler Plugin ............................. FAILURE [7.907s]
[INFO] Maven Dependency Plugin ........................... SUCCESS [2:16.053s]
[INFO] Maven Deploy Plugin ............................... SUCCESS [1:10.561s]
[INFO] Maven DOAP Plugin ................................. SUCCESS [18.592s]
[INFO] Maven Documentation Checker Plugin ................ SUCCESS [7.818s]
[INFO] Maven EAR Plugin .................................. SUCCESS [3:57.755s]
[INFO] Maven EJB Plugin .................................. SUCCESS [28.749s]
[INFO] Maven GPG Plugin .................................. SUCCESS [13.712s]
[INFO] Maven Help Plugin ................................. SUCCESS [35.782s]
[INFO] Maven IDEA Plugin ................................. SUCCESS [9.045s]
[INFO] Maven Install Plugin .............................. SUCCESS [42.903s]
[INFO] Maven JAR Plugin .................................. SUCCESS [1:12.852s]
[INFO] Maven Jarsigner Plugin ............................ SUCCESS [26.887s]
[INFO] Maven Javadoc Plugin .............................. SUCCESS [3:14.050s]
[INFO] Maven Linkcheck Plugin ............................ SUCCESS [2.985s]
[INFO] Maven One Plugin .................................. SUCCESS [2.388s]
[INFO] Maven Patch Plugin ................................ SUCCESS [13.244s]
[INFO] Maven PDF Plugin .................................. SUCCESS [2:34.452s]
[INFO] Maven PMD Plugin .................................. SUCCESS [49.124s]
[INFO] Maven RAR Plugin .................................. SUCCESS [12.025s]
[INFO] Maven Reactor Plugin .............................. SUCCESS [2.682s]
[INFO] Maven Repository Plugin ........................... SUCCESS [1:01.829s]
[INFO] Maven Resources Plugin ............................ SUCCESS [58.820s]
[INFO] Maven Site Plugin 3 ............................... SUCCESS [6:46.940s]
[INFO] Maven Source Plugin ............................... SUCCESS [43.809s]
[INFO] Maven Stage Plugin ................................ SUCCESS [2.028s]
[INFO] Maven Toolchains Plugin ........................... SUCCESS [2.295s]
[INFO] Maven Verifier Plugin ............................. SUCCESS [16.150s]
[INFO] Maven WAR Plugin .................................. SUCCESS [1:22.358s]
[INFO] SCM Publish Maven Plugin .......................... SUCCESS [1:16.207s]
[INFO] Maven Invoker Plugin .............................. SUCCESS [4:21.495s]
[INFO] Maven Project Info Reports Plugin ................. SUCCESS [2:24.307s]
[INFO] Maven Remote Resources Plugin ..................... SUCCESS [1:00.273s]
[INFO] Maven Shade Plugin ................................ SUCCESS [3:11.994s]
[INFO] Maven Plugins Aggregator .......................... SUCCESS [0.100s]
[INFO] ------------------------------------------------------------------------
[INFO] BUILD FAILURE
[INFO] ------------------------------------------------------------------------
[INFO] Total time: 1:07:22.466s
[INFO] Finished at: Sun Sep 23 01:52:34 UTC 2012
[INFO] Final Memory: 99M/416M
[INFO] ------------------------------------------------------------------------
[WARNING] The requested profile "apache.snapshots" could not be activated because it does not exist.
[ERROR] Failed to execute goal org.apache.maven.plugins:maven-surefire-plugin:2.12:test (default-test) on project maven-changelog-plugin: There are test failures.
[ERROR]
[ERROR] Please refer to <https://builds.apache.org/job/maven-plugins-ITs-m3/ws/maven-changelog-plugin/target/surefire-reports> for the individual test results.
[ERROR] -> [Help 1]
[ERROR] Failed to execute goal org.apache.maven.plugins:maven-compiler-plugin:2.5.1:compile (default-compile) on project maven-compiler-plugin: Compilation failure
[ERROR] <https://builds.apache.org/job/maven-plugins-ITs-m3/ws/maven-compiler-plugin/src/main/java/org/apache/maven/plugin/AbstractCompilerMojo.java>:[581,42] cannot find symbol
[ERROR] symbol : method inputFileTreeChanged(java.util.Set<java.io.File>)
[ERROR] location: class org.apache.maven.shared.incremental.IncrementalBuildHelper
[ERROR] -> [Help 1]
[ERROR]
[ERROR] To see the full stack trace of the errors, re-run Maven with the -e switch.
[ERROR] Re-run Maven using the -X switch to enable full debug logging.
[ERROR]
[ERROR] For more information about the errors and possible solutions, please read the following articles:
[ERROR] [Help 1] http://cwiki.apache.org/confluence/display/MAVEN/MojoFailureException
[ERROR]
[ERROR] After correcting the problems, you can resume the build with the command
[ERROR] mvn <goals> -rf :maven-changelog-plugin
Build step 'Invoke top-level Maven targets' marked build as failure
Recording test results
Build failed in Jenkins: maven-plugins-ITs-m3 #669
Posted by Apache Jenkins Server <je...@builds.apache.org>.
See <https://builds.apache.org/job/maven-plugins-ITs-m3/669/changes>
Changes:
[krosenvold] o Upgraded to p-io 2.0.5 and p-u 3.0.8
------------------------------------------
[...truncated 9922 lines...]
Tests run: 1, Failures: 0, Errors: 0, Skipped: 0, Time elapsed: 0.029 sec
Running org.apache.maven.plugins.shade.mojo.ShadeMojoTest
Tests run: 4, Failures: 0, Errors: 0, Skipped: 0, Time elapsed: 2.337 sec
Running org.apache.maven.plugins.shade.mojo.RelativizePathTest
Tests run: 1, Failures: 0, Errors: 0, Skipped: 0, Time elapsed: 0.019 sec
Running org.apache.maven.plugins.shade.mojo.ArtifactIdTest
Tests run: 2, Failures: 0, Errors: 0, Skipped: 0, Time elapsed: 0.003 sec
Running org.apache.maven.plugins.shade.DefaultShaderTest
Tests run: 4, Failures: 0, Errors: 0, Skipped: 0, Time elapsed: 0.833 sec
Running org.apache.maven.plugins.shade.resource.AppendingTransformerTest
Tests run: 1, Failures: 0, Errors: 0, Skipped: 0, Time elapsed: 0.002 sec
Running org.apache.maven.plugins.shade.resource.ApacheNoticeResourceTransformerTest
Tests run: 1, Failures: 0, Errors: 0, Skipped: 0, Time elapsed: 0.002 sec
Running org.apache.maven.plugins.shade.resource.XmlAppendingTransformerTest
Tests run: 1, Failures: 0, Errors: 0, Skipped: 0, Time elapsed: 0.006 sec
Running org.apache.maven.plugins.shade.resource.ApacheLicenseResourceTransformerTest
Tests run: 1, Failures: 0, Errors: 0, Skipped: 0, Time elapsed: 0.001 sec
Running org.apache.maven.plugins.shade.resource.ComponentsXmlResourceTransformerTest
Tests run: 1, Failures: 0, Errors: 0, Skipped: 0, Time elapsed: 0.063 sec
Running org.apache.maven.plugins.shade.filter.SimpleFilterTest
Tests run: 1, Failures: 0, Errors: 0, Skipped: 0, Time elapsed: 0.002 sec
Running org.apache.maven.plugins.shade.relocation.SimpleRelocatorParameterTest
Tests run: 2, Failures: 0, Errors: 0, Skipped: 0, Time elapsed: 0.001 sec
Running org.apache.maven.plugins.shade.relocation.SimpleRelocatorTest
Tests run: 7, Failures: 0, Errors: 0, Skipped: 0, Time elapsed: 0.004 sec
Results :
Tests run: 27, Failures: 0, Errors: 0, Skipped: 0
[INFO]
[INFO] --- maven-jar-plugin:2.4:jar (default-jar) @ maven-shade-plugin ---
[INFO] Building jar: <https://builds.apache.org/job/maven-plugins-ITs-m3/ws/maven-shade-plugin/target/maven-shade-plugin-2.0.1-SNAPSHOT.jar>
[INFO]
[INFO] --- maven-plugin-plugin:3.1:addPluginArtifactMetadata (default-addPluginArtifactMetadata) @ maven-shade-plugin ---
[INFO]
[INFO] --- maven-jar-plugin:2.4:test-jar (default) @ maven-shade-plugin ---
[INFO] Building jar: <https://builds.apache.org/job/maven-plugins-ITs-m3/ws/maven-shade-plugin/target/maven-shade-plugin-2.0.1-SNAPSHOT-tests.jar>
[INFO]
[INFO] --- maven-invoker-plugin:1.6:install (integration-test) @ maven-shade-plugin ---
[INFO] Installing <https://builds.apache.org/job/maven-plugins-ITs-m3/ws/maven-shade-plugin/pom.xml> to <https://builds.apache.org/job/maven-plugins-ITs-m3/ws/maven-shade-plugin/target/local-repo/org/apache/maven/plugins/maven-shade-plugin/2.0.1-SNAPSHOT/maven-shade-plugin-2.0.1-SNAPSHOT.pom>
[INFO] Installing <https://builds.apache.org/job/maven-plugins-ITs-m3/ws/maven-shade-plugin/target/maven-shade-plugin-2.0.1-SNAPSHOT.jar> to <https://builds.apache.org/job/maven-plugins-ITs-m3/ws/maven-shade-plugin/target/local-repo/org/apache/maven/plugins/maven-shade-plugin/2.0.1-SNAPSHOT/maven-shade-plugin-2.0.1-SNAPSHOT.jar>
[INFO] Installing <https://builds.apache.org/job/maven-plugins-ITs-m3/ws/maven-shade-plugin/target/maven-shade-plugin-2.0.1-SNAPSHOT-tests.jar> to <https://builds.apache.org/job/maven-plugins-ITs-m3/ws/maven-shade-plugin/target/local-repo/org/apache/maven/plugins/maven-shade-plugin/2.0.1-SNAPSHOT/maven-shade-plugin-2.0.1-SNAPSHOT-tests.jar>
[INFO]
[INFO] --- maven-invoker-plugin:1.6:integration-test (integration-test) @ maven-shade-plugin ---
[INFO] Building: xml-transformer-ignores-dtd/pom.xml
[INFO] run script <https://builds.apache.org/job/maven-plugins-ITs-m3/ws/maven-shade-plugin/target/it/xml-transformer-ignores-dtd/verify.bsh>
[INFO] ..SUCCESS (4.5 s)
[INFO] Building: attach-after-lifecycle-fork/pom.xml
[INFO] run script <https://builds.apache.org/job/maven-plugins-ITs-m3/ws/maven-shade-plugin/target/it/attach-after-lifecycle-fork/setup.bsh>
[INFO] run script <https://builds.apache.org/job/maven-plugins-ITs-m3/ws/maven-shade-plugin/target/it/attach-after-lifecycle-fork/verify.bsh>
[INFO] ..SUCCESS (3.9 s)
[INFO] Building: duplicate-classes-without-reloc/pom.xml
[INFO] ..SUCCESS (2.9 s)
[INFO] Building: filter-artifact-contents/pom.xml
[INFO] run script <https://builds.apache.org/job/maven-plugins-ITs-m3/ws/maven-shade-plugin/target/it/filter-artifact-contents/verify.bsh>
[INFO] ..SUCCESS (3.6 s)
[INFO] Building: component-descriptor-relocation/pom.xml
[INFO] ..SUCCESS (4.5 s)
[INFO] Building: finalNameShade/pom.xml
[INFO] run script <https://builds.apache.org/job/maven-plugins-ITs-m3/ws/maven-shade-plugin/target/it/finalNameShade/setup.bsh>
[INFO] run script <https://builds.apache.org/job/maven-plugins-ITs-m3/ws/maven-shade-plugin/target/it/finalNameShade/verify.bsh>
[INFO] ..SUCCESS (3.5 s)
[INFO] Building: manifest-retained/pom.xml
[INFO] run script <https://builds.apache.org/job/maven-plugins-ITs-m3/ws/maven-shade-plugin/target/it/manifest-retained/verify.bsh>
[INFO] ..SUCCESS (4.7 s)
[INFO] Building: manifest-transformed/pom.xml
[INFO] run script <https://builds.apache.org/job/maven-plugins-ITs-m3/ws/maven-shade-plugin/target/it/manifest-transformed/verify.bsh>
[INFO] ..SUCCESS (4.6 s)
[INFO] Building: services-resource-transformer/pom.xml
[INFO] run script <https://builds.apache.org/job/maven-plugins-ITs-m3/ws/maven-shade-plugin/target/it/services-resource-transformer/verify.bsh>
[INFO] ..SUCCESS (3.6 s)
[INFO] Building: pom-packaging/pom.xml
[INFO] run script <https://builds.apache.org/job/maven-plugins-ITs-m3/ws/maven-shade-plugin/target/it/pom-packaging/verify.bsh>
[INFO] ..SUCCESS (2.5 s)
[INFO] Building: non-runtime-scope-excluded/pom.xml
[INFO] run script <https://builds.apache.org/job/maven-plugins-ITs-m3/ws/maven-shade-plugin/target/it/non-runtime-scope-excluded/verify.bsh>
[INFO] ..SUCCESS (3.7 s)
[INFO] Building: reloc-anno/pom.xml
[INFO] ..SUCCESS (3.3 s)
[INFO] Building: mini-jar-respect-includes/pom.xml
[INFO] run script <https://builds.apache.org/job/maven-plugins-ITs-m3/ws/maven-shade-plugin/target/it/mini-jar-respect-includes/verify.bsh>
[INFO] ..SUCCESS (4.2 s)
[INFO] Building: empty-relocation-pattern/pom.xml
[INFO] ..SUCCESS (3.4 s)
[INFO] Building: finalNameBuild/pom.xml
[INFO] run script <https://builds.apache.org/job/maven-plugins-ITs-m3/ws/maven-shade-plugin/target/it/finalNameBuild/setup.bsh>
[INFO] run script <https://builds.apache.org/job/maven-plugins-ITs-m3/ws/maven-shade-plugin/target/it/finalNameBuild/verify.bsh>
[INFO] ..SUCCESS (3.6 s)
[INFO] Building: attached-artifact-type/pom.xml
[INFO] ..SUCCESS (3.4 s)
[INFO] Building: empty-relocation-shaded-pattern/pom.xml
[INFO] ..SUCCESS (3.4 s)
[INFO] Building: reloc-includes-excludes/pom.xml
[INFO] run script <https://builds.apache.org/job/maven-plugins-ITs-m3/ws/maven-shade-plugin/target/it/reloc-includes-excludes/verify.bsh>
[INFO] ..SUCCESS (4.2 s)
[INFO] Building: rerun-with-reloc/pom.xml
[INFO] ..SUCCESS (5.7 s)
[INFO] Building: implicit-inclusion-of-project-artifact/pom.xml
[INFO] run script <https://builds.apache.org/job/maven-plugins-ITs-m3/ws/maven-shade-plugin/target/it/implicit-inclusion-of-project-artifact/verify.bsh>
[INFO] ..SUCCESS (3.8 s)
[INFO] Building: duplicate-classes-with-reloc/pom.xml
[INFO] ..SUCCESS (3.0 s)
[INFO] Building: dep-reduced-pom/pom.xml
[INFO] run script <https://builds.apache.org/job/maven-plugins-ITs-m3/ws/maven-shade-plugin/target/it/dep-reduced-pom/verify.groovy>
[INFO] ..SUCCESS (3.6 s)
[INFO] Building: rerun-without-reloc/pom.xml
[INFO] ..SUCCESS (3.5 s)
[INFO] Building: finalNameBuild-attached/pom.xml
[INFO] run script <https://builds.apache.org/job/maven-plugins-ITs-m3/ws/maven-shade-plugin/target/it/finalNameBuild-attached/setup.bsh>
[INFO] run script <https://builds.apache.org/job/maven-plugins-ITs-m3/ws/maven-shade-plugin/target/it/finalNameBuild-attached/verify.bsh>
[INFO] ..SUCCESS (3.5 s)
[INFO] Building: finalNameShade-attached/pom.xml
[INFO] run script <https://builds.apache.org/job/maven-plugins-ITs-m3/ws/maven-shade-plugin/target/it/finalNameShade-attached/setup.bsh>
[INFO] run script <https://builds.apache.org/job/maven-plugins-ITs-m3/ws/maven-shade-plugin/target/it/finalNameShade-attached/verify.bsh>
[INFO] ..SUCCESS (3.6 s)
[INFO] Building: shadePomDependency/pom.xml
[INFO] ..SUCCESS (4.6 s)
[INFO] Building: artifact-includes-excludes/pom.xml
[INFO] run script <https://builds.apache.org/job/maven-plugins-ITs-m3/ws/maven-shade-plugin/target/it/artifact-includes-excludes/verify.bsh>
[INFO] ..SUCCESS (3.7 s)
[INFO] Building: reloc-enum-ref-from-anno/pom.xml
[INFO] ..SUCCESS (3.4 s)
[INFO] Building: mini-jar-package-info/pom.xml
[INFO] run script <https://builds.apache.org/job/maven-plugins-ITs-m3/ws/maven-shade-plugin/target/it/mini-jar-package-info/verify.bsh>
[INFO] ..SUCCESS (4.4 s)
[INFO] Building: project-with-reactors-included/pom.xml
[INFO] run script <https://builds.apache.org/job/maven-plugins-ITs-m3/ws/maven-shade-plugin/target/it/project-with-reactors-included/verify.bsh>
[INFO] ..SUCCESS (5.4 s)
[INFO] Building: dep-reduced-pom-with-local-parent/pom.xml
[INFO] ..SUCCESS (2.8 s)
[INFO] Building: mini-jar/pom.xml
[INFO] run script <https://builds.apache.org/job/maven-plugins-ITs-m3/ws/maven-shade-plugin/target/it/mini-jar/verify.bsh>
[INFO] ..SUCCESS (4.1 s)
[INFO] Building: dep-reduced-pom-unique/pom.xml
[INFO] run script <https://builds.apache.org/job/maven-plugins-ITs-m3/ws/maven-shade-plugin/target/it/dep-reduced-pom-unique/verify.groovy>
[INFO] ..SUCCESS (4.2 s)
[INFO] Building: mini-jar-malformed-dependencies/pom.xml
[INFO] ..SUCCESS (7.2 s)
[INFO] Building: reloc-abs-resource-path/pom.xml
[INFO] ..SUCCESS (6.5 s)
[INFO] Building: MSHADE-105/pom.xml
[INFO] run script <https://builds.apache.org/job/maven-plugins-ITs-m3/ws/maven-shade-plugin/target/it/MSHADE-105/verify.bsh>
[INFO] ..SUCCESS (9.4 s)
[INFO] Building: mshade-123/pom.xml
[INFO] ..SUCCESS (5.6 s)
[INFO] Building: reloc-class-from-string-pool/pom.xml
[INFO] ..SUCCESS (3.2 s)
[INFO] Building: users-shader-impl/pom.xml
[INFO] run script <https://builds.apache.org/job/maven-plugins-ITs-m3/ws/maven-shade-plugin/target/it/users-shader-impl/verify.groovy>
[INFO] ..SUCCESS (4.1 s)
[INFO] Building: empty-apache-notice-transform/pom.xml
[INFO] ..SUCCESS (4.3 s)
[INFO] Building: dep-reduced-pom-relocated-result/pom.xml
[INFO] ..SUCCESS (2.7 s)
[INFO]
[INFO] --- maven-invoker-plugin:1.6:verify (integration-test) @ maven-shade-plugin ---
[INFO] -------------------------------------------------
[INFO] Build Summary:
[INFO] Passed: 41, Failed: 0, Errors: 0, Skipped: 0
[INFO] -------------------------------------------------
[INFO]
[INFO] --- maven-install-plugin:2.3.1:install (default-install) @ maven-shade-plugin ---
[INFO] Installing <https://builds.apache.org/job/maven-plugins-ITs-m3/ws/maven-shade-plugin/target/maven-shade-plugin-2.0.1-SNAPSHOT.jar> to /home/jenkins/.m2/repository/org/apache/maven/plugins/maven-shade-plugin/2.0.1-SNAPSHOT/maven-shade-plugin-2.0.1-SNAPSHOT.jar
[INFO] Installing <https://builds.apache.org/job/maven-plugins-ITs-m3/ws/maven-shade-plugin/pom.xml> to /home/jenkins/.m2/repository/org/apache/maven/plugins/maven-shade-plugin/2.0.1-SNAPSHOT/maven-shade-plugin-2.0.1-SNAPSHOT.pom
[INFO] Installing <https://builds.apache.org/job/maven-plugins-ITs-m3/ws/maven-shade-plugin/target/maven-shade-plugin-2.0.1-SNAPSHOT-tests.jar> to /home/jenkins/.m2/repository/org/apache/maven/plugins/maven-shade-plugin/2.0.1-SNAPSHOT/maven-shade-plugin-2.0.1-SNAPSHOT-tests.jar
[INFO]
[INFO] ------------------------------------------------------------------------
[INFO] Building Maven Plugins Aggregator 1-SNAPSHOT
[INFO] ------------------------------------------------------------------------
[INFO]
[INFO] --- maven-clean-plugin:2.4.1:clean (default-clean) @ maven-plugins-aggregator ---
[INFO] Deleting <https://builds.apache.org/job/maven-plugins-ITs-m3/ws/target>
[INFO]
[INFO] --- maven-remote-resources-plugin:1.1:process (default) @ maven-plugins-aggregator ---
[INFO]
[INFO] --- maven-install-plugin:2.3.1:install (default-install) @ maven-plugins-aggregator ---
[INFO] Installing <https://builds.apache.org/job/maven-plugins-ITs-m3/ws/pom.xml> to /home/jenkins/.m2/repository/org/apache/maven/plugins/maven-plugins-aggregator/1-SNAPSHOT/maven-plugins-aggregator-1-SNAPSHOT.pom
[INFO] ------------------------------------------------------------------------
[INFO] Reactor Summary:
[INFO]
[INFO] Maven Plugins ..................................... SUCCESS [11.774s]
[INFO] Maven ACR Plugin .................................. SUCCESS [21.958s]
[INFO] Maven Ant Plugin .................................. SUCCESS [1:09.471s]
[INFO] Maven AntRun Plugin ............................... SUCCESS [56.089s]
[INFO] Maven Eclipse Plugin .............................. SUCCESS [6:49.712s]
[INFO] Maven Assembly Plugin ............................. SUCCESS [11:02.354s]
[INFO] Maven Changelog Plugin ............................ FAILURE [9.193s]
[INFO] Maven Changes Report Plugin ....................... SUCCESS [59.432s]
[INFO] Maven Checkstyle Plugin ........................... SUCCESS [1:41.283s]
[INFO] Maven Clean Plugin ................................ SUCCESS [19.972s]
[INFO] Maven Compiler Plugin ............................. SUCCESS [43.065s]
[INFO] Maven Dependency Plugin ........................... SUCCESS [2:17.920s]
[INFO] Maven Deploy Plugin ............................... SUCCESS [1:03.571s]
[INFO] Maven DOAP Plugin ................................. SUCCESS [17.372s]
[INFO] Maven Documentation Checker Plugin ................ SUCCESS [7.195s]
[INFO] Maven EAR Plugin .................................. SUCCESS [3:51.651s]
[INFO] Maven EJB Plugin .................................. SUCCESS [27.662s]
[INFO] Maven GPG Plugin .................................. SUCCESS [10.576s]
[INFO] Maven Help Plugin ................................. SUCCESS [36.492s]
[INFO] Maven IDEA Plugin ................................. SUCCESS [7.873s]
[INFO] Maven Install Plugin .............................. SUCCESS [40.792s]
[INFO] Maven JAR Plugin .................................. SUCCESS [1:09.780s]
[INFO] Maven Jarsigner Plugin ............................ SUCCESS [25.397s]
[INFO] Maven Javadoc Plugin .............................. SUCCESS [3:02.704s]
[INFO] Maven Linkcheck Plugin ............................ SUCCESS [2.708s]
[INFO] Maven One Plugin .................................. SUCCESS [1.560s]
[INFO] Maven Patch Plugin ................................ SUCCESS [12.595s]
[INFO] Maven PDF Plugin .................................. SUCCESS [32.004s]
[INFO] Maven PMD Plugin .................................. SUCCESS [38.580s]
[INFO] Maven RAR Plugin .................................. SUCCESS [10.398s]
[INFO] Maven Reactor Plugin .............................. SUCCESS [2.407s]
[INFO] Maven Repository Plugin ........................... SUCCESS [38.856s]
[INFO] Maven Resources Plugin ............................ SUCCESS [55.536s]
[INFO] Maven Site Plugin 3 ............................... SUCCESS [6:25.661s]
[INFO] Maven Source Plugin ............................... SUCCESS [44.414s]
[INFO] Maven Stage Plugin ................................ SUCCESS [1.712s]
[INFO] Maven Toolchains Plugin ........................... SUCCESS [1.974s]
[INFO] Maven Verifier Plugin ............................. SUCCESS [15.777s]
[INFO] Maven WAR Plugin .................................. SUCCESS [1:17.111s]
[INFO] SCM Publish Maven Plugin .......................... SUCCESS [1:08.906s]
[INFO] Maven Invoker Plugin .............................. SUCCESS [4:03.061s]
[INFO] Maven Project Info Reports Plugin ................. SUCCESS [2:30.803s]
[INFO] Maven Remote Resources Plugin ..................... SUCCESS [57.585s]
[INFO] Maven Shade Plugin ................................ SUCCESS [3:04.388s]
[INFO] Maven Plugins Aggregator .......................... SUCCESS [0.058s]
[INFO] ------------------------------------------------------------------------
[INFO] BUILD FAILURE
[INFO] ------------------------------------------------------------------------
[INFO] Total time: 1:02:31.689s
[INFO] Finished at: Sat Sep 22 20:17:58 UTC 2012
[INFO] Final Memory: 82M/313M
[INFO] ------------------------------------------------------------------------
[WARNING] The requested profile "apache.snapshots" could not be activated because it does not exist.
[ERROR] Failed to execute goal org.apache.maven.plugins:maven-surefire-plugin:2.12:test (default-test) on project maven-changelog-plugin: There are test failures.
[ERROR]
[ERROR] Please refer to <https://builds.apache.org/job/maven-plugins-ITs-m3/ws/maven-changelog-plugin/target/surefire-reports> for the individual test results.
[ERROR] -> [Help 1]
[ERROR]
[ERROR] To see the full stack trace of the errors, re-run Maven with the -e switch.
[ERROR] Re-run Maven using the -X switch to enable full debug logging.
[ERROR]
[ERROR] For more information about the errors and possible solutions, please read the following articles:
[ERROR] [Help 1] http://cwiki.apache.org/confluence/display/MAVEN/MojoFailureException
[ERROR]
[ERROR] After correcting the problems, you can resume the build with the command
[ERROR] mvn <goals> -rf :maven-changelog-plugin
Build step 'Invoke top-level Maven targets' marked build as failure
Recording test results