You are viewing a plain text version of this content. The canonical link for it is here.
Posted to commits@jena.apache.org by Apache Jenkins Server <je...@builds.apache.org> on 2026/10/08 08:04:08 UTC
Build failed in Jenkins: Jena » Jena Development Test #1856
See <https://ci-builds.apache.org/job/Jena/job/Jena%20Development%20Test/1856/display/redirect>
Changes:
------------------------------------------
Started by an SCM change
Running as SYSTEM
[EnvInject] - Loading node environment variables.
Building remotely on builds37 (ubuntu) in workspace <https://ci-builds.apache.org/job/Jena/job/Jena%20Development%20Test/ws/>
The recommended git tool is: NONE
No credentials specified
> git rev-parse --resolve-git-dir <https://ci-builds.apache.org/job/Jena/job/Jena%20Development%20Test/ws/.git> # timeout=10
Fetching changes from the remote Git repository
> git config remote.origin.url https://github.com/apache/jena # timeout=10
Fetching upstream changes from https://github.com/apache/jena
> git --version # timeout=10
> git --version # 'git version 2.34.1'
> git fetch --tags --force --progress -- https://github.com/apache/jena +refs/heads/*:refs/remotes/origin/* # timeout=10
ERROR: Error fetching remote repo 'origin'
hudson.plugins.git.GitException: Failed to fetch from https://github.com/apache/jena
at PluginClassLoader for git//hudson.plugins.git.GitSCM.fetchFrom(GitSCM.java:997)
at PluginClassLoader for git//hudson.plugins.git.GitSCM.retrieveChanges(GitSCM.java:1239)
at PluginClassLoader for git//hudson.plugins.git.GitSCM._checkout(GitSCM.java:1310)
at PluginClassLoader for git//hudson.plugins.git.GitSCM.checkout(GitSCM.java:1277)
at hudson.scm.SCM.checkout(SCM.java:540)
at hudson.model.AbstractProject.checkout(AbstractProject.java:1250)
at hudson.model.AbstractBuild$AbstractBuildExecution.defaultCheckout(AbstractBuild.java:649)
at jenkins.scm.SCMCheckoutStrategy.checkout(SCMCheckoutStrategy.java:85)
at hudson.model.AbstractBuild$AbstractBuildExecution.run(AbstractBuild.java:522)
at hudson.model.Run.execute(Run.java:1833)
at PluginClassLoader for maven-plugin//hudson.maven.MavenModuleSetBuild.run(MavenModuleSetBuild.java:543)
at hudson.model.ResourceController.execute(ResourceController.java:101)
at hudson.model.Executor.run(Executor.java:446)
Caused by: hudson.plugins.git.GitException: Command "git fetch --tags --force --progress -- https://github.com/apache/jena +refs/heads/*:refs/remotes/origin/*" returned status code 128:
stdout:
stderr: error: object file .git/objects/a4/ed0f9fb9389e9298d6d131c33bb1c7d21719ef is empty
fatal: loose object a4ed0f9fb9389e9298d6d131c33bb1c7d21719ef (stored in .git/objects/a4/ed0f9fb9389e9298d6d131c33bb1c7d21719ef) is corrupt
at PluginClassLoader for git-client//org.jenkinsci.plugins.gitclient.CliGitAPIImpl.launchCommandIn(CliGitAPIImpl.java:2848)
at PluginClassLoader for git-client//org.jenkinsci.plugins.gitclient.CliGitAPIImpl.launchCommandWithCredentials(CliGitAPIImpl.java:2184)
at PluginClassLoader for git-client//org.jenkinsci.plugins.gitclient.CliGitAPIImpl$1.execute(CliGitAPIImpl.java:635)
at PluginClassLoader for git-client//org.jenkinsci.plugins.gitclient.RemoteGitImpl$CommandInvocationHandler$GitCommandMasterToSlaveCallable.call(RemoteGitImpl.java:170)
at PluginClassLoader for git-client//org.jenkinsci.plugins.gitclient.RemoteGitImpl$CommandInvocationHandler$GitCommandMasterToSlaveCallable.call(RemoteGitImpl.java:161)
at hudson.remoting.UserRequest.perform(UserRequest.java:225)
at hudson.remoting.UserRequest.perform(UserRequest.java:50)
at hudson.remoting.Request$2.run(Request.java:391)
at hudson.remoting.InterceptingExecutorService.lambda$wrap$0(InterceptingExecutorService.java:81)
at java.base/java.util.concurrent.FutureTask.run(FutureTask.java:264)
at java.base/java.util.concurrent.ThreadPoolExecutor.runWorker(ThreadPoolExecutor.java:1136)
at java.base/java.util.concurrent.ThreadPoolExecutor$Worker.run(ThreadPoolExecutor.java:635)
at java.base/java.lang.Thread.run(Thread.java:840)
Suppressed: hudson.remoting.Channel$CallSiteStackTrace: Remote call to builds37
at hudson.remoting.Channel.attachCallSiteStackTrace(Channel.java:1923)
at hudson.remoting.UserRequest$ExceptionResponse.retrieve(UserRequest.java:384)
at hudson.remoting.Channel.call(Channel.java:1112)
at PluginClassLoader for git-client//org.jenkinsci.plugins.gitclient.RemoteGitImpl$CommandInvocationHandler.execute(RemoteGitImpl.java:153)
at jdk.internal.reflect.GeneratedMethodAccessor873.invoke(Unknown Source)
at java.base/jdk.internal.reflect.DelegatingMethodAccessorImpl.invoke(DelegatingMethodAccessorImpl.java:43)
at java.base/java.lang.reflect.Method.invoke(Method.java:569)
at PluginClassLoader for git-client//org.jenkinsci.plugins.gitclient.RemoteGitImpl$CommandInvocationHandler.invoke(RemoteGitImpl.java:138)
at PluginClassLoader for git-client/jdk.proxy131/jdk.proxy131.$Proxy272.execute(Unknown Source)
at PluginClassLoader for git//hudson.plugins.git.GitSCM.fetchFrom(GitSCM.java:995)
at PluginClassLoader for git//hudson.plugins.git.GitSCM.retrieveChanges(GitSCM.java:1239)
at PluginClassLoader for git//hudson.plugins.git.GitSCM._checkout(GitSCM.java:1310)
at PluginClassLoader for git//hudson.plugins.git.GitSCM.checkout(GitSCM.java:1277)
at hudson.scm.SCM.checkout(SCM.java:540)
at hudson.model.AbstractProject.checkout(AbstractProject.java:1250)
at hudson.model.AbstractBuild$AbstractBuildExecution.defaultCheckout(AbstractBuild.java:649)
at jenkins.scm.SCMCheckoutStrategy.checkout(SCMCheckoutStrategy.java:85)
at hudson.model.AbstractBuild$AbstractBuildExecution.run(AbstractBuild.java:522)
at hudson.model.Run.execute(Run.java:1833)
at PluginClassLoader for maven-plugin//hudson.maven.MavenModuleSetBuild.run(MavenModuleSetBuild.java:543)
at hudson.model.ResourceController.execute(ResourceController.java:101)
at hudson.model.Executor.run(Executor.java:446)
ERROR: Error fetching remote repo 'origin'
Build failed in Jenkins: Jena » Jena Development Test #1870
Posted by Apache Jenkins Server <je...@builds.apache.org>.
See <https://ci-builds.apache.org/job/Jena/job/Jena%20Development%20Test/1870/display/redirect?page=changes>
Changes:
[Andy Seaborne] Rename exclusivity lock
[Andy Seaborne] GH-4319: More checking of SHACL validation requests
[Andy Seaborne] GH-4317: Context argument to all parsers. Track and limit stack depth.
------------------------------------------
Started by an SCM change
Running as SYSTEM
[EnvInject] - Loading node environment variables.
Building remotely on builds37 (ubuntu) in workspace <https://ci-builds.apache.org/job/Jena/job/Jena%20Development%20Test/ws/>
The recommended git tool is: NONE
No credentials specified
> git rev-parse --resolve-git-dir <https://ci-builds.apache.org/job/Jena/job/Jena%20Development%20Test/ws/.git> # timeout=10
Fetching changes from the remote Git repository
> git config remote.origin.url https://github.com/apache/jena # timeout=10
Fetching upstream changes from https://github.com/apache/jena
> git --version # timeout=10
> git --version # 'git version 2.34.1'
> git fetch --tags --force --progress -- https://github.com/apache/jena +refs/heads/*:refs/remotes/origin/* # timeout=10
> git rev-parse refs/remotes/origin/main^{commit} # timeout=10
Checking out Revision c490a5729d5f07d2eec25ac6cdb1354a09c97685 (refs/remotes/origin/main)
> git config core.sparsecheckout # timeout=10
> git checkout -f c490a5729d5f07d2eec25ac6cdb1354a09c97685 # timeout=10
Commit message: "GH-4317: Context argument to all parsers. Track and limit stack depth."
> git rev-list --no-walk 964e36044f05ac6547cdf566ff4a857b2a6a33ea # timeout=10
Parsing POMs
ERROR: Failed to parse POMs
hudson.remoting.ProxyException: hudson.maven.MavenModuleSetBuild$MavenExecutionException: org.apache.maven.project.ProjectBuildingException: Some problems were encountered while processing the POMs:
[FATAL] Non-readable POM /home/jenkins/.m2/repository/org/apache/apache/40/apache-40.pom: input contained no data @ /home/jenkins/.m2/repository/org/apache/apache/40/apache-40.pom
at PluginClassLoader for maven-plugin//hudson.maven.MavenModuleSetBuild$PomParser.invoke(MavenModuleSetBuild.java:1391)
at PluginClassLoader for maven-plugin//hudson.maven.MavenModuleSetBuild$PomParser.invoke(MavenModuleSetBuild.java:1124)
at hudson.FilePath$FileCallableWrapper.call(FilePath.java:3614)
at hudson.remoting.UserRequest.perform(UserRequest.java:225)
at hudson.remoting.UserRequest.perform(UserRequest.java:50)
at hudson.remoting.Request$2.run(Request.java:391)
at hudson.remoting.InterceptingExecutorService.lambda$wrap$0(InterceptingExecutorService.java:81)
at java.base/java.util.concurrent.FutureTask.run(FutureTask.java:264)
at java.base/java.util.concurrent.ThreadPoolExecutor.runWorker(ThreadPoolExecutor.java:1136)
at java.base/java.util.concurrent.ThreadPoolExecutor$Worker.run(ThreadPoolExecutor.java:635)
at java.base/java.lang.Thread.run(Thread.java:840)
Suppressed: hudson.remoting.Channel$CallSiteStackTrace: Remote call to builds37
at hudson.remoting.Channel.attachCallSiteStackTrace(Channel.java:1923)
at hudson.remoting.UserRequest$ExceptionResponse.retrieve(UserRequest.java:384)
at hudson.remoting.Channel.call(Channel.java:1112)
at hudson.FilePath.act(FilePath.java:1228)
at hudson.FilePath.act(FilePath.java:1217)
at PluginClassLoader for maven-plugin//hudson.maven.MavenModuleSetBuild$MavenModuleSetBuildExecution.parsePoms(MavenModuleSetBuild.java:985)
at PluginClassLoader for maven-plugin//hudson.maven.MavenModuleSetBuild$MavenModuleSetBuildExecution.doRun(MavenModuleSetBuild.java:689)
at hudson.model.AbstractBuild$AbstractBuildExecution.run(AbstractBuild.java:527)
at hudson.model.Run.execute(Run.java:1833)
at PluginClassLoader for maven-plugin//hudson.maven.MavenModuleSetBuild.run(MavenModuleSetBuild.java:543)
at hudson.model.ResourceController.execute(ResourceController.java:101)
at hudson.model.Executor.run(Executor.java:446)
Caused by: hudson.remoting.ProxyException: org.apache.maven.project.ProjectBuildingException: Some problems were encountered while processing the POMs:
[FATAL] Non-readable POM /home/jenkins/.m2/repository/org/apache/apache/40/apache-40.pom: input contained no data @ /home/jenkins/.m2/repository/org/apache/apache/40/apache-40.pom
at PluginClassLoader for maven-plugin//org.apache.maven.project.DefaultProjectBuilder.build(DefaultProjectBuilder.java:397)
at PluginClassLoader for maven-plugin//hudson.maven.MavenEmbedder.buildProjects(MavenEmbedder.java:370)
at PluginClassLoader for maven-plugin//hudson.maven.MavenEmbedder.readProjects(MavenEmbedder.java:340)
at PluginClassLoader for maven-plugin//hudson.maven.MavenModuleSetBuild$PomParser.invoke(MavenModuleSetBuild.java:1330)
... 10 more
Build failed in Jenkins: Jena » Jena Development Test #1869
Posted by Apache Jenkins Server <je...@builds.apache.org>.
See <https://ci-builds.apache.org/job/Jena/job/Jena%20Development%20Test/1869/display/redirect>
Changes:
------------------------------------------
Started by user Andy Seaborne
Running as SYSTEM
[EnvInject] - Loading node environment variables.
Building remotely on builds37 (ubuntu) in workspace <https://ci-builds.apache.org/job/Jena/job/Jena%20Development%20Test/ws/>
The recommended git tool is: NONE
No credentials specified
Cloning the remote Git repository
Cloning repository https://github.com/apache/jena
> git init <https://ci-builds.apache.org/job/Jena/job/Jena%20Development%20Test/ws/> # timeout=10
Fetching upstream changes from https://github.com/apache/jena
> git --version # timeout=10
> git --version # 'git version 2.34.1'
> git fetch --tags --force --progress -- https://github.com/apache/jena +refs/heads/*:refs/remotes/origin/* # timeout=10
> git config remote.origin.url https://github.com/apache/jena # timeout=10
> git config --add remote.origin.fetch +refs/heads/*:refs/remotes/origin/* # timeout=10
Avoid second fetch
> git rev-parse refs/remotes/origin/main^{commit} # timeout=10
Checking out Revision 964e36044f05ac6547cdf566ff4a857b2a6a33ea (refs/remotes/origin/main)
> git config core.sparsecheckout # timeout=10
> git checkout -f 964e36044f05ac6547cdf566ff4a857b2a6a33ea # timeout=10
Commit message: "Update org.apache.thrift:libthrift from 0.24.0 to 0.25.0"
> git rev-list --no-walk 964e36044f05ac6547cdf566ff4a857b2a6a33ea # timeout=10
Parsing POMs
ERROR: Failed to parse POMs
hudson.remoting.ProxyException: hudson.maven.MavenModuleSetBuild$MavenExecutionException: org.apache.maven.project.ProjectBuildingException: Some problems were encountered while processing the POMs:
[FATAL] Non-readable POM /home/jenkins/.m2/repository/org/apache/apache/40/apache-40.pom: input contained no data @ /home/jenkins/.m2/repository/org/apache/apache/40/apache-40.pom
at PluginClassLoader for maven-plugin//hudson.maven.MavenModuleSetBuild$PomParser.invoke(MavenModuleSetBuild.java:1391)
at PluginClassLoader for maven-plugin//hudson.maven.MavenModuleSetBuild$PomParser.invoke(MavenModuleSetBuild.java:1124)
at hudson.FilePath$FileCallableWrapper.call(FilePath.java:3614)
at hudson.remoting.UserRequest.perform(UserRequest.java:225)
at hudson.remoting.UserRequest.perform(UserRequest.java:50)
at hudson.remoting.Request$2.run(Request.java:391)
at hudson.remoting.InterceptingExecutorService.lambda$wrap$0(InterceptingExecutorService.java:81)
at java.base/java.util.concurrent.FutureTask.run(FutureTask.java:264)
at java.base/java.util.concurrent.ThreadPoolExecutor.runWorker(ThreadPoolExecutor.java:1136)
at java.base/java.util.concurrent.ThreadPoolExecutor$Worker.run(ThreadPoolExecutor.java:635)
at java.base/java.lang.Thread.run(Thread.java:840)
Suppressed: hudson.remoting.Channel$CallSiteStackTrace: Remote call to builds37
at hudson.remoting.Channel.attachCallSiteStackTrace(Channel.java:1923)
at hudson.remoting.UserRequest$ExceptionResponse.retrieve(UserRequest.java:384)
at hudson.remoting.Channel.call(Channel.java:1112)
at hudson.FilePath.act(FilePath.java:1228)
at hudson.FilePath.act(FilePath.java:1217)
at PluginClassLoader for maven-plugin//hudson.maven.MavenModuleSetBuild$MavenModuleSetBuildExecution.parsePoms(MavenModuleSetBuild.java:985)
at PluginClassLoader for maven-plugin//hudson.maven.MavenModuleSetBuild$MavenModuleSetBuildExecution.doRun(MavenModuleSetBuild.java:689)
at hudson.model.AbstractBuild$AbstractBuildExecution.run(AbstractBuild.java:527)
at hudson.model.Run.execute(Run.java:1833)
at PluginClassLoader for maven-plugin//hudson.maven.MavenModuleSetBuild.run(MavenModuleSetBuild.java:543)
at hudson.model.ResourceController.execute(ResourceController.java:101)
at hudson.model.Executor.run(Executor.java:446)
Caused by: hudson.remoting.ProxyException: org.apache.maven.project.ProjectBuildingException: Some problems were encountered while processing the POMs:
[FATAL] Non-readable POM /home/jenkins/.m2/repository/org/apache/apache/40/apache-40.pom: input contained no data @ /home/jenkins/.m2/repository/org/apache/apache/40/apache-40.pom
at PluginClassLoader for maven-plugin//org.apache.maven.project.DefaultProjectBuilder.build(DefaultProjectBuilder.java:397)
at PluginClassLoader for maven-plugin//hudson.maven.MavenEmbedder.buildProjects(MavenEmbedder.java:370)
at PluginClassLoader for maven-plugin//hudson.maven.MavenEmbedder.readProjects(MavenEmbedder.java:340)
at PluginClassLoader for maven-plugin//hudson.maven.MavenModuleSetBuild$PomParser.invoke(MavenModuleSetBuild.java:1330)
... 10 more
Build failed in Jenkins: Jena » Jena Development Test #1868
Posted by Apache Jenkins Server <je...@builds.apache.org>.
See <https://ci-builds.apache.org/job/Jena/job/Jena%20Development%20Test/1868/display/redirect?page=changes>
Changes:
[Andy Seaborne] Update org.apache.thrift:libthrift from 0.24.0 to 0.25.0
------------------------------------------
Started by an SCM change
Running as SYSTEM
[EnvInject] - Loading node environment variables.
Building remotely on builds37 (ubuntu) in workspace <https://ci-builds.apache.org/job/Jena/job/Jena%20Development%20Test/ws/>
The recommended git tool is: NONE
No credentials specified
> git rev-parse --resolve-git-dir <https://ci-builds.apache.org/job/Jena/job/Jena%20Development%20Test/ws/.git> # timeout=10
Fetching changes from the remote Git repository
> git config remote.origin.url https://github.com/apache/jena # timeout=10
Fetching upstream changes from https://github.com/apache/jena
> git --version # timeout=10
> git --version # 'git version 2.34.1'
> git fetch --tags --force --progress -- https://github.com/apache/jena +refs/heads/*:refs/remotes/origin/* # timeout=10
> git rev-parse refs/remotes/origin/main^{commit} # timeout=10
Checking out Revision 964e36044f05ac6547cdf566ff4a857b2a6a33ea (refs/remotes/origin/main)
> git config core.sparsecheckout # timeout=10
> git checkout -f 964e36044f05ac6547cdf566ff4a857b2a6a33ea # timeout=10
Commit message: "Update org.apache.thrift:libthrift from 0.24.0 to 0.25.0"
> git rev-list --no-walk 84d2d5328a81dcdea776e020441fb2d7f2f25453 # timeout=10
Parsing POMs
ERROR: Failed to parse POMs
hudson.remoting.ProxyException: hudson.maven.MavenModuleSetBuild$MavenExecutionException: org.apache.maven.project.ProjectBuildingException: Some problems were encountered while processing the POMs:
[FATAL] Non-readable POM /home/jenkins/.m2/repository/org/apache/apache/40/apache-40.pom: input contained no data @ /home/jenkins/.m2/repository/org/apache/apache/40/apache-40.pom
at PluginClassLoader for maven-plugin//hudson.maven.MavenModuleSetBuild$PomParser.invoke(MavenModuleSetBuild.java:1391)
at PluginClassLoader for maven-plugin//hudson.maven.MavenModuleSetBuild$PomParser.invoke(MavenModuleSetBuild.java:1124)
at hudson.FilePath$FileCallableWrapper.call(FilePath.java:3614)
at hudson.remoting.UserRequest.perform(UserRequest.java:225)
at hudson.remoting.UserRequest.perform(UserRequest.java:50)
at hudson.remoting.Request$2.run(Request.java:391)
at hudson.remoting.InterceptingExecutorService.lambda$wrap$0(InterceptingExecutorService.java:81)
at java.base/java.util.concurrent.FutureTask.run(FutureTask.java:264)
at java.base/java.util.concurrent.ThreadPoolExecutor.runWorker(ThreadPoolExecutor.java:1136)
at java.base/java.util.concurrent.ThreadPoolExecutor$Worker.run(ThreadPoolExecutor.java:635)
at java.base/java.lang.Thread.run(Thread.java:840)
Suppressed: hudson.remoting.Channel$CallSiteStackTrace: Remote call to builds37
at hudson.remoting.Channel.attachCallSiteStackTrace(Channel.java:1923)
at hudson.remoting.UserRequest$ExceptionResponse.retrieve(UserRequest.java:384)
at hudson.remoting.Channel.call(Channel.java:1112)
at hudson.FilePath.act(FilePath.java:1228)
at hudson.FilePath.act(FilePath.java:1217)
at PluginClassLoader for maven-plugin//hudson.maven.MavenModuleSetBuild$MavenModuleSetBuildExecution.parsePoms(MavenModuleSetBuild.java:985)
at PluginClassLoader for maven-plugin//hudson.maven.MavenModuleSetBuild$MavenModuleSetBuildExecution.doRun(MavenModuleSetBuild.java:689)
at hudson.model.AbstractBuild$AbstractBuildExecution.run(AbstractBuild.java:527)
at hudson.model.Run.execute(Run.java:1833)
at PluginClassLoader for maven-plugin//hudson.maven.MavenModuleSetBuild.run(MavenModuleSetBuild.java:543)
at hudson.model.ResourceController.execute(ResourceController.java:101)
at hudson.model.Executor.run(Executor.java:446)
Caused by: hudson.remoting.ProxyException: org.apache.maven.project.ProjectBuildingException: Some problems were encountered while processing the POMs:
[FATAL] Non-readable POM /home/jenkins/.m2/repository/org/apache/apache/40/apache-40.pom: input contained no data @ /home/jenkins/.m2/repository/org/apache/apache/40/apache-40.pom
at PluginClassLoader for maven-plugin//org.apache.maven.project.DefaultProjectBuilder.build(DefaultProjectBuilder.java:397)
at PluginClassLoader for maven-plugin//hudson.maven.MavenEmbedder.buildProjects(MavenEmbedder.java:370)
at PluginClassLoader for maven-plugin//hudson.maven.MavenEmbedder.readProjects(MavenEmbedder.java:340)
at PluginClassLoader for maven-plugin//hudson.maven.MavenModuleSetBuild$PomParser.invoke(MavenModuleSetBuild.java:1330)
... 10 more
Build failed in Jenkins: Jena » Jena Development Test #1867
Posted by Apache Jenkins Server <je...@builds.apache.org>.
See <https://ci-builds.apache.org/job/Jena/job/Jena%20Development%20Test/1867/display/redirect?page=changes>
Changes:
[Andy Seaborne] Bump com.google.guava:guava
[Andy Seaborne] Bump commons-codec:commons-codec
[Andy Seaborne] Bump org.seleniumhq.selenium:selenium-java from 4.49.0 to 4.50.0
[Andy Seaborne] Bump com.esotericsoftware.kryo:kryo5 from 5.6.2 to 5.7.0
------------------------------------------
Started by an SCM change
Running as SYSTEM
[EnvInject] - Loading node environment variables.
Building remotely on builds37 (ubuntu) in workspace <https://ci-builds.apache.org/job/Jena/job/Jena%20Development%20Test/ws/>
The recommended git tool is: NONE
No credentials specified
> git rev-parse --resolve-git-dir <https://ci-builds.apache.org/job/Jena/job/Jena%20Development%20Test/ws/.git> # timeout=10
Fetching changes from the remote Git repository
> git config remote.origin.url https://github.com/apache/jena # timeout=10
Fetching upstream changes from https://github.com/apache/jena
> git --version # timeout=10
> git --version # 'git version 2.34.1'
> git fetch --tags --force --progress -- https://github.com/apache/jena +refs/heads/*:refs/remotes/origin/* # timeout=10
> git rev-parse refs/remotes/origin/main^{commit} # timeout=10
Checking out Revision 84d2d5328a81dcdea776e020441fb2d7f2f25453 (refs/remotes/origin/main)
> git config core.sparsecheckout # timeout=10
> git checkout -f 84d2d5328a81dcdea776e020441fb2d7f2f25453 # timeout=10
Commit message: "Bump com.esotericsoftware.kryo:kryo5 from 5.6.2 to 5.7.0"
> git rev-list --no-walk b126bb8f2d721175d5d5eae42d822b2cda40a080 # timeout=10
Parsing POMs
ERROR: Failed to parse POMs
hudson.remoting.ProxyException: hudson.maven.MavenModuleSetBuild$MavenExecutionException: org.apache.maven.project.ProjectBuildingException: Some problems were encountered while processing the POMs:
[FATAL] Non-readable POM /home/jenkins/.m2/repository/org/apache/apache/40/apache-40.pom: input contained no data @ /home/jenkins/.m2/repository/org/apache/apache/40/apache-40.pom
at PluginClassLoader for maven-plugin//hudson.maven.MavenModuleSetBuild$PomParser.invoke(MavenModuleSetBuild.java:1391)
at PluginClassLoader for maven-plugin//hudson.maven.MavenModuleSetBuild$PomParser.invoke(MavenModuleSetBuild.java:1124)
at hudson.FilePath$FileCallableWrapper.call(FilePath.java:3614)
at hudson.remoting.UserRequest.perform(UserRequest.java:225)
at hudson.remoting.UserRequest.perform(UserRequest.java:50)
at hudson.remoting.Request$2.run(Request.java:391)
at hudson.remoting.InterceptingExecutorService.lambda$wrap$0(InterceptingExecutorService.java:81)
at java.base/java.util.concurrent.FutureTask.run(FutureTask.java:264)
at java.base/java.util.concurrent.ThreadPoolExecutor.runWorker(ThreadPoolExecutor.java:1136)
at java.base/java.util.concurrent.ThreadPoolExecutor$Worker.run(ThreadPoolExecutor.java:635)
at java.base/java.lang.Thread.run(Thread.java:840)
Suppressed: hudson.remoting.Channel$CallSiteStackTrace: Remote call to builds37
at hudson.remoting.Channel.attachCallSiteStackTrace(Channel.java:1923)
at hudson.remoting.UserRequest$ExceptionResponse.retrieve(UserRequest.java:384)
at hudson.remoting.Channel.call(Channel.java:1112)
at hudson.FilePath.act(FilePath.java:1228)
at hudson.FilePath.act(FilePath.java:1217)
at PluginClassLoader for maven-plugin//hudson.maven.MavenModuleSetBuild$MavenModuleSetBuildExecution.parsePoms(MavenModuleSetBuild.java:985)
at PluginClassLoader for maven-plugin//hudson.maven.MavenModuleSetBuild$MavenModuleSetBuildExecution.doRun(MavenModuleSetBuild.java:689)
at hudson.model.AbstractBuild$AbstractBuildExecution.run(AbstractBuild.java:527)
at hudson.model.Run.execute(Run.java:1833)
at PluginClassLoader for maven-plugin//hudson.maven.MavenModuleSetBuild.run(MavenModuleSetBuild.java:543)
at hudson.model.ResourceController.execute(ResourceController.java:101)
at hudson.model.Executor.run(Executor.java:446)
Caused by: hudson.remoting.ProxyException: org.apache.maven.project.ProjectBuildingException: Some problems were encountered while processing the POMs:
[FATAL] Non-readable POM /home/jenkins/.m2/repository/org/apache/apache/40/apache-40.pom: input contained no data @ /home/jenkins/.m2/repository/org/apache/apache/40/apache-40.pom
at PluginClassLoader for maven-plugin//org.apache.maven.project.DefaultProjectBuilder.build(DefaultProjectBuilder.java:397)
at PluginClassLoader for maven-plugin//hudson.maven.MavenEmbedder.buildProjects(MavenEmbedder.java:370)
at PluginClassLoader for maven-plugin//hudson.maven.MavenEmbedder.readProjects(MavenEmbedder.java:340)
at PluginClassLoader for maven-plugin//hudson.maven.MavenModuleSetBuild$PomParser.invoke(MavenModuleSetBuild.java:1330)
... 10 more
Build failed in Jenkins: Jena » Jena Development Test #1866
Posted by Apache Jenkins Server <je...@builds.apache.org>.
See <https://ci-builds.apache.org/job/Jena/job/Jena%20Development%20Test/1866/display/redirect?page=changes>
Changes:
[Andy Seaborne] Change GSP tests to allow per-test server configuration
------------------------------------------
Started by an SCM change
Running as SYSTEM
[EnvInject] - Loading node environment variables.
Building remotely on builds37 (ubuntu) in workspace <https://ci-builds.apache.org/job/Jena/job/Jena%20Development%20Test/ws/>
The recommended git tool is: NONE
No credentials specified
> git rev-parse --resolve-git-dir <https://ci-builds.apache.org/job/Jena/job/Jena%20Development%20Test/ws/.git> # timeout=10
Fetching changes from the remote Git repository
> git config remote.origin.url https://github.com/apache/jena # timeout=10
Fetching upstream changes from https://github.com/apache/jena
> git --version # timeout=10
> git --version # 'git version 2.34.1'
> git fetch --tags --force --progress -- https://github.com/apache/jena +refs/heads/*:refs/remotes/origin/* # timeout=10
> git rev-parse refs/remotes/origin/main^{commit} # timeout=10
Checking out Revision b126bb8f2d721175d5d5eae42d822b2cda40a080 (refs/remotes/origin/main)
> git config core.sparsecheckout # timeout=10
> git checkout -f b126bb8f2d721175d5d5eae42d822b2cda40a080 # timeout=10
Commit message: "Change GSP tests to allow per-test server configuration"
> git rev-list --no-walk 3014246b382d2439f4cd81aa72a7383ba0f9b3d5 # timeout=10
Parsing POMs
ERROR: Failed to parse POMs
hudson.remoting.ProxyException: hudson.maven.MavenModuleSetBuild$MavenExecutionException: org.apache.maven.project.ProjectBuildingException: Some problems were encountered while processing the POMs:
[FATAL] Non-readable POM /home/jenkins/.m2/repository/org/apache/apache/40/apache-40.pom: input contained no data @ /home/jenkins/.m2/repository/org/apache/apache/40/apache-40.pom
at PluginClassLoader for maven-plugin//hudson.maven.MavenModuleSetBuild$PomParser.invoke(MavenModuleSetBuild.java:1391)
at PluginClassLoader for maven-plugin//hudson.maven.MavenModuleSetBuild$PomParser.invoke(MavenModuleSetBuild.java:1124)
at hudson.FilePath$FileCallableWrapper.call(FilePath.java:3614)
at hudson.remoting.UserRequest.perform(UserRequest.java:225)
at hudson.remoting.UserRequest.perform(UserRequest.java:50)
at hudson.remoting.Request$2.run(Request.java:391)
at hudson.remoting.InterceptingExecutorService.lambda$wrap$0(InterceptingExecutorService.java:81)
at java.base/java.util.concurrent.FutureTask.run(FutureTask.java:264)
at java.base/java.util.concurrent.ThreadPoolExecutor.runWorker(ThreadPoolExecutor.java:1136)
at java.base/java.util.concurrent.ThreadPoolExecutor$Worker.run(ThreadPoolExecutor.java:635)
at java.base/java.lang.Thread.run(Thread.java:840)
Suppressed: hudson.remoting.Channel$CallSiteStackTrace: Remote call to builds37
at hudson.remoting.Channel.attachCallSiteStackTrace(Channel.java:1923)
at hudson.remoting.UserRequest$ExceptionResponse.retrieve(UserRequest.java:384)
at hudson.remoting.Channel.call(Channel.java:1112)
at hudson.FilePath.act(FilePath.java:1228)
at hudson.FilePath.act(FilePath.java:1217)
at PluginClassLoader for maven-plugin//hudson.maven.MavenModuleSetBuild$MavenModuleSetBuildExecution.parsePoms(MavenModuleSetBuild.java:985)
at PluginClassLoader for maven-plugin//hudson.maven.MavenModuleSetBuild$MavenModuleSetBuildExecution.doRun(MavenModuleSetBuild.java:689)
at hudson.model.AbstractBuild$AbstractBuildExecution.run(AbstractBuild.java:527)
at hudson.model.Run.execute(Run.java:1833)
at PluginClassLoader for maven-plugin//hudson.maven.MavenModuleSetBuild.run(MavenModuleSetBuild.java:543)
at hudson.model.ResourceController.execute(ResourceController.java:101)
at hudson.model.Executor.run(Executor.java:446)
Caused by: hudson.remoting.ProxyException: org.apache.maven.project.ProjectBuildingException: Some problems were encountered while processing the POMs:
[FATAL] Non-readable POM /home/jenkins/.m2/repository/org/apache/apache/40/apache-40.pom: input contained no data @ /home/jenkins/.m2/repository/org/apache/apache/40/apache-40.pom
at PluginClassLoader for maven-plugin//org.apache.maven.project.DefaultProjectBuilder.build(DefaultProjectBuilder.java:397)
at PluginClassLoader for maven-plugin//hudson.maven.MavenEmbedder.buildProjects(MavenEmbedder.java:370)
at PluginClassLoader for maven-plugin//hudson.maven.MavenEmbedder.readProjects(MavenEmbedder.java:340)
at PluginClassLoader for maven-plugin//hudson.maven.MavenModuleSetBuild$PomParser.invoke(MavenModuleSetBuild.java:1330)
... 10 more
Build failed in Jenkins: Jena » Jena Development Test #1865
Posted by Apache Jenkins Server <je...@builds.apache.org>.
See <https://ci-builds.apache.org/job/Jena/job/Jena%20Development%20Test/1865/display/redirect?page=changes>
Changes:
[Andy Seaborne] GH-2805: Implement VERSION for N-Triples and N-Quads parsing
------------------------------------------
Started by an SCM change
Running as SYSTEM
[EnvInject] - Loading node environment variables.
Building remotely on builds37 (ubuntu) in workspace /home/jenkins/jenkins-agent/workspace/Jena/Jena Development Test
The recommended git tool is: NONE
No credentials specified
> git rev-parse --resolve-git-dir /home/jenkins/jenkins-agent/workspace/Jena/Jena Development Test/.git # timeout=10
Fetching changes from the remote Git repository
> git config remote.origin.url https://github.com/apache/jena # timeout=10
Fetching upstream changes from https://github.com/apache/jena
> git --version # timeout=10
> git --version # 'git version 2.34.1'
> git fetch --tags --force --progress -- https://github.com/apache/jena +refs/heads/*:refs/remotes/origin/* # timeout=10
> git rev-parse refs/remotes/origin/main^{commit} # timeout=10
Checking out Revision 3014246b382d2439f4cd81aa72a7383ba0f9b3d5 (refs/remotes/origin/main)
> git config core.sparsecheckout # timeout=10
> git checkout -f 3014246b382d2439f4cd81aa72a7383ba0f9b3d5 # timeout=10
Commit message: "GH-2805: Implement VERSION for N-Triples and N-Quads parsing"
> git rev-list --no-walk e55acc54aa74a20a37f986d145225185dae0b8f2 # timeout=10
Parsing POMs
ERROR: Processing failed due to a bug in the code. Please report this to the issue tracker (https://jenkins.io/redirect/report-an-issue).
hudson.remoting.RequestAbortedException: java.io.IOException: Unexpected termination of the channel
at hudson.remoting.Request.abort(Request.java:358)
at hudson.remoting.Channel.terminate(Channel.java:1196)
at hudson.remoting.SynchronousCommandTransport$ReaderThread.run(SynchronousCommandTransport.java:95)
Suppressed: hudson.remoting.Channel$CallSiteStackTrace: Remote call to builds37
at hudson.remoting.Channel.attachCallSiteStackTrace(Channel.java:1923)
at hudson.remoting.Request.call(Request.java:204)
at hudson.remoting.Channel.call(Channel.java:1111)
at hudson.FilePath.act(FilePath.java:1228)
at hudson.FilePath.act(FilePath.java:1217)
at PluginClassLoader for maven-plugin//hudson.maven.MavenModuleSetBuild$MavenModuleSetBuildExecution.parsePoms(MavenModuleSetBuild.java:985)
at PluginClassLoader for maven-plugin//hudson.maven.MavenModuleSetBuild$MavenModuleSetBuildExecution.doRun(MavenModuleSetBuild.java:689)
at hudson.model.AbstractBuild$AbstractBuildExecution.run(AbstractBuild.java:527)
at hudson.model.Run.execute(Run.java:1833)
at PluginClassLoader for maven-plugin//hudson.maven.MavenModuleSetBuild.run(MavenModuleSetBuild.java:543)
at hudson.model.ResourceController.execute(ResourceController.java:101)
at hudson.model.Executor.run(Executor.java:446)
Caused by: java.io.IOException: Unexpected termination of the channel
at hudson.remoting.SynchronousCommandTransport$ReaderThread.run(SynchronousCommandTransport.java:80)
Caused by: java.io.EOFException
at java.base/java.io.ObjectInputStream$PeekInputStream.readFully(ObjectInputStream.java:2915)
at java.base/java.io.ObjectInputStream$BlockDataInputStream.readShort(ObjectInputStream.java:3410)
at java.base/java.io.ObjectInputStream.readStreamHeader(ObjectInputStream.java:954)
at java.base/java.io.ObjectInputStream.<init>(ObjectInputStream.java:392)
at hudson.remoting.ObjectInputStreamEx.<init>(ObjectInputStreamEx.java:50)
at hudson.remoting.Command.readFrom(Command.java:141)
at hudson.remoting.Command.readFrom(Command.java:127)
at hudson.remoting.AbstractSynchronousByteArrayCommandTransport.read(AbstractSynchronousByteArrayCommandTransport.java:35)
at hudson.remoting.SynchronousCommandTransport$ReaderThread.run(SynchronousCommandTransport.java:62)
project=hudson.maven.MavenModuleSet@7bf45002[Jena/Jena Development Test]
project.getModules()=[hudson.maven.MavenModule@5ef2ab46[Jena/Jena Development Test/org.apache.jena:apache-jena][Jena/Jena Development Test/org.apache.jena:apache-jena][relativePath:apache-jena], hudson.maven.MavenModule@2523fec8[Jena/Jena Development Test/org.apache.jena:apache-jena-fuseki][Jena/Jena Development Test/org.apache.jena:apache-jena-fuseki][relativePath:jena-fuseki2/apache-jena-fuseki], hudson.maven.MavenModule@43cef77d[Jena/Jena Development Test/org.apache.jena:apache-jena-libs][Jena/Jena Development Test/org.apache.jena:apache-jena-libs][relativePath:apache-jena-libs], hudson.maven.MavenModule@33e9ef8c[Jena/Jena Development Test/org.apache.jena:apache-jena-osgi][Jena/Jena Development Test/org.apache.jena:apache-jena-osgi][relativePath:apache-jena-osgi], hudson.maven.MavenModule@788aca2c[Jena/Jena Development Test/org.apache.jena:jena][Jena/Jena Development Test/org.apache.jena:jena][relativePath:], hudson.maven.MavenModule@42e5ae4b[Jena/Jena Development Test/org.apache.jena:jena-arq][Jena/Jena Development Test/org.apache.jena:jena-arq][relativePath:jena-arq], hudson.maven.MavenModule@76a4dc75[Jena/Jena Development Test/org.apache.jena:jena-base][Jena/Jena Development Test/org.apache.jena:jena-base][relativePath:jena-base], hudson.maven.MavenModule@acdd8a2[Jena/Jena Development Test/org.apache.jena:jena-benchmarks][Jena/Jena Development Test/org.apache.jena:jena-benchmarks][relativePath:jena-benchmarks], hudson.maven.MavenModule@2438a87d[Jena/Jena Development Test/org.apache.jena:jena-benchmarks-jmh][Jena/Jena Development Test/org.apache.jena:jena-benchmarks-jmh][relativePath:jena-benchmarks/jena-benchmarks-jmh], hudson.maven.MavenModule@4b40cd47[Jena/Jena Development Test/org.apache.jena:jena-benchmarks-shadedJena480][Jena/Jena Development Test/org.apache.jena:jena-benchmarks-shadedJena480][relativePath:jena-benchmarks/jena-benchmarks-shadedJena480], hudson.maven.MavenModule@1bd7e72e[Jena/Jena Development Test/org.apache.jena:jena-benchmarks-shadedJena510][Jena/Jena Development Test/org.apache.jena:jena-benchmarks-shadedJena510][relativePath:jena-benchmarks/jena-benchmarks-shadedJena510], hudson.maven.MavenModule@7fbb243e[Jena/Jena Development Test/org.apache.jena:jena-benchmarks-shadedJena550][Jena/Jena Development Test/org.apache.jena:jena-benchmarks-shadedJena550][relativePath:jena-benchmarks/jena-benchmarks-shadedJena550], hudson.maven.MavenModule@1e2110f4[Jena/Jena Development Test/org.apache.jena:jena-bom][Jena/Jena Development Test/org.apache.jena:jena-bom][relativePath:jena-bom], hudson.maven.MavenModule@53c6dc82[Jena/Jena Development Test/org.apache.jena:jena-cmds][Jena/Jena Development Test/org.apache.jena:jena-cmds][relativePath:jena-cmds], hudson.maven.MavenModule@778caf43[Jena/Jena Development Test/org.apache.jena:jena-commonsrdf][Jena/Jena Development Test/org.apache.jena:jena-commonsrdf][relativePath:jena-commonsrdf], hudson.maven.MavenModule@51b0ff58[Jena/Jena Development Test/org.apache.jena:jena-core][Jena/Jena Development Test/org.apache.jena:jena-core][relativePath:jena-core], hudson.maven.MavenModule@4780e32a[Jena/Jena Development Test/org.apache.jena:jena-db][Jena/Jena Development Test/org.apache.jena:jena-db][relativePath:jena-db], hudson.maven.MavenModule@22c71594[Jena/Jena Development Test/org.apache.jena:jena-dboe-base][Jena/Jena Development Test/org.apache.jena:jena-dboe-base][relativePath:jena-db/jena-dboe-base], hudson.maven.MavenModule@30a34038[Jena/Jena Development Test/org.apache.jena:jena-dboe-index][Jena/Jena Development Test/org.apache.jena:jena-dboe-index][relativePath:jena-db/jena-dboe-index], hudson.maven.MavenModule@663f334b[Jena/Jena Development Test/org.apache.jena:jena-dboe-index-test][Jena/Jena Development Test/org.apache.jena:jena-dboe-index-test][relativePath:jena-db/jena-dboe-index-test], hudson.maven.MavenModule@26660515[Jena/Jena Development Test/org.apache.jena:jena-dboe-storage][Jena/Jena Development Test/org.apache.jena:jena-dboe-storage][relativePath:jena-db/jena-dboe-storage], hudson.maven.MavenModule@3c97dff8[Jena/Jena Development Test/org.apache.jena:jena-dboe-trans-data][Jena/Jena Development Test/org.apache.jena:jena-dboe-trans-data][relativePath:jena-db/jena-dboe-trans-data], hudson.maven.MavenModule@161fead2[Jena/Jena Development Test/org.apache.jena:jena-dboe-transaction][Jena/Jena Development Test/org.apache.jena:jena-dboe-transaction][relativePath:jena-db/jena-dboe-transaction], hudson.maven.MavenModule@9a53631[Jena/Jena Development Test/org.apache.jena:jena-elephas][Jena/Jena Development Test/org.apache.jena:jena-elephas][relativePath:jena-elephas], hudson.maven.MavenModule@1ffdc4bd[Jena/Jena Development Test/org.apache.jena:jena-elephas-common][Jena/Jena Development Test/org.apache.jena:jena-elephas-common][relativePath:jena-elephas/jena-elephas-common], hudson.maven.MavenModule@1d97a0a5[Jena/Jena Development Test/org.apache.jena:jena-elephas-io][Jena/Jena Development Test/org.apache.jena:jena-elephas-io][relativePath:jena-elephas/jena-elephas-io], hudson.maven.MavenModule@74b780bf[Jena/Jena Development Test/org.apache.jena:jena-elephas-mapreduce][Jena/Jena Development Test/org.apache.jena:jena-elephas-mapreduce][relativePath:jena-elephas/jena-elephas-mapreduce], hudson.maven.MavenModule@540334a6[Jena/Jena Development Test/org.apache.jena:jena-elephas-stats][Jena/Jena Development Test/org.apache.jena:jena-elephas-stats][relativePath:jena-elephas/jena-elephas-stats], hudson.maven.MavenModule@25aacab7[Jena/Jena Development Test/org.apache.jena:jena-examples][Jena/Jena Development Test/org.apache.jena:jena-examples][relativePath:jena-examples], hudson.maven.MavenModule@518d42f[Jena/Jena Development Test/org.apache.jena:jena-extras][Jena/Jena Development Test/org.apache.jena:jena-extras][relativePath:jena-extras], hudson.maven.MavenModule@4de21e4b[Jena/Jena Development Test/org.apache.jena:jena-fuseki][Jena/Jena Development Test/org.apache.jena:jena-fuseki][relativePath:jena-fuseki2], hudson.maven.MavenModule@9b555[Jena/Jena Development Test/org.apache.jena:jena-fuseki-access][Jena/Jena Development Test/org.apache.jena:jena-fuseki-access][relativePath:jena-fuseki2/jena-fuseki-access], hudson.maven.MavenModule@73853891[Jena/Jena Development Test/org.apache.jena:jena-fuseki-core][Jena/Jena Development Test/org.apache.jena:jena-fuseki-core][relativePath:jena-fuseki2/jena-fuseki-core], hudson.maven.MavenModule@30ff2362[Jena/Jena Development Test/org.apache.jena:jena-fuseki-docker][Jena/Jena Development Test/org.apache.jena:jena-fuseki-docker][relativePath:jena-fuseki2/jena-fuseki-docker], hudson.maven.MavenModule@6db26370[Jena/Jena Development Test/org.apache.jena:jena-fuseki-fulljar][Jena/Jena Development Test/org.apache.jena:jena-fuseki-fulljar][relativePath:jena-fuseki2/jena-fuseki-fulljar], hudson.maven.MavenModule@205cc08e[Jena/Jena Development Test/org.apache.jena:jena-fuseki-geosparql][Jena/Jena Development Test/org.apache.jena:jena-fuseki-geosparql][relativePath:jena-fuseki2/jena-fuseki-geosparql], hudson.maven.MavenModule@7a4725a4[Jena/Jena Development Test/org.apache.jena:jena-fuseki-main][Jena/Jena Development Test/org.apache.jena:jena-fuseki-main][relativePath:jena-fuseki2/jena-fuseki-main], hudson.maven.MavenModule@33eaedbd[Jena/Jena Development Test/org.apache.jena:jena-fuseki-mod-geosparql][Jena/Jena Development Test/org.apache.jena:jena-fuseki-mod-geosparql][relativePath:jena-fuseki2/jena-fuseki-mod-geosparql], hudson.maven.MavenModule@4d3db153[Jena/Jena Development Test/org.apache.jena:jena-fuseki-server][Jena/Jena Development Test/org.apache.jena:jena-fuseki-server][relativePath:jena-fuseki2/jena-fuseki-server], hudson.maven.MavenModule@b2340ca[Jena/Jena Development Test/org.apache.jena:jena-fuseki-ui][Jena/Jena Development Test/org.apache.jena:jena-fuseki-ui][relativePath:jena-fuseki2/jena-fuseki-ui], hudson.maven.MavenModule@488a3e0f[Jena/Jena Development Test/org.apache.jena:jena-fuseki-war][Jena/Jena Development Test/org.apache.jena:jena-fuseki-war][relativePath:jena-fuseki2/jena-fuseki-war], hudson.maven.MavenModule@2ce9b5a6[Jena/Jena Development Test/org.apache.jena:jena-fuseki-webapp][Jena/Jena Development Test/org.apache.jena:jena-fuseki-webapp][relativePath:jena-fuseki2/jena-fuseki-webapp], hudson.maven.MavenModule@c7e3e41[Jena/Jena Development Test/org.apache.jena:jena-geosparql][Jena/Jena Development Test/org.apache.jena:jena-geosparql][relativePath:jena-geosparql], hudson.maven.MavenModule@1dca1a14[Jena/Jena Development Test/org.apache.jena:jena-integration-tests][Jena/Jena Development Test/org.apache.jena:jena-integration-tests][relativePath:jena-integration-tests], hudson.maven.MavenModule@4a925e4[Jena/Jena Development Test/org.apache.jena:jena-iri][Jena/Jena Development Test/org.apache.jena:jena-iri][relativePath:jena-iri], hudson.maven.MavenModule@650ce452[Jena/Jena Development Test/org.apache.jena:jena-iri3986][Jena/Jena Development Test/org.apache.jena:jena-iri3986][relativePath:jena-iri3986], hudson.maven.MavenModule@18fd4284[Jena/Jena Development Test/org.apache.jena:jena-jdbc][Jena/Jena Development Test/org.apache.jena:jena-jdbc][relativePath:jena-jdbc], hudson.maven.MavenModule@55aaf135[Jena/Jena Development Test/org.apache.jena:jena-jdbc-core][Jena/Jena Development Test/org.apache.jena:jena-jdbc-core][relativePath:jena-jdbc/jena-jdbc-core], hudson.maven.MavenModule@18616861[Jena/Jena Development Test/org.apache.jena:jena-jdbc-driver-bundle][Jena/Jena Development Test/org.apache.jena:jena-jdbc-driver-bundle][relativePath:jena-jdbc/jena-jdbc-driver-bundle], hudson.maven.MavenModule@1acd214b[Jena/Jena Development Test/org.apache.jena:jena-jdbc-driver-mem][Jena/Jena Development Test/org.apache.jena:jena-jdbc-driver-mem][relativePath:jena-jdbc/jena-jdbc-driver-mem], hudson.maven.MavenModule@6856a9f4[Jena/Jena Development Test/org.apache.jena:jena-jdbc-driver-remote][Jena/Jena Development Test/org.apache.jena:jena-jdbc-driver-remote][relativePath:jena-jdbc/jena-jdbc-driver-remote], hudson.maven.MavenModule@6af7de92[Jena/Jena Development Test/org.apache.jena:jena-jdbc-driver-tdb][Jena/Jena Development Test/org.apache.jena:jena-jdbc-driver-tdb][relativePath:jena-jdbc/jena-jdbc-driver-tdb], hudson.maven.MavenModule@794681cd[Jena/Jena Development Test/org.apache.jena:jena-langtag][Jena/Jena Development Test/org.apache.jena:jena-langtag][relativePath:jena-langtag], hudson.maven.MavenModule@af230d7[Jena/Jena Development Test/org.apache.jena:jena-ontapi][Jena/Jena Development Test/org.apache.jena:jena-ontapi][relativePath:jena-ontapi], hudson.maven.MavenModule@57362174[Jena/Jena Development Test/org.apache.jena:jena-osgi][Jena/Jena Development Test/org.apache.jena:jena-osgi][relativePath:apache-jena-osgi/jena-osgi], hudson.maven.MavenModule@361764e[Jena/Jena Development Test/org.apache.jena:jena-osgi-features][Jena/Jena Development Test/org.apache.jena:jena-osgi-features][relativePath:apache-jena-osgi/jena-osgi-features], hudson.maven.MavenModule@4e64c706[Jena/Jena Development Test/org.apache.jena:jena-permissions][Jena/Jena Development Test/org.apache.jena:jena-permissions][relativePath:jena-permissions], hudson.maven.MavenModule@558b2295[Jena/Jena Development Test/org.apache.jena:jena-querybuilder][Jena/Jena Development Test/org.apache.jena:jena-querybuilder][relativePath:jena-querybuilder], hudson.maven.MavenModule@33d094d1[Jena/Jena Development Test/org.apache.jena:jena-rdfconnection][Jena/Jena Development Test/org.apache.jena:jena-rdfconnection][relativePath:jena-rdfconnection], hudson.maven.MavenModule@6a737399[Jena/Jena Development Test/org.apache.jena:jena-rdfpatch][Jena/Jena Development Test/org.apache.jena:jena-rdfpatch][relativePath:jena-rdfpatch], hudson.maven.MavenModule@3b8b47e3[Jena/Jena Development Test/org.apache.jena:jena-sdb][Jena/Jena Development Test/org.apache.jena:jena-sdb][relativePath:jena-sdb], hudson.maven.MavenModule@533ffb63[Jena/Jena Development Test/org.apache.jena:jena-serviceenhancer][Jena/Jena Development Test/org.apache.jena:jena-serviceenhancer][relativePath:jena-serviceenhancer], hudson.maven.MavenModule@5face41b[Jena/Jena Development Test/org.apache.jena:jena-shacl][Jena/Jena Development Test/org.apache.jena:jena-shacl][relativePath:jena-shacl], hudson.maven.MavenModule@686d8523[Jena/Jena Development Test/org.apache.jena:jena-shaded-guava][Jena/Jena Development Test/org.apache.jena:jena-shaded-guava][relativePath:jena-shaded-guava], hudson.maven.MavenModule@51960e39[Jena/Jena Development Test/org.apache.jena:jena-shex][Jena/Jena Development Test/org.apache.jena:jena-shex][relativePath:jena-shex], hudson.maven.MavenModule@9387392[Jena/Jena Development Test/org.apache.jena:jena-tdb][Jena/Jena Development Test/org.apache.jena:jena-tdb][relativePath:jena-tdb1], hudson.maven.MavenModule@25707535[Jena/Jena Development Test/org.apache.jena:jena-tdb1][Jena/Jena Development Test/org.apache.jena:jena-tdb1][relativePath:jena-tdb1], hudson.maven.MavenModule@1dc4d1bc[Jena/Jena Development Test/org.apache.jena:jena-tdb2][Jena/Jena Development Test/org.apache.jena:jena-tdb2][relativePath:jena-tdb2], hudson.maven.MavenModule@19041bba[Jena/Jena Development Test/org.apache.jena:jena-text][Jena/Jena Development Test/org.apache.jena:jena-text][relativePath:jena-text], hudson.maven.MavenModule@536a5feb[Jena/Jena Development Test/org.apache.jena:jena-text-es][Jena/Jena Development Test/org.apache.jena:jena-text-es][relativePath:jena-text-es]]
project.getRootModule()=hudson.maven.MavenModule@788aca2c[Jena/Jena Development Test/org.apache.jena:jena][Jena/Jena Development Test/org.apache.jena:jena][relativePath:]
FATAL: java.io.IOException: Unexpected termination of the channel
java.io.EOFException
at java.base/java.io.ObjectInputStream$PeekInputStream.readFully(ObjectInputStream.java:2915)
at java.base/java.io.ObjectInputStream$BlockDataInputStream.readShort(ObjectInputStream.java:3410)
at java.base/java.io.ObjectInputStream.readStreamHeader(ObjectInputStream.java:954)
at java.base/java.io.ObjectInputStream.<init>(ObjectInputStream.java:392)
at hudson.remoting.ObjectInputStreamEx.<init>(ObjectInputStreamEx.java:50)
at hudson.remoting.Command.readFrom(Command.java:141)
at hudson.remoting.Command.readFrom(Command.java:127)
at hudson.remoting.AbstractSynchronousByteArrayCommandTransport.read(AbstractSynchronousByteArrayCommandTransport.java:35)
at hudson.remoting.SynchronousCommandTransport$ReaderThread.run(SynchronousCommandTransport.java:62)
Caused: java.io.IOException: Unexpected termination of the channel
at hudson.remoting.SynchronousCommandTransport$ReaderThread.run(SynchronousCommandTransport.java:80)
Also: hudson.remoting.Channel$CallSiteStackTrace: Remote call to builds37
at hudson.remoting.Channel.attachCallSiteStackTrace(Channel.java:1923)
at hudson.remoting.Request.call(Request.java:204)
at hudson.remoting.Channel.call(Channel.java:1111)
at hudson.FilePath.act(FilePath.java:1228)
at hudson.FilePath.act(FilePath.java:1217)
at PluginClassLoader for maven-plugin//hudson.maven.MavenModuleSetBuild$MavenModuleSetBuildExecution.parsePoms(MavenModuleSetBuild.java:985)
at PluginClassLoader for maven-plugin//hudson.maven.MavenModuleSetBuild$MavenModuleSetBuildExecution.doRun(MavenModuleSetBuild.java:689)
at hudson.model.AbstractBuild$AbstractBuildExecution.run(AbstractBuild.java:527)
at hudson.model.Run.execute(Run.java:1833)
at PluginClassLoader for maven-plugin//hudson.maven.MavenModuleSetBuild.run(MavenModuleSetBuild.java:543)
at hudson.model.ResourceController.execute(ResourceController.java:101)
at hudson.model.Executor.run(Executor.java:446)
Caused: hudson.remoting.RequestAbortedException
at hudson.remoting.Request.abort(Request.java:358)
at hudson.remoting.Channel.terminate(Channel.java:1196)
at hudson.remoting.SynchronousCommandTransport$ReaderThread.run(SynchronousCommandTransport.java:95)
ERROR: builds37 is offline; cannot locate jdk_21_latest
ERROR: builds37 is offline; cannot locate maven_latest
ERROR: builds37 is offline; cannot locate jdk_21_latest
ERROR: builds37 is offline; cannot locate maven_latest
Build failed in Jenkins: Jena » Jena Development Test #1864
Posted by Apache Jenkins Server <je...@builds.apache.org>.
See <https://ci-builds.apache.org/job/Jena/job/Jena%20Development%20Test/1864/display/redirect>
Changes:
------------------------------------------
Started by an SCM change
Running as SYSTEM
[EnvInject] - Loading node environment variables.
FATAL: java.io.IOException: Unexpected termination of the channel
java.io.EOFException
at java.base/java.io.ObjectInputStream$PeekInputStream.readFully(ObjectInputStream.java:2915)
at java.base/java.io.ObjectInputStream$BlockDataInputStream.readShort(ObjectInputStream.java:3410)
at java.base/java.io.ObjectInputStream.readStreamHeader(ObjectInputStream.java:954)
at java.base/java.io.ObjectInputStream.<init>(ObjectInputStream.java:392)
at hudson.remoting.ObjectInputStreamEx.<init>(ObjectInputStreamEx.java:50)
at hudson.remoting.Command.readFrom(Command.java:141)
at hudson.remoting.Command.readFrom(Command.java:127)
at hudson.remoting.AbstractSynchronousByteArrayCommandTransport.read(AbstractSynchronousByteArrayCommandTransport.java:35)
at hudson.remoting.SynchronousCommandTransport$ReaderThread.run(SynchronousCommandTransport.java:62)
Caused: java.io.IOException: Unexpected termination of the channel
at hudson.remoting.SynchronousCommandTransport$ReaderThread.run(SynchronousCommandTransport.java:80)
Also: hudson.remoting.Channel$CallSiteStackTrace: Remote call to builds37
at hudson.remoting.Channel.attachCallSiteStackTrace(Channel.java:1923)
at hudson.remoting.Request.call(Request.java:204)
at hudson.remoting.Channel.call(Channel.java:1111)
at hudson.FilePath.act(FilePath.java:1319)
at PluginClassLoader for envinject//org.jenkinsci.plugins.envinject.service.EnvironmentVariablesNodeLoader.gatherEnvVarsForNode(EnvironmentVariablesNodeLoader.java:61)
at PluginClassLoader for envinject//org.jenkinsci.plugins.envinject.EnvInjectListener.loadEnvironmentVariablesNode(EnvInjectListener.java:78)
at PluginClassLoader for envinject//org.jenkinsci.plugins.envinject.EnvInjectListener.setUpEnvironment(EnvInjectListener.java:42)
at hudson.model.AbstractBuild$AbstractBuildExecution.createLauncher(AbstractBuild.java:617)
at hudson.model.AbstractBuild$AbstractBuildExecution.run(AbstractBuild.java:486)
at hudson.model.Run.execute(Run.java:1833)
at PluginClassLoader for maven-plugin//hudson.maven.MavenModuleSetBuild.run(MavenModuleSetBuild.java:543)
at hudson.model.ResourceController.execute(ResourceController.java:101)
at hudson.model.Executor.run(Executor.java:446)
Caused: hudson.remoting.RequestAbortedException
at hudson.remoting.Request.abort(Request.java:358)
at hudson.remoting.Channel.terminate(Channel.java:1196)
at hudson.remoting.SynchronousCommandTransport$ReaderThread.run(SynchronousCommandTransport.java:95)
ERROR: builds37 is offline; cannot locate jdk_21_latest
ERROR: builds37 is offline; cannot locate maven_latest
ERROR: builds37 is offline; cannot locate jdk_21_latest
ERROR: builds37 is offline; cannot locate maven_latest
ERROR: builds37 is offline; cannot locate jdk_21_latest
ERROR: builds37 is offline; cannot locate maven_latest
Build failed in Jenkins: Jena » Jena Development Test #1863
Posted by Apache Jenkins Server <je...@builds.apache.org>.
See <https://ci-builds.apache.org/job/Jena/job/Jena%20Development%20Test/1863/display/redirect?page=changes>
Changes:
[Andy Seaborne] GH-4230: Preserve declared layout of nested WKT collections in geometryN
[Andy Seaborne] GH-4265: Add GeoSPARQL 1.1 area functions
[Andy Seaborne] GH-4265: Support geographic CRS area calculations
[Andy Seaborne] GH-4275: Reject non-finite GeoSPARQL transformation results
[Rob Vesse] Avoid unnecessary math computation
[Rob Vesse] Cap afn:wait() function wait
[Rob Vesse] afn:sprintf() bounds output
[Rob Vesse] Exponentation special cases rejected by pre-validate
[Andy Seaborne] Bump the npm-patch-group group
[Andy Seaborne] Bump wait-on from 9.1.0 to 9.5.1 in /jena-fuseki2/jena-fuseki-ui
[Andy Seaborne] Bump compression from 1.8.1 to 1.8.2 in /jena-fuseki2/jena-fuseki-ui
[Andy Seaborne] Bump proxy-addr from 2.0.7 to 2.0.8 in /jena-fuseki2/jena-fuseki-ui
[Andy Seaborne] Bump source-map-js from 1.2.1 to 1.2.2 in /jena-fuseki2/jena-fuseki-ui
[Andy Seaborne] Bump postcss-selector-parser in /jena-fuseki2/jena-fuseki-ui
[Andy Seaborne] GH-4276: Use Locale.ROOT for formatitng
[Andy Seaborne] Fix unused imports warnings
[Andy Seaborne] Fix unnecessary cast
[Andy Seaborne] GH-4292: GSP - Correctly determine graph existence
[Andy Seaborne] GH-4278: Add geof:transform function
[Andy Seaborne] Only check SELECT queries for use of SELECT *
[Andy Seaborne] GH-4308: Trailing VALUES happens before SELECT expression
[Rob Vesse] Bump js-yaml from 4.1.1 to 4.3.2 in /jena-fuseki2/jena-fuseki-ui
[Rob Vesse] add a resolution to use a newer shell-quote awaiting update to concurrently
------------------------------------------
Started by an SCM change
Running as SYSTEM
[EnvInject] - Loading node environment variables.
Building remotely on builds37 (ubuntu) in workspace <https://ci-builds.apache.org/job/Jena/job/Jena%20Development%20Test/ws/>
The recommended git tool is: NONE
No credentials specified
Cloning the remote Git repository
Cloning repository https://github.com/apache/jena
> git init <https://ci-builds.apache.org/job/Jena/job/Jena%20Development%20Test/ws/> # timeout=10
Fetching upstream changes from https://github.com/apache/jena
> git --version # timeout=10
> git --version # 'git version 2.34.1'
> git fetch --tags --force --progress -- https://github.com/apache/jena +refs/heads/*:refs/remotes/origin/* # timeout=10
> git config remote.origin.url https://github.com/apache/jena # timeout=10
> git config --add remote.origin.fetch +refs/heads/*:refs/remotes/origin/* # timeout=10
Avoid second fetch
> git rev-parse refs/remotes/origin/main^{commit} # timeout=10
Checking out Revision e55acc54aa74a20a37f986d145225185dae0b8f2 (refs/remotes/origin/main)
> git config core.sparsecheckout # timeout=10
> git checkout -f e55acc54aa74a20a37f986d145225185dae0b8f2 # timeout=10
Commit message: "add a resolution to use a newer shell-quote awaiting update to concurrently"
> git rev-list --no-walk 07a02893d453d0f2b598c9f23df80a814829a269 # timeout=10
Parsing POMs
ERROR: Failed to parse POMs
hudson.remoting.ProxyException: hudson.maven.MavenModuleSetBuild$MavenExecutionException: org.apache.maven.project.ProjectBuildingException: Some problems were encountered while processing the POMs:
[FATAL] Non-readable POM /home/jenkins/.m2/repository/org/apache/apache/40/apache-40.pom: input contained no data @ /home/jenkins/.m2/repository/org/apache/apache/40/apache-40.pom
at PluginClassLoader for maven-plugin//hudson.maven.MavenModuleSetBuild$PomParser.invoke(MavenModuleSetBuild.java:1391)
at PluginClassLoader for maven-plugin//hudson.maven.MavenModuleSetBuild$PomParser.invoke(MavenModuleSetBuild.java:1124)
at hudson.FilePath$FileCallableWrapper.call(FilePath.java:3614)
at hudson.remoting.UserRequest.perform(UserRequest.java:225)
at hudson.remoting.UserRequest.perform(UserRequest.java:50)
at hudson.remoting.Request$2.run(Request.java:391)
at hudson.remoting.InterceptingExecutorService.lambda$wrap$0(InterceptingExecutorService.java:81)
at java.base/java.util.concurrent.FutureTask.run(FutureTask.java:264)
at java.base/java.util.concurrent.ThreadPoolExecutor.runWorker(ThreadPoolExecutor.java:1136)
at java.base/java.util.concurrent.ThreadPoolExecutor$Worker.run(ThreadPoolExecutor.java:635)
at java.base/java.lang.Thread.run(Thread.java:840)
Suppressed: hudson.remoting.Channel$CallSiteStackTrace: Remote call to builds37
at hudson.remoting.Channel.attachCallSiteStackTrace(Channel.java:1923)
at hudson.remoting.UserRequest$ExceptionResponse.retrieve(UserRequest.java:384)
at hudson.remoting.Channel.call(Channel.java:1112)
at hudson.FilePath.act(FilePath.java:1228)
at hudson.FilePath.act(FilePath.java:1217)
at PluginClassLoader for maven-plugin//hudson.maven.MavenModuleSetBuild$MavenModuleSetBuildExecution.parsePoms(MavenModuleSetBuild.java:985)
at PluginClassLoader for maven-plugin//hudson.maven.MavenModuleSetBuild$MavenModuleSetBuildExecution.doRun(MavenModuleSetBuild.java:689)
at hudson.model.AbstractBuild$AbstractBuildExecution.run(AbstractBuild.java:527)
at hudson.model.Run.execute(Run.java:1833)
at PluginClassLoader for maven-plugin//hudson.maven.MavenModuleSetBuild.run(MavenModuleSetBuild.java:543)
at hudson.model.ResourceController.execute(ResourceController.java:101)
at hudson.model.Executor.run(Executor.java:446)
Caused by: hudson.remoting.ProxyException: org.apache.maven.project.ProjectBuildingException: Some problems were encountered while processing the POMs:
[FATAL] Non-readable POM /home/jenkins/.m2/repository/org/apache/apache/40/apache-40.pom: input contained no data @ /home/jenkins/.m2/repository/org/apache/apache/40/apache-40.pom
at PluginClassLoader for maven-plugin//org.apache.maven.project.DefaultProjectBuilder.build(DefaultProjectBuilder.java:397)
at PluginClassLoader for maven-plugin//hudson.maven.MavenEmbedder.buildProjects(MavenEmbedder.java:370)
at PluginClassLoader for maven-plugin//hudson.maven.MavenEmbedder.readProjects(MavenEmbedder.java:340)
at PluginClassLoader for maven-plugin//hudson.maven.MavenModuleSetBuild$PomParser.invoke(MavenModuleSetBuild.java:1330)
... 10 more
Build failed in Jenkins: Jena » Jena Development Test #1862
Posted by Apache Jenkins Server <je...@builds.apache.org>.
See <https://ci-builds.apache.org/job/Jena/job/Jena%20Development%20Test/1862/display/redirect>
Changes:
------------------------------------------
Started by an SCM change
Running as SYSTEM
[EnvInject] - Loading node environment variables.
Building remotely on builds37 (ubuntu) in workspace <https://ci-builds.apache.org/job/Jena/job/Jena%20Development%20Test/ws/>
The recommended git tool is: NONE
No credentials specified
> git rev-parse --resolve-git-dir <https://ci-builds.apache.org/job/Jena/job/Jena%20Development%20Test/ws/.git> # timeout=10
Fetching changes from the remote Git repository
> git config remote.origin.url https://github.com/apache/jena # timeout=10
Fetching upstream changes from https://github.com/apache/jena
> git --version # timeout=10
> git --version # 'git version 2.34.1'
> git fetch --tags --force --progress -- https://github.com/apache/jena +refs/heads/*:refs/remotes/origin/* # timeout=10
ERROR: Error fetching remote repo 'origin'
hudson.plugins.git.GitException: Failed to fetch from https://github.com/apache/jena
at PluginClassLoader for git//hudson.plugins.git.GitSCM.fetchFrom(GitSCM.java:997)
at PluginClassLoader for git//hudson.plugins.git.GitSCM.retrieveChanges(GitSCM.java:1239)
at PluginClassLoader for git//hudson.plugins.git.GitSCM._checkout(GitSCM.java:1310)
at PluginClassLoader for git//hudson.plugins.git.GitSCM.checkout(GitSCM.java:1277)
at hudson.scm.SCM.checkout(SCM.java:540)
at hudson.model.AbstractProject.checkout(AbstractProject.java:1250)
at hudson.model.AbstractBuild$AbstractBuildExecution.defaultCheckout(AbstractBuild.java:649)
at jenkins.scm.SCMCheckoutStrategy.checkout(SCMCheckoutStrategy.java:85)
at hudson.model.AbstractBuild$AbstractBuildExecution.run(AbstractBuild.java:522)
at hudson.model.Run.execute(Run.java:1833)
at PluginClassLoader for maven-plugin//hudson.maven.MavenModuleSetBuild.run(MavenModuleSetBuild.java:543)
at hudson.model.ResourceController.execute(ResourceController.java:101)
at hudson.model.Executor.run(Executor.java:446)
Caused by: hudson.plugins.git.GitException: Command "git fetch --tags --force --progress -- https://github.com/apache/jena +refs/heads/*:refs/remotes/origin/*" returned status code 128:
stdout:
stderr: error: object file .git/objects/a4/ed0f9fb9389e9298d6d131c33bb1c7d21719ef is empty
fatal: loose object a4ed0f9fb9389e9298d6d131c33bb1c7d21719ef (stored in .git/objects/a4/ed0f9fb9389e9298d6d131c33bb1c7d21719ef) is corrupt
at PluginClassLoader for git-client//org.jenkinsci.plugins.gitclient.CliGitAPIImpl.launchCommandIn(CliGitAPIImpl.java:2848)
at PluginClassLoader for git-client//org.jenkinsci.plugins.gitclient.CliGitAPIImpl.launchCommandWithCredentials(CliGitAPIImpl.java:2184)
at PluginClassLoader for git-client//org.jenkinsci.plugins.gitclient.CliGitAPIImpl$1.execute(CliGitAPIImpl.java:635)
at PluginClassLoader for git-client//org.jenkinsci.plugins.gitclient.RemoteGitImpl$CommandInvocationHandler$GitCommandMasterToSlaveCallable.call(RemoteGitImpl.java:170)
at PluginClassLoader for git-client//org.jenkinsci.plugins.gitclient.RemoteGitImpl$CommandInvocationHandler$GitCommandMasterToSlaveCallable.call(RemoteGitImpl.java:161)
at hudson.remoting.UserRequest.perform(UserRequest.java:225)
at hudson.remoting.UserRequest.perform(UserRequest.java:50)
at hudson.remoting.Request$2.run(Request.java:391)
at hudson.remoting.InterceptingExecutorService.lambda$wrap$0(InterceptingExecutorService.java:81)
at java.base/java.util.concurrent.FutureTask.run(FutureTask.java:264)
at java.base/java.util.concurrent.ThreadPoolExecutor.runWorker(ThreadPoolExecutor.java:1136)
at java.base/java.util.concurrent.ThreadPoolExecutor$Worker.run(ThreadPoolExecutor.java:635)
at java.base/java.lang.Thread.run(Thread.java:840)
Suppressed: hudson.remoting.Channel$CallSiteStackTrace: Remote call to builds37
at hudson.remoting.Channel.attachCallSiteStackTrace(Channel.java:1923)
at hudson.remoting.UserRequest$ExceptionResponse.retrieve(UserRequest.java:384)
at hudson.remoting.Channel.call(Channel.java:1112)
at PluginClassLoader for git-client//org.jenkinsci.plugins.gitclient.RemoteGitImpl$CommandInvocationHandler.execute(RemoteGitImpl.java:153)
at jdk.internal.reflect.GeneratedMethodAccessor873.invoke(Unknown Source)
at java.base/jdk.internal.reflect.DelegatingMethodAccessorImpl.invoke(DelegatingMethodAccessorImpl.java:43)
at java.base/java.lang.reflect.Method.invoke(Method.java:569)
at PluginClassLoader for git-client//org.jenkinsci.plugins.gitclient.RemoteGitImpl$CommandInvocationHandler.invoke(RemoteGitImpl.java:138)
at PluginClassLoader for git-client/jdk.proxy131/jdk.proxy131.$Proxy272.execute(Unknown Source)
at PluginClassLoader for git//hudson.plugins.git.GitSCM.fetchFrom(GitSCM.java:995)
at PluginClassLoader for git//hudson.plugins.git.GitSCM.retrieveChanges(GitSCM.java:1239)
at PluginClassLoader for git//hudson.plugins.git.GitSCM._checkout(GitSCM.java:1310)
at PluginClassLoader for git//hudson.plugins.git.GitSCM.checkout(GitSCM.java:1277)
at hudson.scm.SCM.checkout(SCM.java:540)
at hudson.model.AbstractProject.checkout(AbstractProject.java:1250)
at hudson.model.AbstractBuild$AbstractBuildExecution.defaultCheckout(AbstractBuild.java:649)
at jenkins.scm.SCMCheckoutStrategy.checkout(SCMCheckoutStrategy.java:85)
at hudson.model.AbstractBuild$AbstractBuildExecution.run(AbstractBuild.java:522)
at hudson.model.Run.execute(Run.java:1833)
at PluginClassLoader for maven-plugin//hudson.maven.MavenModuleSetBuild.run(MavenModuleSetBuild.java:543)
at hudson.model.ResourceController.execute(ResourceController.java:101)
at hudson.model.Executor.run(Executor.java:446)
ERROR: Error fetching remote repo 'origin'
Build failed in Jenkins: Jena » Jena Development Test #1861
Posted by Apache Jenkins Server <je...@builds.apache.org>.
See <https://ci-builds.apache.org/job/Jena/job/Jena%20Development%20Test/1861/display/redirect>
Changes:
------------------------------------------
Started by an SCM change
Running as SYSTEM
[EnvInject] - Loading node environment variables.
Building remotely on builds37 (ubuntu) in workspace <https://ci-builds.apache.org/job/Jena/job/Jena%20Development%20Test/ws/>
The recommended git tool is: NONE
No credentials specified
> git rev-parse --resolve-git-dir <https://ci-builds.apache.org/job/Jena/job/Jena%20Development%20Test/ws/.git> # timeout=10
Fetching changes from the remote Git repository
> git config remote.origin.url https://github.com/apache/jena # timeout=10
Fetching upstream changes from https://github.com/apache/jena
> git --version # timeout=10
> git --version # 'git version 2.34.1'
> git fetch --tags --force --progress -- https://github.com/apache/jena +refs/heads/*:refs/remotes/origin/* # timeout=10
ERROR: Error fetching remote repo 'origin'
hudson.plugins.git.GitException: Failed to fetch from https://github.com/apache/jena
at PluginClassLoader for git//hudson.plugins.git.GitSCM.fetchFrom(GitSCM.java:997)
at PluginClassLoader for git//hudson.plugins.git.GitSCM.retrieveChanges(GitSCM.java:1239)
at PluginClassLoader for git//hudson.plugins.git.GitSCM._checkout(GitSCM.java:1310)
at PluginClassLoader for git//hudson.plugins.git.GitSCM.checkout(GitSCM.java:1277)
at hudson.scm.SCM.checkout(SCM.java:540)
at hudson.model.AbstractProject.checkout(AbstractProject.java:1250)
at hudson.model.AbstractBuild$AbstractBuildExecution.defaultCheckout(AbstractBuild.java:649)
at jenkins.scm.SCMCheckoutStrategy.checkout(SCMCheckoutStrategy.java:85)
at hudson.model.AbstractBuild$AbstractBuildExecution.run(AbstractBuild.java:522)
at hudson.model.Run.execute(Run.java:1833)
at PluginClassLoader for maven-plugin//hudson.maven.MavenModuleSetBuild.run(MavenModuleSetBuild.java:543)
at hudson.model.ResourceController.execute(ResourceController.java:101)
at hudson.model.Executor.run(Executor.java:446)
Caused by: hudson.plugins.git.GitException: Command "git fetch --tags --force --progress -- https://github.com/apache/jena +refs/heads/*:refs/remotes/origin/*" returned status code 128:
stdout:
stderr: error: object file .git/objects/a4/ed0f9fb9389e9298d6d131c33bb1c7d21719ef is empty
fatal: loose object a4ed0f9fb9389e9298d6d131c33bb1c7d21719ef (stored in .git/objects/a4/ed0f9fb9389e9298d6d131c33bb1c7d21719ef) is corrupt
at PluginClassLoader for git-client//org.jenkinsci.plugins.gitclient.CliGitAPIImpl.launchCommandIn(CliGitAPIImpl.java:2848)
at PluginClassLoader for git-client//org.jenkinsci.plugins.gitclient.CliGitAPIImpl.launchCommandWithCredentials(CliGitAPIImpl.java:2184)
at PluginClassLoader for git-client//org.jenkinsci.plugins.gitclient.CliGitAPIImpl$1.execute(CliGitAPIImpl.java:635)
at PluginClassLoader for git-client//org.jenkinsci.plugins.gitclient.RemoteGitImpl$CommandInvocationHandler$GitCommandMasterToSlaveCallable.call(RemoteGitImpl.java:170)
at PluginClassLoader for git-client//org.jenkinsci.plugins.gitclient.RemoteGitImpl$CommandInvocationHandler$GitCommandMasterToSlaveCallable.call(RemoteGitImpl.java:161)
at hudson.remoting.UserRequest.perform(UserRequest.java:225)
at hudson.remoting.UserRequest.perform(UserRequest.java:50)
at hudson.remoting.Request$2.run(Request.java:391)
at hudson.remoting.InterceptingExecutorService.lambda$wrap$0(InterceptingExecutorService.java:81)
at java.base/java.util.concurrent.FutureTask.run(FutureTask.java:264)
at java.base/java.util.concurrent.ThreadPoolExecutor.runWorker(ThreadPoolExecutor.java:1136)
at java.base/java.util.concurrent.ThreadPoolExecutor$Worker.run(ThreadPoolExecutor.java:635)
at java.base/java.lang.Thread.run(Thread.java:840)
Suppressed: hudson.remoting.Channel$CallSiteStackTrace: Remote call to builds37
at hudson.remoting.Channel.attachCallSiteStackTrace(Channel.java:1923)
at hudson.remoting.UserRequest$ExceptionResponse.retrieve(UserRequest.java:384)
at hudson.remoting.Channel.call(Channel.java:1112)
at PluginClassLoader for git-client//org.jenkinsci.plugins.gitclient.RemoteGitImpl$CommandInvocationHandler.execute(RemoteGitImpl.java:153)
at jdk.internal.reflect.GeneratedMethodAccessor873.invoke(Unknown Source)
at java.base/jdk.internal.reflect.DelegatingMethodAccessorImpl.invoke(DelegatingMethodAccessorImpl.java:43)
at java.base/java.lang.reflect.Method.invoke(Method.java:569)
at PluginClassLoader for git-client//org.jenkinsci.plugins.gitclient.RemoteGitImpl$CommandInvocationHandler.invoke(RemoteGitImpl.java:138)
at PluginClassLoader for git-client/jdk.proxy131/jdk.proxy131.$Proxy272.execute(Unknown Source)
at PluginClassLoader for git//hudson.plugins.git.GitSCM.fetchFrom(GitSCM.java:995)
at PluginClassLoader for git//hudson.plugins.git.GitSCM.retrieveChanges(GitSCM.java:1239)
at PluginClassLoader for git//hudson.plugins.git.GitSCM._checkout(GitSCM.java:1310)
at PluginClassLoader for git//hudson.plugins.git.GitSCM.checkout(GitSCM.java:1277)
at hudson.scm.SCM.checkout(SCM.java:540)
at hudson.model.AbstractProject.checkout(AbstractProject.java:1250)
at hudson.model.AbstractBuild$AbstractBuildExecution.defaultCheckout(AbstractBuild.java:649)
at jenkins.scm.SCMCheckoutStrategy.checkout(SCMCheckoutStrategy.java:85)
at hudson.model.AbstractBuild$AbstractBuildExecution.run(AbstractBuild.java:522)
at hudson.model.Run.execute(Run.java:1833)
at PluginClassLoader for maven-plugin//hudson.maven.MavenModuleSetBuild.run(MavenModuleSetBuild.java:543)
at hudson.model.ResourceController.execute(ResourceController.java:101)
at hudson.model.Executor.run(Executor.java:446)
ERROR: Error fetching remote repo 'origin'
Build failed in Jenkins: Jena » Jena Development Test #1860
Posted by Apache Jenkins Server <je...@builds.apache.org>.
See <https://ci-builds.apache.org/job/Jena/job/Jena%20Development%20Test/1860/display/redirect>
Changes:
------------------------------------------
Started by an SCM change
Running as SYSTEM
[EnvInject] - Loading node environment variables.
Building remotely on builds37 (ubuntu) in workspace <https://ci-builds.apache.org/job/Jena/job/Jena%20Development%20Test/ws/>
The recommended git tool is: NONE
No credentials specified
> git rev-parse --resolve-git-dir <https://ci-builds.apache.org/job/Jena/job/Jena%20Development%20Test/ws/.git> # timeout=10
Fetching changes from the remote Git repository
> git config remote.origin.url https://github.com/apache/jena # timeout=10
Fetching upstream changes from https://github.com/apache/jena
> git --version # timeout=10
> git --version # 'git version 2.34.1'
> git fetch --tags --force --progress -- https://github.com/apache/jena +refs/heads/*:refs/remotes/origin/* # timeout=10
ERROR: Error fetching remote repo 'origin'
hudson.plugins.git.GitException: Failed to fetch from https://github.com/apache/jena
at PluginClassLoader for git//hudson.plugins.git.GitSCM.fetchFrom(GitSCM.java:997)
at PluginClassLoader for git//hudson.plugins.git.GitSCM.retrieveChanges(GitSCM.java:1239)
at PluginClassLoader for git//hudson.plugins.git.GitSCM._checkout(GitSCM.java:1310)
at PluginClassLoader for git//hudson.plugins.git.GitSCM.checkout(GitSCM.java:1277)
at hudson.scm.SCM.checkout(SCM.java:540)
at hudson.model.AbstractProject.checkout(AbstractProject.java:1250)
at hudson.model.AbstractBuild$AbstractBuildExecution.defaultCheckout(AbstractBuild.java:649)
at jenkins.scm.SCMCheckoutStrategy.checkout(SCMCheckoutStrategy.java:85)
at hudson.model.AbstractBuild$AbstractBuildExecution.run(AbstractBuild.java:522)
at hudson.model.Run.execute(Run.java:1833)
at PluginClassLoader for maven-plugin//hudson.maven.MavenModuleSetBuild.run(MavenModuleSetBuild.java:543)
at hudson.model.ResourceController.execute(ResourceController.java:101)
at hudson.model.Executor.run(Executor.java:446)
Caused by: hudson.plugins.git.GitException: Command "git fetch --tags --force --progress -- https://github.com/apache/jena +refs/heads/*:refs/remotes/origin/*" returned status code 128:
stdout:
stderr: error: object file .git/objects/a4/ed0f9fb9389e9298d6d131c33bb1c7d21719ef is empty
fatal: loose object a4ed0f9fb9389e9298d6d131c33bb1c7d21719ef (stored in .git/objects/a4/ed0f9fb9389e9298d6d131c33bb1c7d21719ef) is corrupt
at PluginClassLoader for git-client//org.jenkinsci.plugins.gitclient.CliGitAPIImpl.launchCommandIn(CliGitAPIImpl.java:2848)
at PluginClassLoader for git-client//org.jenkinsci.plugins.gitclient.CliGitAPIImpl.launchCommandWithCredentials(CliGitAPIImpl.java:2184)
at PluginClassLoader for git-client//org.jenkinsci.plugins.gitclient.CliGitAPIImpl$1.execute(CliGitAPIImpl.java:635)
at PluginClassLoader for git-client//org.jenkinsci.plugins.gitclient.RemoteGitImpl$CommandInvocationHandler$GitCommandMasterToSlaveCallable.call(RemoteGitImpl.java:170)
at PluginClassLoader for git-client//org.jenkinsci.plugins.gitclient.RemoteGitImpl$CommandInvocationHandler$GitCommandMasterToSlaveCallable.call(RemoteGitImpl.java:161)
at hudson.remoting.UserRequest.perform(UserRequest.java:225)
at hudson.remoting.UserRequest.perform(UserRequest.java:50)
at hudson.remoting.Request$2.run(Request.java:391)
at hudson.remoting.InterceptingExecutorService.lambda$wrap$0(InterceptingExecutorService.java:81)
at java.base/java.util.concurrent.FutureTask.run(FutureTask.java:264)
at java.base/java.util.concurrent.ThreadPoolExecutor.runWorker(ThreadPoolExecutor.java:1136)
at java.base/java.util.concurrent.ThreadPoolExecutor$Worker.run(ThreadPoolExecutor.java:635)
at java.base/java.lang.Thread.run(Thread.java:840)
Suppressed: hudson.remoting.Channel$CallSiteStackTrace: Remote call to builds37
at hudson.remoting.Channel.attachCallSiteStackTrace(Channel.java:1923)
at hudson.remoting.UserRequest$ExceptionResponse.retrieve(UserRequest.java:384)
at hudson.remoting.Channel.call(Channel.java:1112)
at PluginClassLoader for git-client//org.jenkinsci.plugins.gitclient.RemoteGitImpl$CommandInvocationHandler.execute(RemoteGitImpl.java:153)
at jdk.internal.reflect.GeneratedMethodAccessor873.invoke(Unknown Source)
at java.base/jdk.internal.reflect.DelegatingMethodAccessorImpl.invoke(DelegatingMethodAccessorImpl.java:43)
at java.base/java.lang.reflect.Method.invoke(Method.java:569)
at PluginClassLoader for git-client//org.jenkinsci.plugins.gitclient.RemoteGitImpl$CommandInvocationHandler.invoke(RemoteGitImpl.java:138)
at PluginClassLoader for git-client/jdk.proxy131/jdk.proxy131.$Proxy272.execute(Unknown Source)
at PluginClassLoader for git//hudson.plugins.git.GitSCM.fetchFrom(GitSCM.java:995)
at PluginClassLoader for git//hudson.plugins.git.GitSCM.retrieveChanges(GitSCM.java:1239)
at PluginClassLoader for git//hudson.plugins.git.GitSCM._checkout(GitSCM.java:1310)
at PluginClassLoader for git//hudson.plugins.git.GitSCM.checkout(GitSCM.java:1277)
at hudson.scm.SCM.checkout(SCM.java:540)
at hudson.model.AbstractProject.checkout(AbstractProject.java:1250)
at hudson.model.AbstractBuild$AbstractBuildExecution.defaultCheckout(AbstractBuild.java:649)
at jenkins.scm.SCMCheckoutStrategy.checkout(SCMCheckoutStrategy.java:85)
at hudson.model.AbstractBuild$AbstractBuildExecution.run(AbstractBuild.java:522)
at hudson.model.Run.execute(Run.java:1833)
at PluginClassLoader for maven-plugin//hudson.maven.MavenModuleSetBuild.run(MavenModuleSetBuild.java:543)
at hudson.model.ResourceController.execute(ResourceController.java:101)
at hudson.model.Executor.run(Executor.java:446)
ERROR: Error fetching remote repo 'origin'
Build failed in Jenkins: Jena » Jena Development Test #1859
Posted by Apache Jenkins Server <je...@builds.apache.org>.
See <https://ci-builds.apache.org/job/Jena/job/Jena%20Development%20Test/1859/display/redirect>
Changes:
------------------------------------------
Started by an SCM change
Running as SYSTEM
[EnvInject] - Loading node environment variables.
Building remotely on builds37 (ubuntu) in workspace <https://ci-builds.apache.org/job/Jena/job/Jena%20Development%20Test/ws/>
The recommended git tool is: NONE
No credentials specified
> git rev-parse --resolve-git-dir <https://ci-builds.apache.org/job/Jena/job/Jena%20Development%20Test/ws/.git> # timeout=10
Fetching changes from the remote Git repository
> git config remote.origin.url https://github.com/apache/jena # timeout=10
Fetching upstream changes from https://github.com/apache/jena
> git --version # timeout=10
> git --version # 'git version 2.34.1'
> git fetch --tags --force --progress -- https://github.com/apache/jena +refs/heads/*:refs/remotes/origin/* # timeout=10
ERROR: Error fetching remote repo 'origin'
hudson.plugins.git.GitException: Failed to fetch from https://github.com/apache/jena
at PluginClassLoader for git//hudson.plugins.git.GitSCM.fetchFrom(GitSCM.java:997)
at PluginClassLoader for git//hudson.plugins.git.GitSCM.retrieveChanges(GitSCM.java:1239)
at PluginClassLoader for git//hudson.plugins.git.GitSCM._checkout(GitSCM.java:1310)
at PluginClassLoader for git//hudson.plugins.git.GitSCM.checkout(GitSCM.java:1277)
at hudson.scm.SCM.checkout(SCM.java:540)
at hudson.model.AbstractProject.checkout(AbstractProject.java:1250)
at hudson.model.AbstractBuild$AbstractBuildExecution.defaultCheckout(AbstractBuild.java:649)
at jenkins.scm.SCMCheckoutStrategy.checkout(SCMCheckoutStrategy.java:85)
at hudson.model.AbstractBuild$AbstractBuildExecution.run(AbstractBuild.java:522)
at hudson.model.Run.execute(Run.java:1833)
at PluginClassLoader for maven-plugin//hudson.maven.MavenModuleSetBuild.run(MavenModuleSetBuild.java:543)
at hudson.model.ResourceController.execute(ResourceController.java:101)
at hudson.model.Executor.run(Executor.java:446)
Caused by: hudson.plugins.git.GitException: Command "git fetch --tags --force --progress -- https://github.com/apache/jena +refs/heads/*:refs/remotes/origin/*" returned status code 128:
stdout:
stderr: error: object file .git/objects/a4/ed0f9fb9389e9298d6d131c33bb1c7d21719ef is empty
fatal: loose object a4ed0f9fb9389e9298d6d131c33bb1c7d21719ef (stored in .git/objects/a4/ed0f9fb9389e9298d6d131c33bb1c7d21719ef) is corrupt
at PluginClassLoader for git-client//org.jenkinsci.plugins.gitclient.CliGitAPIImpl.launchCommandIn(CliGitAPIImpl.java:2848)
at PluginClassLoader for git-client//org.jenkinsci.plugins.gitclient.CliGitAPIImpl.launchCommandWithCredentials(CliGitAPIImpl.java:2184)
at PluginClassLoader for git-client//org.jenkinsci.plugins.gitclient.CliGitAPIImpl$1.execute(CliGitAPIImpl.java:635)
at PluginClassLoader for git-client//org.jenkinsci.plugins.gitclient.RemoteGitImpl$CommandInvocationHandler$GitCommandMasterToSlaveCallable.call(RemoteGitImpl.java:170)
at PluginClassLoader for git-client//org.jenkinsci.plugins.gitclient.RemoteGitImpl$CommandInvocationHandler$GitCommandMasterToSlaveCallable.call(RemoteGitImpl.java:161)
at hudson.remoting.UserRequest.perform(UserRequest.java:225)
at hudson.remoting.UserRequest.perform(UserRequest.java:50)
at hudson.remoting.Request$2.run(Request.java:391)
at hudson.remoting.InterceptingExecutorService.lambda$wrap$0(InterceptingExecutorService.java:81)
at java.base/java.util.concurrent.FutureTask.run(FutureTask.java:264)
at java.base/java.util.concurrent.ThreadPoolExecutor.runWorker(ThreadPoolExecutor.java:1136)
at java.base/java.util.concurrent.ThreadPoolExecutor$Worker.run(ThreadPoolExecutor.java:635)
at java.base/java.lang.Thread.run(Thread.java:840)
Suppressed: hudson.remoting.Channel$CallSiteStackTrace: Remote call to builds37
at hudson.remoting.Channel.attachCallSiteStackTrace(Channel.java:1923)
at hudson.remoting.UserRequest$ExceptionResponse.retrieve(UserRequest.java:384)
at hudson.remoting.Channel.call(Channel.java:1112)
at PluginClassLoader for git-client//org.jenkinsci.plugins.gitclient.RemoteGitImpl$CommandInvocationHandler.execute(RemoteGitImpl.java:153)
at jdk.internal.reflect.GeneratedMethodAccessor873.invoke(Unknown Source)
at java.base/jdk.internal.reflect.DelegatingMethodAccessorImpl.invoke(DelegatingMethodAccessorImpl.java:43)
at java.base/java.lang.reflect.Method.invoke(Method.java:569)
at PluginClassLoader for git-client//org.jenkinsci.plugins.gitclient.RemoteGitImpl$CommandInvocationHandler.invoke(RemoteGitImpl.java:138)
at PluginClassLoader for git-client/jdk.proxy131/jdk.proxy131.$Proxy272.execute(Unknown Source)
at PluginClassLoader for git//hudson.plugins.git.GitSCM.fetchFrom(GitSCM.java:995)
at PluginClassLoader for git//hudson.plugins.git.GitSCM.retrieveChanges(GitSCM.java:1239)
at PluginClassLoader for git//hudson.plugins.git.GitSCM._checkout(GitSCM.java:1310)
at PluginClassLoader for git//hudson.plugins.git.GitSCM.checkout(GitSCM.java:1277)
at hudson.scm.SCM.checkout(SCM.java:540)
at hudson.model.AbstractProject.checkout(AbstractProject.java:1250)
at hudson.model.AbstractBuild$AbstractBuildExecution.defaultCheckout(AbstractBuild.java:649)
at jenkins.scm.SCMCheckoutStrategy.checkout(SCMCheckoutStrategy.java:85)
at hudson.model.AbstractBuild$AbstractBuildExecution.run(AbstractBuild.java:522)
at hudson.model.Run.execute(Run.java:1833)
at PluginClassLoader for maven-plugin//hudson.maven.MavenModuleSetBuild.run(MavenModuleSetBuild.java:543)
at hudson.model.ResourceController.execute(ResourceController.java:101)
at hudson.model.Executor.run(Executor.java:446)
ERROR: Error fetching remote repo 'origin'
Build failed in Jenkins: Jena » Jena Development Test #1858
Posted by Apache Jenkins Server <je...@builds.apache.org>.
See <https://ci-builds.apache.org/job/Jena/job/Jena%20Development%20Test/1858/display/redirect>
Changes:
------------------------------------------
Started by an SCM change
Running as SYSTEM
[EnvInject] - Loading node environment variables.
Building remotely on builds37 (ubuntu) in workspace <https://ci-builds.apache.org/job/Jena/job/Jena%20Development%20Test/ws/>
The recommended git tool is: NONE
No credentials specified
> git rev-parse --resolve-git-dir <https://ci-builds.apache.org/job/Jena/job/Jena%20Development%20Test/ws/.git> # timeout=10
Fetching changes from the remote Git repository
> git config remote.origin.url https://github.com/apache/jena # timeout=10
Fetching upstream changes from https://github.com/apache/jena
> git --version # timeout=10
> git --version # 'git version 2.34.1'
> git fetch --tags --force --progress -- https://github.com/apache/jena +refs/heads/*:refs/remotes/origin/* # timeout=10
ERROR: Error fetching remote repo 'origin'
hudson.plugins.git.GitException: Failed to fetch from https://github.com/apache/jena
at PluginClassLoader for git//hudson.plugins.git.GitSCM.fetchFrom(GitSCM.java:997)
at PluginClassLoader for git//hudson.plugins.git.GitSCM.retrieveChanges(GitSCM.java:1239)
at PluginClassLoader for git//hudson.plugins.git.GitSCM._checkout(GitSCM.java:1310)
at PluginClassLoader for git//hudson.plugins.git.GitSCM.checkout(GitSCM.java:1277)
at hudson.scm.SCM.checkout(SCM.java:540)
at hudson.model.AbstractProject.checkout(AbstractProject.java:1250)
at hudson.model.AbstractBuild$AbstractBuildExecution.defaultCheckout(AbstractBuild.java:649)
at jenkins.scm.SCMCheckoutStrategy.checkout(SCMCheckoutStrategy.java:85)
at hudson.model.AbstractBuild$AbstractBuildExecution.run(AbstractBuild.java:522)
at hudson.model.Run.execute(Run.java:1833)
at PluginClassLoader for maven-plugin//hudson.maven.MavenModuleSetBuild.run(MavenModuleSetBuild.java:543)
at hudson.model.ResourceController.execute(ResourceController.java:101)
at hudson.model.Executor.run(Executor.java:446)
Caused by: hudson.plugins.git.GitException: Command "git fetch --tags --force --progress -- https://github.com/apache/jena +refs/heads/*:refs/remotes/origin/*" returned status code 128:
stdout:
stderr: error: object file .git/objects/a4/ed0f9fb9389e9298d6d131c33bb1c7d21719ef is empty
fatal: loose object a4ed0f9fb9389e9298d6d131c33bb1c7d21719ef (stored in .git/objects/a4/ed0f9fb9389e9298d6d131c33bb1c7d21719ef) is corrupt
at PluginClassLoader for git-client//org.jenkinsci.plugins.gitclient.CliGitAPIImpl.launchCommandIn(CliGitAPIImpl.java:2848)
at PluginClassLoader for git-client//org.jenkinsci.plugins.gitclient.CliGitAPIImpl.launchCommandWithCredentials(CliGitAPIImpl.java:2184)
at PluginClassLoader for git-client//org.jenkinsci.plugins.gitclient.CliGitAPIImpl$1.execute(CliGitAPIImpl.java:635)
at PluginClassLoader for git-client//org.jenkinsci.plugins.gitclient.RemoteGitImpl$CommandInvocationHandler$GitCommandMasterToSlaveCallable.call(RemoteGitImpl.java:170)
at PluginClassLoader for git-client//org.jenkinsci.plugins.gitclient.RemoteGitImpl$CommandInvocationHandler$GitCommandMasterToSlaveCallable.call(RemoteGitImpl.java:161)
at hudson.remoting.UserRequest.perform(UserRequest.java:225)
at hudson.remoting.UserRequest.perform(UserRequest.java:50)
at hudson.remoting.Request$2.run(Request.java:391)
at hudson.remoting.InterceptingExecutorService.lambda$wrap$0(InterceptingExecutorService.java:81)
at java.base/java.util.concurrent.FutureTask.run(FutureTask.java:264)
at java.base/java.util.concurrent.ThreadPoolExecutor.runWorker(ThreadPoolExecutor.java:1136)
at java.base/java.util.concurrent.ThreadPoolExecutor$Worker.run(ThreadPoolExecutor.java:635)
at java.base/java.lang.Thread.run(Thread.java:840)
Suppressed: hudson.remoting.Channel$CallSiteStackTrace: Remote call to builds37
at hudson.remoting.Channel.attachCallSiteStackTrace(Channel.java:1923)
at hudson.remoting.UserRequest$ExceptionResponse.retrieve(UserRequest.java:384)
at hudson.remoting.Channel.call(Channel.java:1112)
at PluginClassLoader for git-client//org.jenkinsci.plugins.gitclient.RemoteGitImpl$CommandInvocationHandler.execute(RemoteGitImpl.java:153)
at jdk.internal.reflect.GeneratedMethodAccessor873.invoke(Unknown Source)
at java.base/jdk.internal.reflect.DelegatingMethodAccessorImpl.invoke(DelegatingMethodAccessorImpl.java:43)
at java.base/java.lang.reflect.Method.invoke(Method.java:569)
at PluginClassLoader for git-client//org.jenkinsci.plugins.gitclient.RemoteGitImpl$CommandInvocationHandler.invoke(RemoteGitImpl.java:138)
at PluginClassLoader for git-client/jdk.proxy131/jdk.proxy131.$Proxy272.execute(Unknown Source)
at PluginClassLoader for git//hudson.plugins.git.GitSCM.fetchFrom(GitSCM.java:995)
at PluginClassLoader for git//hudson.plugins.git.GitSCM.retrieveChanges(GitSCM.java:1239)
at PluginClassLoader for git//hudson.plugins.git.GitSCM._checkout(GitSCM.java:1310)
at PluginClassLoader for git//hudson.plugins.git.GitSCM.checkout(GitSCM.java:1277)
at hudson.scm.SCM.checkout(SCM.java:540)
at hudson.model.AbstractProject.checkout(AbstractProject.java:1250)
at hudson.model.AbstractBuild$AbstractBuildExecution.defaultCheckout(AbstractBuild.java:649)
at jenkins.scm.SCMCheckoutStrategy.checkout(SCMCheckoutStrategy.java:85)
at hudson.model.AbstractBuild$AbstractBuildExecution.run(AbstractBuild.java:522)
at hudson.model.Run.execute(Run.java:1833)
at PluginClassLoader for maven-plugin//hudson.maven.MavenModuleSetBuild.run(MavenModuleSetBuild.java:543)
at hudson.model.ResourceController.execute(ResourceController.java:101)
at hudson.model.Executor.run(Executor.java:446)
ERROR: Error fetching remote repo 'origin'
Build failed in Jenkins: Jena » Jena Development Test #1857
Posted by Apache Jenkins Server <je...@builds.apache.org>.
See <https://ci-builds.apache.org/job/Jena/job/Jena%20Development%20Test/1857/display/redirect>
Changes:
------------------------------------------
Started by an SCM change
Running as SYSTEM
[EnvInject] - Loading node environment variables.
Building remotely on builds37 (ubuntu) in workspace <https://ci-builds.apache.org/job/Jena/job/Jena%20Development%20Test/ws/>
The recommended git tool is: NONE
No credentials specified
> git rev-parse --resolve-git-dir <https://ci-builds.apache.org/job/Jena/job/Jena%20Development%20Test/ws/.git> # timeout=10
Fetching changes from the remote Git repository
> git config remote.origin.url https://github.com/apache/jena # timeout=10
Fetching upstream changes from https://github.com/apache/jena
> git --version # timeout=10
> git --version # 'git version 2.34.1'
> git fetch --tags --force --progress -- https://github.com/apache/jena +refs/heads/*:refs/remotes/origin/* # timeout=10
ERROR: Error fetching remote repo 'origin'
hudson.plugins.git.GitException: Failed to fetch from https://github.com/apache/jena
at PluginClassLoader for git//hudson.plugins.git.GitSCM.fetchFrom(GitSCM.java:997)
at PluginClassLoader for git//hudson.plugins.git.GitSCM.retrieveChanges(GitSCM.java:1239)
at PluginClassLoader for git//hudson.plugins.git.GitSCM._checkout(GitSCM.java:1310)
at PluginClassLoader for git//hudson.plugins.git.GitSCM.checkout(GitSCM.java:1277)
at hudson.scm.SCM.checkout(SCM.java:540)
at hudson.model.AbstractProject.checkout(AbstractProject.java:1250)
at hudson.model.AbstractBuild$AbstractBuildExecution.defaultCheckout(AbstractBuild.java:649)
at jenkins.scm.SCMCheckoutStrategy.checkout(SCMCheckoutStrategy.java:85)
at hudson.model.AbstractBuild$AbstractBuildExecution.run(AbstractBuild.java:522)
at hudson.model.Run.execute(Run.java:1833)
at PluginClassLoader for maven-plugin//hudson.maven.MavenModuleSetBuild.run(MavenModuleSetBuild.java:543)
at hudson.model.ResourceController.execute(ResourceController.java:101)
at hudson.model.Executor.run(Executor.java:446)
Caused by: hudson.plugins.git.GitException: Command "git fetch --tags --force --progress -- https://github.com/apache/jena +refs/heads/*:refs/remotes/origin/*" returned status code 128:
stdout:
stderr: error: object file .git/objects/a4/ed0f9fb9389e9298d6d131c33bb1c7d21719ef is empty
fatal: loose object a4ed0f9fb9389e9298d6d131c33bb1c7d21719ef (stored in .git/objects/a4/ed0f9fb9389e9298d6d131c33bb1c7d21719ef) is corrupt
at PluginClassLoader for git-client//org.jenkinsci.plugins.gitclient.CliGitAPIImpl.launchCommandIn(CliGitAPIImpl.java:2848)
at PluginClassLoader for git-client//org.jenkinsci.plugins.gitclient.CliGitAPIImpl.launchCommandWithCredentials(CliGitAPIImpl.java:2184)
at PluginClassLoader for git-client//org.jenkinsci.plugins.gitclient.CliGitAPIImpl$1.execute(CliGitAPIImpl.java:635)
at PluginClassLoader for git-client//org.jenkinsci.plugins.gitclient.RemoteGitImpl$CommandInvocationHandler$GitCommandMasterToSlaveCallable.call(RemoteGitImpl.java:170)
at PluginClassLoader for git-client//org.jenkinsci.plugins.gitclient.RemoteGitImpl$CommandInvocationHandler$GitCommandMasterToSlaveCallable.call(RemoteGitImpl.java:161)
at hudson.remoting.UserRequest.perform(UserRequest.java:225)
at hudson.remoting.UserRequest.perform(UserRequest.java:50)
at hudson.remoting.Request$2.run(Request.java:391)
at hudson.remoting.InterceptingExecutorService.lambda$wrap$0(InterceptingExecutorService.java:81)
at java.base/java.util.concurrent.FutureTask.run(FutureTask.java:264)
at java.base/java.util.concurrent.ThreadPoolExecutor.runWorker(ThreadPoolExecutor.java:1136)
at java.base/java.util.concurrent.ThreadPoolExecutor$Worker.run(ThreadPoolExecutor.java:635)
at java.base/java.lang.Thread.run(Thread.java:840)
Suppressed: hudson.remoting.Channel$CallSiteStackTrace: Remote call to builds37
at hudson.remoting.Channel.attachCallSiteStackTrace(Channel.java:1923)
at hudson.remoting.UserRequest$ExceptionResponse.retrieve(UserRequest.java:384)
at hudson.remoting.Channel.call(Channel.java:1112)
at PluginClassLoader for git-client//org.jenkinsci.plugins.gitclient.RemoteGitImpl$CommandInvocationHandler.execute(RemoteGitImpl.java:153)
at jdk.internal.reflect.GeneratedMethodAccessor873.invoke(Unknown Source)
at java.base/jdk.internal.reflect.DelegatingMethodAccessorImpl.invoke(DelegatingMethodAccessorImpl.java:43)
at java.base/java.lang.reflect.Method.invoke(Method.java:569)
at PluginClassLoader for git-client//org.jenkinsci.plugins.gitclient.RemoteGitImpl$CommandInvocationHandler.invoke(RemoteGitImpl.java:138)
at PluginClassLoader for git-client/jdk.proxy131/jdk.proxy131.$Proxy272.execute(Unknown Source)
at PluginClassLoader for git//hudson.plugins.git.GitSCM.fetchFrom(GitSCM.java:995)
at PluginClassLoader for git//hudson.plugins.git.GitSCM.retrieveChanges(GitSCM.java:1239)
at PluginClassLoader for git//hudson.plugins.git.GitSCM._checkout(GitSCM.java:1310)
at PluginClassLoader for git//hudson.plugins.git.GitSCM.checkout(GitSCM.java:1277)
at hudson.scm.SCM.checkout(SCM.java:540)
at hudson.model.AbstractProject.checkout(AbstractProject.java:1250)
at hudson.model.AbstractBuild$AbstractBuildExecution.defaultCheckout(AbstractBuild.java:649)
at jenkins.scm.SCMCheckoutStrategy.checkout(SCMCheckoutStrategy.java:85)
at hudson.model.AbstractBuild$AbstractBuildExecution.run(AbstractBuild.java:522)
at hudson.model.Run.execute(Run.java:1833)
at PluginClassLoader for maven-plugin//hudson.maven.MavenModuleSetBuild.run(MavenModuleSetBuild.java:543)
at hudson.model.ResourceController.execute(ResourceController.java:101)
at hudson.model.Executor.run(Executor.java:446)
ERROR: Error fetching remote repo 'origin'