You are viewing a plain text version of this content. The canonical link for it is here.
Posted to yarn-dev@hadoop.apache.org by Apache Jenkins Server <je...@builds.apache.org> on 2015/04/29 16:27:11 UTC
Failed: YARN-2619 PreCommit Build #7541
Jira: https://issues.apache.org/jira/browse/YARN-2619
Build: https://builds.apache.org/job/PreCommit-YARN-Build/7541/
###################################################################################
########################## LAST 60 LINES OF THE CONSOLE ###########################
[...truncated 280 lines...]
| | | | warnings.
| -1 | checkstyle | 4m 57s | The applied patch generated 5
| | | | additional checkstyle issues.
| +1 | install | 1m 43s | mvn install still works.
| +1 | eclipse:eclipse | 0m 32s | The patch built with
| | | | eclipse:eclipse.
| +1 | findbugs | 2m 23s | The patch does not introduce any
| | | | new Findbugs (version 2.0.3)
| | | | warnings.
| +1 | yarn tests | 0m 22s | Tests passed in hadoop-yarn-api.
| +1 | yarn tests | 6m 11s | Tests passed in
| | | | hadoop-yarn-server-nodemanager.
| | | 55m 21s |
|| Subsystem || Report/Notes ||
============================================================================
| Patch URL | http://issues.apache.org/jira/secure/attachment/12729166/YARN-2619.004.patch |
| Optional Tests | javadoc javac unit findbugs checkstyle |
| git revision | trunk / 8f82970 |
| checkstyle | /home/jenkins/jenkins-slave/workspace/PreCommit-YARN-Build/../patchprocess/checkstyle-result-diff.txt |
| hadoop-yarn-api test log | /home/jenkins/jenkins-slave/workspace/PreCommit-YARN-Build/../patchprocess/testrun_hadoop-yarn-api.txt |
| hadoop-yarn-server-nodemanager test log | /home/jenkins/jenkins-slave/workspace/PreCommit-YARN-Build/../patchprocess/testrun_hadoop-yarn-server-nodemanager.txt |
| Test Results | https://builds.apache.org/job/PreCommit-YARN-Build/7541/testReport/ |
| Java | 1.7.0_55 |
| uname | Linux asf903.gq1.ygridcore.net 3.13.0-36-lowlatency #63-Ubuntu SMP PREEMPT Wed Sep 3 21:56:12 UTC 2014 x86_64 x86_64 x86_64 GNU/Linux |
============================================================================
============================================================================
Adding comment to JIRA
============================================================================
============================================================================
Comment added.
f4a2642fc10d3870e737a6dd4d3612a70582dc83 logged out
============================================================================
============================================================================
Finished build.
============================================================================
============================================================================
Build step 'Execute shell' marked build as failure
Archiving artifacts
Sending artifact delta relative to PreCommit-YARN-Build #7529
Archived 26 artifacts
Archive block size is 32768
Received 697 blocks and 72956473 bytes
Compression is 23.8%
Took 51 sec
[description-setter] Could not determine description.
Recording test results
Publish JUnit test result report is waiting for a checkpoint on PreCommit-YARN-Build #7540
Email was triggered for: Failure
Sending email for trigger: Failure
###################################################################################
############################## FAILED TESTS (if any) ##############################
All tests passed
Success: YARN-3564 PreCommit Build #7545
Posted by Apache Jenkins Server <je...@builds.apache.org>.
Jira: https://issues.apache.org/jira/browse/YARN-3564
Build: https://builds.apache.org/job/PreCommit-YARN-Build/7545/
###################################################################################
########################## LAST 60 LINES OF THE CONSOLE ###########################
[...truncated 244 lines...]
| | | | whitespace.
| +1 | javac | 7m 29s | There were no new javac warning
| | | | messages.
| +1 | release audit | 0m 19s | The applied patch does not increase
| | | | the total number of release audit
| | | | warnings.
| +1 | checkstyle | 5m 26s | There were no new checkstyle
| | | | issues.
| +1 | install | 1m 31s | mvn install still works.
| +1 | eclipse:eclipse | 0m 30s | The patch built with
| | | | eclipse:eclipse.
| +1 | findbugs | 1m 13s | The patch does not introduce any
| | | | new Findbugs (version 2.0.3)
| | | | warnings.
| +1 | yarn tests | 52m 15s | Tests passed in
| | | | hadoop-yarn-server-resourcemanager.
| | | 73m 55s |
|| Subsystem || Report/Notes ||
============================================================================
| Patch URL | http://issues.apache.org/jira/secure/attachment/12729320/YARN-3564.1.patch |
| Optional Tests | javac unit findbugs checkstyle |
| git revision | trunk / 4c1af15 |
| hadoop-yarn-server-resourcemanager test log | /home/jenkins/jenkins-slave/workspace/PreCommit-YARN-Build/../patchprocess/testrun_hadoop-yarn-server-resourcemanager.txt |
| Test Results | https://builds.apache.org/job/PreCommit-YARN-Build/7545/testReport/ |
| Java | 1.7.0_55 |
| uname | Linux asf906.gq1.ygridcore.net 3.13.0-36-lowlatency #63-Ubuntu SMP PREEMPT Wed Sep 3 21:56:12 UTC 2014 x86_64 x86_64 x86_64 GNU/Linux |
============================================================================
============================================================================
Adding comment to JIRA
============================================================================
============================================================================
Comment added.
219d08043206d3e55925dc6ef65f4721476e7050 logged out
============================================================================
============================================================================
Finished build.
============================================================================
============================================================================
Archiving artifacts
Sending artifact delta relative to PreCommit-YARN-Build #7529
Archived 19 artifacts
Archive block size is 32768
Received 717 blocks and 146062982 bytes
Compression is 13.9%
Took 56 sec
Description set: YARN-3564
Recording test results
Email was triggered for: Success
Sending email for trigger: Success
###################################################################################
############################## FAILED TESTS (if any) ##############################
All tests passed
Failed: YARN-2893 PreCommit Build #7544
Posted by Apache Jenkins Server <je...@builds.apache.org>.
Jira: https://issues.apache.org/jira/browse/YARN-2893
Build: https://builds.apache.org/job/PreCommit-YARN-Build/7544/
###################################################################################
########################## LAST 60 LINES OF THE CONSOLE ###########################
[...truncated 269 lines...]
| -1 | checkstyle | 5m 9s | The applied patch generated 1
| | | | additional checkstyle issues.
| +1 | install | 2m 0s | mvn install still works.
| +1 | eclipse:eclipse | 0m 40s | The patch built with
| | | | eclipse:eclipse.
| +1 | findbugs | 1m 34s | The patch does not introduce any
| | | | new Findbugs (version 2.0.3)
| | | | warnings.
| -1 | yarn tests | 51m 53s | Tests failed in
| | | | hadoop-yarn-server-resourcemanager.
| | | 100m 3s |
Reason | Tests
Timed out tests | org.apache.hadoop.yarn.server.resourcemanager.security.TestAMRMTokens
|| Subsystem || Report/Notes ||
============================================================================
| Patch URL | http://issues.apache.org/jira/secure/attachment/12729253/YARN-2893.004.patch |
| Optional Tests | javadoc javac unit findbugs checkstyle |
| git revision | trunk / 3dd6395 |
| checkstyle | /home/jenkins/jenkins-slave/workspace/PreCommit-YARN-Build/../patchprocess/checkstyle-result-diff.txt |
| hadoop-yarn-server-resourcemanager test log | /home/jenkins/jenkins-slave/workspace/PreCommit-YARN-Build/../patchprocess/testrun_hadoop-yarn-server-resourcemanager.txt |
| Test Results | https://builds.apache.org/job/PreCommit-YARN-Build/7544/testReport/ |
| Java | 1.7.0_55 |
| uname | Linux asf903.gq1.ygridcore.net 3.13.0-36-lowlatency #63-Ubuntu SMP PREEMPT Wed Sep 3 21:56:12 UTC 2014 x86_64 x86_64 x86_64 GNU/Linux |
============================================================================
============================================================================
Adding comment to JIRA
============================================================================
============================================================================
Comment added.
8dcfe21b661c1553ddb1999ae7c37c1c26c6c1f3 logged out
============================================================================
============================================================================
Finished build.
============================================================================
============================================================================
Build step 'Execute shell' marked build as failure
Archiving artifacts
Sending artifact delta relative to PreCommit-YARN-Build #7529
Archived 21 artifacts
Archive block size is 32768
Received 684 blocks and 73086275 bytes
Compression is 23.5%
Took 34 sec
[description-setter] Could not determine description.
Recording test results
Email was triggered for: Failure
Sending email for trigger: Failure
###################################################################################
############################## FAILED TESTS (if any) ##############################
All tests passed
Failed: YARN-3554 PreCommit Build #7543
Posted by Apache Jenkins Server <je...@builds.apache.org>.
Jira: https://issues.apache.org/jira/browse/YARN-3554
Build: https://builds.apache.org/job/PreCommit-YARN-Build/7543/
###################################################################################
########################## LAST 60 LINES OF THE CONSOLE ###########################
[...truncated 272 lines...]
| | | | messages.
| +1 | release audit | 0m 22s | The applied patch does not increase
| | | | the total number of release audit
| | | | warnings.
| +1 | checkstyle | 7m 35s | There were no new checkstyle
| | | | issues.
| +1 | install | 1m 33s | mvn install still works.
| +1 | eclipse:eclipse | 0m 33s | The patch built with
| | | | eclipse:eclipse.
| +1 | findbugs | 2m 46s | The patch does not introduce any
| | | | new Findbugs (version 2.0.3)
| | | | warnings.
| +1 | yarn tests | 0m 30s | Tests passed in hadoop-yarn-api.
| +1 | yarn tests | 1m 55s | Tests passed in hadoop-yarn-common.
| | | 46m 59s |
|| Subsystem || Report/Notes ||
============================================================================
| Patch URL | http://issues.apache.org/jira/secure/attachment/12729227/YARN-3554-20150429-2.patch |
| Optional Tests | javadoc javac unit findbugs checkstyle |
| git revision | trunk / 8f82970 |
| hadoop-yarn-api test log | /home/jenkins/jenkins-slave/workspace/PreCommit-YARN-Build/../patchprocess/testrun_hadoop-yarn-api.txt |
| hadoop-yarn-common test log | /home/jenkins/jenkins-slave/workspace/PreCommit-YARN-Build/../patchprocess/testrun_hadoop-yarn-common.txt |
| Test Results | https://builds.apache.org/job/PreCommit-YARN-Build/7543/testReport/ |
| Java | 1.7.0_55 |
| uname | Linux asf902.gq1.ygridcore.net 3.13.0-36-lowlatency #63-Ubuntu SMP PREEMPT Wed Sep 3 21:56:12 UTC 2014 x86_64 x86_64 x86_64 GNU/Linux |
============================================================================
============================================================================
Adding comment to JIRA
============================================================================
============================================================================
Comment added.
cfcd1951f91fcd34c092585b893aeed96313cfb2 logged out
============================================================================
============================================================================
Finished build.
============================================================================
============================================================================
Build step 'Execute shell' marked build as failure
Archiving artifacts
Sending artifact delta relative to PreCommit-YARN-Build #7529
Archived 26 artifacts
Archive block size is 32768
Received 3075 blocks and 76624552 bytes
Compression is 56.8%
Took 28 sec
[description-setter] Could not determine description.
Recording test results
Email was triggered for: Failure
Sending email for trigger: Failure
###################################################################################
############################## FAILED TESTS (if any) ##############################
All tests passed
Failed: YARN-3484 PreCommit Build #7542
Posted by Apache Jenkins Server <je...@builds.apache.org>.
Jira: https://issues.apache.org/jira/browse/YARN-3484
Build: https://builds.apache.org/job/PreCommit-YARN-Build/7542/
###################################################################################
########################## LAST 60 LINES OF THE CONSOLE ###########################
[...truncated 168 lines...]
+1 overall
| Vote | Subsystem | Runtime | Comment
============================================================================
| 0 | pre-patch | 0m 0s | Pre-patch trunk compilation is
| | | | healthy.
| +1 | @author | 0m 0s | The patch does not contain any
| | | | @author tags.
| +1 | whitespace | 0m 0s | The patch has no lines that end in
| | | | whitespace.
| +1 | release audit | 0m 15s | The applied patch does not increase
| | | | the total number of release audit
| | | | warnings.
| 0 | shellcheck | 0m 15s | Shellcheck was not available.
| | | 0m 23s |
|| Subsystem || Report/Notes ||
============================================================================
| Patch URL | http://issues.apache.org/jira/secure/attachment/12729211/YARN-3484.002.patch |
| Optional Tests | shellcheck |
| git revision | trunk / 8f82970 |
| Java | 1.7.0_55 |
| uname | Linux asf905.gq1.ygridcore.net 3.13.0-36-lowlatency #63-Ubuntu SMP PREEMPT Wed Sep 3 21:56:12 UTC 2014 x86_64 x86_64 x86_64 GNU/Linux |
============================================================================
============================================================================
Adding comment to JIRA
============================================================================
============================================================================
Comment added.
f391158f575f543565f4640a41379afd37bd5489 logged out
============================================================================
============================================================================
Finished build.
============================================================================
============================================================================
Archiving artifacts
Sending artifact delta relative to PreCommit-YARN-Build #7529
Archived 3 artifacts
Archive block size is 32768
Received 2 blocks and 1506865 bytes
Compression is 4.2%
Took 23 sec
Description set: YARN-3484
Recording test results
No test report files were found. Configuration error?
Build step 'Publish JUnit test result report' changed build result to FAILURE
Email was triggered for: Failure
Sending email for trigger: Failure
###################################################################################
############################## FAILED TESTS (if any) ##############################
No tests ran.