You are viewing a plain text version of this content. The canonical link for it is here.
Posted to builds@beam.apache.org by Apache Jenkins Server <je...@builds.apache.org> on 2023/12/24 17:10:10 UTC

Build failed in Jenkins: beam_PostCommit_Python311 #1042

See <https://ci-beam.apache.org/job/beam_PostCommit_Python311/1042/display/redirect>

Changes:


------------------------------------------
[...truncated 1.01 MB...]
  nanos: 987696409
}
message: "Closing all cached grpc data channels."
log_location: "/usr/local/lib/python3.11/site-packages/apache_beam/runners/worker/data_plane.py:820"
thread: "MainThread"

INFO:root:severity: INFO
timestamp {
  seconds: 1703437784
  nanos: 987765073
}
message: "Closing all cached gRPC state handlers."
log_location: "/usr/local/lib/python3.11/site-packages/apache_beam/runners/worker/sdk_worker.py:918"
thread: "MainThread"

INFO:root:severity: INFO
timestamp {
  seconds: 1703437784
  nanos: 988207340
}
message: "Done consuming work."
log_location: "/usr/local/lib/python3.11/site-packages/apache_beam/runners/worker/sdk_worker.py:290"
thread: "MainThread"

INFO:root:severity: INFO
timestamp {
  seconds: 1703437784
  nanos: 988376140
}
message: "Python sdk harness exiting."
log_location: "/usr/local/lib/python3.11/site-packages/apache_beam/runners/worker/sdk_worker_main.py:213"
thread: "MainThread"


> Task :sdks:java:container:java8:copySdkHarnessLauncher

> Task :sdks:python:test-suites:portable:py311:portableLocalRunnerTestWithRequirementsFile
cafa9f227ee535bd57d03bd4ba597ec703ccbd14658d68937357affbcc31ee8c
INFO:apache_beam.runners.portability.local_job_service:Completed job in 32.048754930496216 seconds with state DONE.
INFO:root:Completed job in 32.048754930496216 seconds with state DONE.
INFO:apache_beam.runners.portability.portable_runner:Job state changed to DONE

> Task :sdks:python:test-suites:portable:py311:portableWordCountSparkRunnerBatch
INFO:apache_beam.runners.worker.worker_pool_main:Listening for workers at localhost:37117
INFO:apache_beam.runners.portability.fn_api_runner.translations:==================== <function pack_combiners at 0x7fe2b27e16c0> ====================
INFO:apache_beam.runners.portability.fn_api_runner.translations:==================== <function lift_combiners at 0x7fe2b27e1760> ====================
INFO:apache_beam.runners.portability.fn_api_runner.translations:==================== <function sort_stages at 0x7fe2b27e1f80> ====================
INFO:apache_beam.utils.subprocess_server:Starting service with ('java' '-jar' '<https://ci-beam.apache.org/job/beam_PostCommit_Python311/ws/src/runners/spark/3/job-server/build/libs/beam-runners-spark-3-job-server-2.54.0-SNAPSHOT.jar'> '--spark-master-url' 'local[4]' '--artifacts-dir' '/tmp/beam-tempfehynl5m/artifactsddgnvew4' '--job-port' '58507' '--artifact-port' '0' '--expansion-port' '0')
INFO:apache_beam.utils.subprocess_server:23/12/24 17:09:56 WARN software.amazon.awssdk.regions.internal.util.EC2MetadataUtils: Unable to retrieve the requested metadata.
INFO:apache_beam.utils.subprocess_server:23/12/24 17:09:57 INFO org.apache.beam.runners.jobsubmission.JobServerDriver: ArtifactStagingService started on localhost:35113
INFO:apache_beam.utils.subprocess_server:23/12/24 17:09:57 INFO org.apache.beam.runners.jobsubmission.JobServerDriver: Java ExpansionService started on localhost:36573
INFO:apache_beam.utils.subprocess_server:23/12/24 17:09:57 INFO org.apache.beam.runners.jobsubmission.JobServerDriver: JobService started on localhost:58507
INFO:apache_beam.utils.subprocess_server:23/12/24 17:09:57 INFO org.apache.beam.runners.jobsubmission.JobServerDriver: Job server now running, terminate with Ctrl+C
WARNING:root:Waiting for grpc channel to be ready at localhost:58507.
INFO:apache_beam.utils.subprocess_server:23/12/24 17:10:00 INFO org.apache.beam.runners.fnexecution.artifact.ArtifactStagingService: Staging artifacts for job_cf6a89ba-e1d5-4c35-810f-adb640eb0316.
INFO:apache_beam.utils.subprocess_server:23/12/24 17:10:00 INFO org.apache.beam.runners.fnexecution.artifact.ArtifactStagingService: Resolving artifacts for job_cf6a89ba-e1d5-4c35-810f-adb640eb0316.0:ref_Environment_default_environment_1.
INFO:apache_beam.utils.subprocess_server:23/12/24 17:10:00 INFO org.apache.beam.runners.fnexecution.artifact.ArtifactStagingService: Getting 1 artifacts for job_cf6a89ba-e1d5-4c35-810f-adb640eb0316.null.
INFO:apache_beam.utils.subprocess_server:23/12/24 17:10:00 INFO org.apache.beam.runners.fnexecution.artifact.ArtifactStagingService: Artifacts fully staged for job_cf6a89ba-e1d5-4c35-810f-adb640eb0316.
INFO:apache_beam.utils.subprocess_server:23/12/24 17:10:00 INFO org.apache.beam.runners.spark.SparkJobInvoker: Invoking job BeamApp-jenkins-1224171000-3cb827e0_da868609-cab9-4f93-83d8-a8f271be8f00
INFO:apache_beam.utils.subprocess_server:23/12/24 17:10:00 INFO org.apache.beam.runners.jobsubmission.JobInvocation: Starting job invocation BeamApp-jenkins-1224171000-3cb827e0_da868609-cab9-4f93-83d8-a8f271be8f00
INFO:apache_beam.runners.portability.portable_runner:Environment "LOOPBACK" has started a component necessary for the execution. Be sure to run the pipeline using
  with Pipeline() as p:
    p.apply(..)
This ensures that the pipeline finishes before this program exits.
INFO:apache_beam.runners.portability.portable_runner:Job state changed to STOPPED
INFO:apache_beam.runners.portability.portable_runner:Job state changed to STARTING
INFO:apache_beam.runners.portability.portable_runner:Job state changed to RUNNING
INFO:apache_beam.utils.subprocess_server:23/12/24 17:10:00 INFO org.apache.beam.runners.spark.translation.SparkContextFactory: Creating a brand new Spark Context.
INFO:apache_beam.utils.subprocess_server:23/12/24 17:10:01 WARN org.apache.hadoop.util.NativeCodeLoader: Unable to load native-hadoop library for your platform... using builtin-java classes where applicable
INFO:apache_beam.utils.subprocess_server:23/12/24 17:10:02 INFO org.sparkproject.jetty.util.log: Logging initialized @7759ms to org.sparkproject.jetty.util.log.Slf4jLog
INFO:apache_beam.utils.subprocess_server:23/12/24 17:10:02 INFO org.sparkproject.jetty.server.Server: jetty-9.4.44.v20210927; built: 2021-09-27T23:02:44.612Z; git: 8da83308eeca865e495e53ef315a249d63ba9332; jvm 1.8.0_392-8u392-ga-1~20.04-b08
INFO:apache_beam.utils.subprocess_server:23/12/24 17:10:02 INFO org.sparkproject.jetty.server.Server: Started @7890ms
INFO:apache_beam.utils.subprocess_server:23/12/24 17:10:02 INFO org.sparkproject.jetty.server.AbstractConnector: Started ServerConnector@7c87b95c{HTTP/1.1, (http/1.1)}{127.0.0.1:4040}
INFO:apache_beam.utils.subprocess_server:23/12/24 17:10:02 INFO org.sparkproject.jetty.server.handler.ContextHandler: Started o.s.j.s.ServletContextHandler@31fa4d27{/jobs,null,AVAILABLE,@Spark}
INFO:apache_beam.utils.subprocess_server:23/12/24 17:10:02 INFO org.sparkproject.jetty.server.handler.ContextHandler: Started o.s.j.s.ServletContextHandler@5566c8a{/jobs/json,null,AVAILABLE,@Spark}
INFO:apache_beam.utils.subprocess_server:23/12/24 17:10:02 INFO org.sparkproject.jetty.server.handler.ContextHandler: Started o.s.j.s.ServletContextHandler@6c5ac51c{/jobs/job,null,AVAILABLE,@Spark}
INFO:apache_beam.utils.subprocess_server:23/12/24 17:10:02 INFO org.sparkproject.jetty.server.handler.ContextHandler: Started o.s.j.s.ServletContextHandler@486d596f{/jobs/job/json,null,AVAILABLE,@Spark}
INFO:apache_beam.utils.subprocess_server:23/12/24 17:10:02 INFO org.sparkproject.jetty.server.handler.ContextHandler: Started o.s.j.s.ServletContextHandler@32eca987{/stages,null,AVAILABLE,@Spark}
INFO:apache_beam.utils.subprocess_server:23/12/24 17:10:02 INFO org.sparkproject.jetty.server.handler.ContextHandler: Started o.s.j.s.ServletContextHandler@462332bc{/stages/json,null,AVAILABLE,@Spark}
INFO:apache_beam.utils.subprocess_server:23/12/24 17:10:02 INFO org.sparkproject.jetty.server.handler.ContextHandler: Started o.s.j.s.ServletContextHandler@4b114876{/stages/stage,null,AVAILABLE,@Spark}
INFO:apache_beam.utils.subprocess_server:23/12/24 17:10:02 INFO org.sparkproject.jetty.server.handler.ContextHandler: Started o.s.j.s.ServletContextHandler@2340c6da{/stages/stage/json,null,AVAILABLE,@Spark}
INFO:apache_beam.utils.subprocess_server:23/12/24 17:10:02 INFO org.sparkproject.jetty.server.handler.ContextHandler: Started o.s.j.s.ServletContextHandler@370caeb0{/stages/pool,null,AVAILABLE,@Spark}
INFO:apache_beam.utils.subprocess_server:23/12/24 17:10:02 INFO org.sparkproject.jetty.server.handler.ContextHandler: Started o.s.j.s.ServletContextHandler@6bf512c7{/stages/pool/json,null,AVAILABLE,@Spark}
INFO:apache_beam.utils.subprocess_server:23/12/24 17:10:02 INFO org.sparkproject.jetty.server.handler.ContextHandler: Started o.s.j.s.ServletContextHandler@2cf27f58{/storage,null,AVAILABLE,@Spark}
INFO:apache_beam.utils.subprocess_server:23/12/24 17:10:02 INFO org.sparkproject.jetty.server.handler.ContextHandler: Started o.s.j.s.ServletContextHandler@1257c249{/storage/json,null,AVAILABLE,@Spark}
INFO:apache_beam.utils.subprocess_server:23/12/24 17:10:02 INFO org.sparkproject.jetty.server.handler.ContextHandler: Started o.s.j.s.ServletContextHandler@1ab64d16{/storage/rdd,null,AVAILABLE,@Spark}
INFO:apache_beam.utils.subprocess_server:23/12/24 17:10:02 INFO org.sparkproject.jetty.server.handler.ContextHandler: Started o.s.j.s.ServletContextHandler@5b49b5ac{/storage/rdd/json,null,AVAILABLE,@Spark}
INFO:apache_beam.utils.subprocess_server:23/12/24 17:10:02 INFO org.sparkproject.jetty.server.handler.ContextHandler: Started o.s.j.s.ServletContextHandler@59e696ab{/environment,null,AVAILABLE,@Spark}
INFO:apache_beam.utils.subprocess_server:23/12/24 17:10:02 INFO org.sparkproject.jetty.server.handler.ContextHandler: Started o.s.j.s.ServletContextHandler@3b64817b{/environment/json,null,AVAILABLE,@Spark}
INFO:apache_beam.utils.subprocess_server:23/12/24 17:10:02 INFO org.sparkproject.jetty.server.handler.ContextHandler: Started o.s.j.s.ServletContextHandler@22e5e240{/executors,null,AVAILABLE,@Spark}
INFO:apache_beam.utils.subprocess_server:23/12/24 17:10:02 INFO org.sparkproject.jetty.server.handler.ContextHandler: Started o.s.j.s.ServletContextHandler@2536c9f3{/executors/json,null,AVAILABLE,@Spark}
INFO:apache_beam.utils.subprocess_server:23/12/24 17:10:02 INFO org.sparkproject.jetty.server.handler.ContextHandler: Started o.s.j.s.ServletContextHandler@3c352516{/executors/threadDump,null,AVAILABLE,@Spark}
INFO:apache_beam.utils.subprocess_server:23/12/24 17:10:02 INFO org.sparkproject.jetty.server.handler.ContextHandler: Started o.s.j.s.ServletContextHandler@2250beac{/executors/threadDump/json,null,AVAILABLE,@Spark}
INFO:apache_beam.utils.subprocess_server:23/12/24 17:10:02 INFO org.sparkproject.jetty.server.handler.ContextHandler: Started o.s.j.s.ServletContextHandler@7f6b9a6a{/static,null,AVAILABLE,@Spark}
INFO:apache_beam.utils.subprocess_server:23/12/24 17:10:02 INFO org.sparkproject.jetty.server.handler.ContextHandler: Started o.s.j.s.ServletContextHandler@36d322bf{/,null,AVAILABLE,@Spark}
INFO:apache_beam.utils.subprocess_server:23/12/24 17:10:02 INFO org.sparkproject.jetty.server.handler.ContextHandler: Started o.s.j.s.ServletContextHandler@cab4ff9{/api,null,AVAILABLE,@Spark}
INFO:apache_beam.utils.subprocess_server:23/12/24 17:10:02 INFO org.sparkproject.jetty.server.handler.ContextHandler: Started o.s.j.s.ServletContextHandler@544cb37e{/jobs/job/kill,null,AVAILABLE,@Spark}
INFO:apache_beam.utils.subprocess_server:23/12/24 17:10:02 INFO org.sparkproject.jetty.server.handler.ContextHandler: Started o.s.j.s.ServletContextHandler@1c7a6cf3{/stages/stage/kill,null,AVAILABLE,@Spark}
INFO:apache_beam.utils.subprocess_server:23/12/24 17:10:02 INFO org.sparkproject.jetty.server.handler.ContextHandler: Started o.s.j.s.ServletContextHandler@39fe755a{/metrics/json,null,AVAILABLE,@Spark}
INFO:apache_beam.utils.subprocess_server:23/12/24 17:10:02 INFO org.apache.beam.runners.spark.metrics.MetricsAccumulator: Instantiated metrics accumulator: MetricQueryResults()
INFO:apache_beam.utils.subprocess_server:23/12/24 17:10:02 WARN software.amazon.awssdk.regions.internal.util.EC2MetadataUtils: Unable to retrieve the requested metadata.
INFO:apache_beam.utils.subprocess_server:23/12/24 17:10:02 INFO org.apache.beam.runners.spark.SparkPipelineRunner: Running job BeamApp-jenkins-1224171000-3cb827e0_da868609-cab9-4f93-83d8-a8f271be8f00 on Spark master local[4]
INFO:apache_beam.runners.worker.statecache:Creating state cache with size 104857600
INFO:apache_beam.runners.worker.sdk_worker:Creating insecure control channel for localhost:39443.
INFO:apache_beam.runners.worker.sdk_worker:Control channel established.
INFO:apache_beam.runners.worker.sdk_worker:Initializing SDKHarness with unbounded number of workers.
INFO:apache_beam.utils.subprocess_server:23/12/24 17:10:05 INFO org.apache.beam.runners.fnexecution.control.FnApiControlClientPoolService: Beam Fn Control client connected with id 1-1
INFO:apache_beam.utils.subprocess_server:23/12/24 17:10:05 INFO org.apache.beam.runners.fnexecution.control.FnApiControlClientPoolService: getProcessBundleDescriptor request with id 1-2
INFO:apache_beam.runners.worker.sdk_worker:Creating insecure state channel for localhost:36217.
INFO:apache_beam.runners.worker.sdk_worker:State channel established.
INFO:apache_beam.runners.worker.data_plane:Creating client data channel for localhost:43683
INFO:apache_beam.utils.subprocess_server:23/12/24 17:10:05 INFO org.apache.beam.runners.fnexecution.data.GrpcDataService: Beam Fn Data client connected.
INFO:apache_beam.utils.subprocess_server:23/12/24 17:10:05 INFO org.apache.beam.runners.fnexecution.control.FnApiControlClientPoolService: getProcessBundleDescriptor request with id 1-3
INFO:apache_beam.utils.subprocess_server:23/12/24 17:10:05 INFO org.apache.beam.runners.fnexecution.control.FnApiControlClientPoolService: getProcessBundleDescriptor request with id 1-4
INFO:apache_beam.utils.subprocess_server:23/12/24 17:10:05 INFO org.apache.beam.runners.fnexecution.control.FnApiControlClientPoolService: getProcessBundleDescriptor request with id 1-5
INFO:apache_beam.utils.subprocess_server:23/12/24 17:10:06 INFO org.apache.beam.runners.fnexecution.control.FnApiControlClientPoolService: getProcessBundleDescriptor request with id 1-8
INFO:apache_beam.utils.subprocess_server:23/12/24 17:10:06 INFO org.apache.beam.runners.fnexecution.control.FnApiControlClientPoolService: getProcessBundleDescriptor request with id 1-7
INFO:apache_beam.utils.subprocess_server:23/12/24 17:10:06 INFO org.apache.beam.runners.fnexecution.control.FnApiControlClientPoolService: getProcessBundleDescriptor request with id 1-6
INFO:apache_beam.utils.subprocess_server:23/12/24 17:10:06 INFO org.apache.beam.runners.fnexecution.control.FnApiControlClientPoolService: getProcessBundleDescriptor request with id 1-9
INFO:apache_beam.utils.subprocess_server:23/12/24 17:10:06 INFO org.apache.beam.runners.fnexecution.control.FnApiControlClientPoolService: getProcessBundleDescriptor request with id 1-10
INFO:apache_beam.utils.subprocess_server:23/12/24 17:10:06 INFO org.apache.beam.runners.fnexecution.control.FnApiControlClientPoolService: getProcessBundleDescriptor request with id 1-11
INFO:apache_beam.utils.subprocess_server:23/12/24 17:10:06 INFO org.apache.beam.runners.fnexecution.control.FnApiControlClientPoolService: getProcessBundleDescriptor request with id 1-12
INFO:apache_beam.utils.subprocess_server:23/12/24 17:10:06 INFO org.apache.beam.runners.fnexecution.control.FnApiControlClientPoolService: getProcessBundleDescriptor request with id 1-13
INFO:apache_beam.utils.subprocess_server:23/12/24 17:10:06 INFO org.apache.beam.runners.fnexecution.control.FnApiControlClientPoolService: getProcessBundleDescriptor request with id 1-14
INFO:apache_beam.utils.subprocess_server:23/12/24 17:10:06 INFO org.apache.beam.runners.fnexecution.control.FnApiControlClientPoolService: getProcessBundleDescriptor request with id 1-15
INFO:apache_beam.utils.subprocess_server:23/12/24 17:10:06 INFO org.apache.beam.runners.spark.SparkPipelineRunner: Job BeamApp-jenkins-1224171000-3cb827e0_da868609-cab9-4f93-83d8-a8f271be8f00: Pipeline translated successfully. Computing outputs
INFO:apache_beam.utils.subprocess_server:23/12/24 17:10:06 INFO org.apache.beam.runners.fnexecution.control.FnApiControlClientPoolService: getProcessBundleDescriptor request with id 1-16
INFO:apache_beam.io.filebasedsink:Starting finalize_write threads with num_shards: 4 (skipped: 0), batches: 4, num_threads: 4
INFO:apache_beam.io.filebasedsink:Renamed 4 shards in 0.01 seconds.
INFO:apache_beam.utils.subprocess_server:23/12/24 17:10:06 INFO org.apache.beam.runners.spark.SparkPipelineRunner: Job BeamApp-jenkins-1224171000-3cb827e0_da868609-cab9-4f93-83d8-a8f271be8f00 finished.
INFO:apache_beam.utils.subprocess_server:23/12/24 17:10:06 INFO org.sparkproject.jetty.server.AbstractConnector: Stopped Spark@7c87b95c{HTTP/1.1, (http/1.1)}{127.0.0.1:4040}
INFO:apache_beam.runners.portability.portable_runner:Job state changed to DONE
Exception in thread read_state:
Traceback (most recent call last):
  File "/usr/lib/python3.11/threading.py", line 1038, in _bootstrap_inner
Exception in thread run_worker_1-1:
Traceback (most recent call last):
  File "/usr/lib/python3.11/threading.py", line 1038, in _bootstrap_inner
    self.run()
  File "/usr/lib/python3.11/threading.py", line 975, in run
    self._target(*self._args, **self._kwargs)
  File "<https://ci-beam.apache.org/job/beam_PostCommit_Python311/ws/src/sdks/python/apache_beam/runners/worker/sdk_worker.py",> line 1049, in pull_responses
    self.run()
  File "/usr/lib/python3.11/threading.py", line 975, in run
    for response in responses:
    self._target(*self._args, **self._kwargs)
  File "<https://ci-beam.apache.org/job/beam_PostCommit_Python311/ws/src/build/gradleenv/-1720702906/lib/python3.11/site-packages/grpc/_channel.py",> line 540, in __next__
  File "<https://ci-beam.apache.org/job/beam_PostCommit_Python311/ws/src/sdks/python/apache_beam/runners/worker/sdk_worker.py",> line 265, in run
    for work_request in self._control_stub.Control(get_responses()):
    return self._next()
  File "<https://ci-beam.apache.org/job/beam_PostCommit_Python311/ws/src/build/gradleenv/-1720702906/lib/python3.11/site-packages/grpc/_channel.py",> line 540, in __next__
           ^^^^^^^^^^^^
  File "<https://ci-beam.apache.org/job/beam_PostCommit_Python311/ws/src/build/gradleenv/-1720702906/lib/python3.11/site-packages/grpc/_channel.py",> line 966, in _next
ERROR:apache_beam.runners.worker.data_plane:Failed to read inputs in the data plane.
Traceback (most recent call last):
  File "<https://ci-beam.apache.org/job/beam_PostCommit_Python311/ws/src/sdks/python/apache_beam/runners/worker/data_plane.py",> line 669, in _read_inputs
    for elements in elements_iterator:
  File "<https://ci-beam.apache.org/job/beam_PostCommit_Python311/ws/src/build/gradleenv/-1720702906/lib/python3.11/site-packages/grpc/_channel.py",> line 540, in __next__
    return self._next()
           ^^^^^^^^^^^^
  File "<https://ci-beam.apache.org/job/beam_PostCommit_Python311/ws/src/build/gradleenv/-1720702906/lib/python3.11/site-packages/grpc/_channel.py",> line 966, in _next
    raise self
grpc._channel._MultiThreadedRendezvous: <_MultiThreadedRendezvous of RPC that terminated with:
	status = StatusCode.UNAVAILABLE
	details = "recvmsg:Connection reset by peer"
	debug_error_string = "UNKNOWN:Error received from peer ipv6:%5B::1%5D:43683 {grpc_message:"recvmsg:Connection reset by peer", grpc_status:14, created_time:"2023-12-24T17:10:07.232845006+00:00"}"
>
    return self._next()
           ^^^^^^^^^^^^
  File "<https://ci-beam.apache.org/job/beam_PostCommit_Python311/ws/src/build/gradleenv/-1720702906/lib/python3.11/site-packages/grpc/_channel.py",> line 966, in _next
Exception in thread read_grpc_client_inputs:
    raise self
Traceback (most recent call last):
  File "/usr/lib/python3.11/threading.py", line 1038, in _bootstrap_inner
    raise self
grpc._channel._MultiThreadedRendezvous: <_MultiThreadedRendezvous of RPC that terminated with:
	status = StatusCode.UNAVAILABLE
	details = "Socket closed"
	debug_error_string = "UNKNOWN:Error received from peer ipv6:%5B::1%5D:36217 {created_time:"2023-12-24T17:10:07.232838754+00:00", grpc_status:14, grpc_message:"Socket closed"}"
>
    self.run()
grpc._channel._MultiThreadedRendezvous: <_MultiThreadedRendezvous of RPC that terminated with:
	status = StatusCode.UNAVAILABLE
	details = "recvmsg:Connection reset by peer"
	debug_error_string = "UNKNOWN:Error received from peer ipv6:%5B::1%5D:39443 {created_time:"2023-12-24T17:10:07.232847286+00:00", grpc_status:14, grpc_message:"recvmsg:Connection reset by peer"}"
>
  File "/usr/lib/python3.11/threading.py", line 975, in run
    self._target(*self._args, **self._kwargs)
  File "<https://ci-beam.apache.org/job/beam_PostCommit_Python311/ws/src/sdks/python/apache_beam/runners/worker/data_plane.py",> line 686, in <lambda>
    target=lambda: self._read_inputs(elements_iterator),
                   ^^^^^^^^^^^^^^^^^^^^^^^^^^^^^^^^^^^^
  File "<https://ci-beam.apache.org/job/beam_PostCommit_Python311/ws/src/sdks/python/apache_beam/runners/worker/data_plane.py",> line 669, in _read_inputs
    for elements in elements_iterator:
  File "<https://ci-beam.apache.org/job/beam_PostCommit_Python311/ws/src/build/gradleenv/-1720702906/lib/python3.11/site-packages/grpc/_channel.py",> line 540, in __next__
    return self._next()
           ^^^^^^^^^^^^
  File "<https://ci-beam.apache.org/job/beam_PostCommit_Python311/ws/src/build/gradleenv/-1720702906/lib/python3.11/site-packages/grpc/_channel.py",> line 966, in _next
    raise self
grpc._channel._MultiThreadedRendezvous: <_MultiThreadedRendezvous of RPC that terminated with:
	status = StatusCode.UNAVAILABLE
	details = "recvmsg:Connection reset by peer"
	debug_error_string = "UNKNOWN:Error received from peer ipv6:%5B::1%5D:43683 {grpc_message:"recvmsg:Connection reset by peer", grpc_status:14, created_time:"2023-12-24T17:10:07.232845006+00:00"}"
>

FAILURE: Build completed with 2 failures.

1: Task failed with an exception.
-----------
* Where:
Build file '<https://ci-beam.apache.org/job/beam_PostCommit_Python311/ws/src/sdks/python/build.gradle'> line: 97

* What went wrong:
Execution failed for task ':sdks:python:bdistPy311linux'.
> Process 'command 'sh'' finished with non-zero exit value 1

* Try:
> Run with --stacktrace option to get the stack trace.
> Run with --info or --debug option to get more log output.
> Get more help at https://help.gradle.org.
==============================================================================

2: Task failed with an exception.
-----------
* What went wrong:
Execution failed for task ':sdks:java:container:pullLicenses'.
> Process 'command './license_scripts/license_script.sh'' finished with non-zero exit value 1

* Try:
> Run with --stacktrace option to get the stack trace.
> Run with --info or --debug option to get more log output.
> Get more help at https://help.gradle.org.
==============================================================================

Deprecated Gradle features were used in this build, making it incompatible with Gradle 9.0.

You can use '--warning-mode all' to show the individual deprecation warnings and determine if they come from your own scripts or plugins.

For more on this, please refer to https://docs.gradle.org/8.4/userguide/command_line_interface.html#sec:command_line_warnings in the Gradle documentation.

BUILD FAILED in 21m 45s
211 actionable tasks: 145 executed, 62 from cache, 4 up-to-date

Publishing build scan...

The request was rejected.
Gradle Enterprise plugin version 3.16 is newer than the newest version supported by Gradle Enterprise 2023.3.4 which is 3.15. Please update to a newer version of Gradle Enterprise.

Build step 'Invoke Gradle script' changed build result to FAILURE
Build step 'Invoke Gradle script' marked build as failure

---------------------------------------------------------------------
To unsubscribe, e-mail: builds-unsubscribe@beam.apache.org
For additional commands, e-mail: builds-help@beam.apache.org


Jenkins build is back to normal : beam_PostCommit_Python311 #1043

Posted by Apache Jenkins Server <je...@builds.apache.org>.
See <https://ci-beam.apache.org/job/beam_PostCommit_Python311/1043/display/redirect>


---------------------------------------------------------------------
To unsubscribe, e-mail: builds-unsubscribe@beam.apache.org
For additional commands, e-mail: builds-help@beam.apache.org