You are viewing a plain text version of this content. The canonical link for it is here.
Posted to commits@karaf.apache.org by Apache Jenkins Server <je...@builds.apache.org> on 2014/06/13 01:56:13 UTC

Jenkins build is still unstable: karaf-2.x » Apache Karaf :: Integration Tests #102

See <https://builds.apache.org/job/karaf-2.x/org.apache.karaf.itests$itests/102/>


Jenkins build is unstable: karaf-2.x » Apache Karaf :: Integration Tests #109

Posted by Apache Jenkins Server <je...@builds.apache.org>.
See <https://builds.apache.org/job/karaf-2.x/org.apache.karaf.itests$itests/109/>


Build failed in Jenkins: karaf-2.x » Apache Karaf :: Integration Tests #108

Posted by Apache Jenkins Server <je...@builds.apache.org>.
See <https://builds.apache.org/job/karaf-2.x/org.apache.karaf.itests$itests/108/>

------------------------------------------
[...truncated 14648 lines...]
  Apache Karaf (2.4.0-SNAPSHOT)

Hit '<tab>' for a list of available commands
and '[cmd] --help' for help on a specific command.
Hit '<ctrl-d>' or type 'osgi:shutdown' or 'logout' to shutdown Karaf.

karaf@root> SLF4J: Failed to load class "org.slf4j.impl.StaticLoggerBinder".
SLF4J: Defaulting to no-operation (NOP) logger implementation
SLF4J: See http://www.slf4j.org/codes.html#StaticLoggerBinder for further details.
[org.ops4j.pax.exam.rbc.client.RemoteBundleContextClient] : Remote bundle context found after 5334 millis
[org.ops4j.pax.tinybundles.core.intern.RawBuilder] : make()
[org.ops4j.store.intern.TemporaryStore] : Enter store()
[org.ops4j.pax.tinybundles.core.intern.RawBuilder] : Creating manifest from added headers.
[org.ops4j.pax.tinybundles.core.intern.RawBuilder] : PaxExam-f537b8c6-b67f-442e-9e6e-895b441caf7f = org.apache.karaf.itests.AdminTest;createDestroyViaMBean
[org.ops4j.pax.tinybundles.core.intern.RawBuilder] : PaxExam-5e116897-02a0-41a5-8d78-40e03752d076 = org.apache.karaf.itests.OsgiTest;versionViaMBean
[org.ops4j.pax.tinybundles.core.intern.RawBuilder] : PaxExam-fac97e44-e849-404d-9cd6-0916291646ed = org.apache.karaf.itests.PackagesTest;importsCommand
[org.ops4j.pax.tinybundles.core.intern.RawBuilder] : PaxExam-5249cf25-de4a-4a7a-920a-5b3efd454450 = org.apache.karaf.itests.PackagesTest;exportsCommand
[org.ops4j.pax.tinybundles.core.intern.RawBuilder] : PaxExam-5a75d0c6-5d89-4ab3-935c-d7e6bfa23c78 = org.apache.karaf.itests.AdminTest;cloneCommand
[org.ops4j.pax.tinybundles.core.intern.RawBuilder] : PaxExam-98a4daff-76f6-435a-abda-f4e9478880b9 = org.apache.karaf.itests.StandardFeaturesTest;testObrFeature
[org.ops4j.pax.tinybundles.core.intern.RawBuilder] : PaxExam-7617f1ab-a009-4ac3-85dc-46ae350d5240 = org.apache.karaf.itests.StandardFeaturesTest;testWarFeature
[org.ops4j.pax.tinybundles.core.intern.RawBuilder] : PaxExam-225e96d8-6ebd-4760-81fb-fa07165307f4 = org.apache.karaf.itests.StandardFeaturesTest;testHttpFeature
[org.ops4j.pax.tinybundles.core.intern.RawBuilder] : PaxExam-749fa2f8-9f41-4ffc-9491-b7f7ccfca024 = org.apache.karaf.itests.ServicesTest;listViaMBean
[org.ops4j.pax.tinybundles.core.intern.RawBuilder] : PaxExam-d6928d46-0dfd-4aa7-9112-e22acbb30e21 = org.apache.karaf.itests.FeaturesTest;repoAddRemoveViaMBean
[org.ops4j.pax.tinybundles.core.intern.RawBuilder] : PaxExam-b0ec4070-0242-4461-992d-328c186b12b7 = org.apache.karaf.itests.OsgiTest;classesCommand
[org.ops4j.pax.tinybundles.core.intern.RawBuilder] : PaxExam-04eb41e2-b710-47ad-9679-d9178d25e05b = org.apache.karaf.itests.StandardFeaturesTest;testSpringOxmFeature
[org.ops4j.pax.tinybundles.core.intern.RawBuilder] : PaxExam-fa6d570c-7004-4b85-a67b-7442740258ce = org.apache.karaf.itests.StandardFeaturesTest;testSpringOrmFeature
[org.ops4j.pax.tinybundles.core.intern.RawBuilder] : Ignore-Package = 
[org.ops4j.pax.tinybundles.core.intern.RawBuilder] : PaxExam-0778836b-d1af-4932-8e15-1b5458125c38 = org.apache.karaf.itests.StandardFeaturesTest;testSpringFeature
[org.ops4j.pax.tinybundles.core.intern.RawBuilder] : PaxExam-c5501eed-4929-40f1-8583-12390e6fdb5e = org.apache.karaf.itests.OsgiTest;installCommand
[org.ops4j.pax.tinybundles.core.intern.RawBuilder] : PaxExam-4a6b9e7f-3ef6-4e0a-85dd-c2719402a7b2 = org.apache.karaf.itests.FeaturesTest;installUninstallViaMBean
[org.ops4j.pax.tinybundles.core.intern.RawBuilder] : PaxExam-cbe9d7ff-5d82-4a51-a24a-50375db9c4d0 = org.apache.karaf.itests.EnterpriseFeaturesTest;testOpenJpaFeature
[org.ops4j.pax.tinybundles.core.intern.RawBuilder] : PaxExam-59156f73-880e-444a-bd9b-88f7ee74dece = org.apache.karaf.itests.StandardFeaturesTest;testWebconsoleFeature
[org.ops4j.pax.tinybundles.core.intern.RawBuilder] : PaxExam-ae4f9310-0273-4fca-bce7-f17b50befa9d = org.apache.karaf.itests.StandardFeaturesTest;testSpringJmsFeature
[org.ops4j.pax.tinybundles.core.intern.RawBuilder] : PaxExam-a2a1d736-b3aa-427f-8c51-c6a06ef829ff = org.apache.karaf.itests.OsgiTest;versionCommand
[org.ops4j.pax.tinybundles.core.intern.RawBuilder] : PaxExam-977f77f4-6173-4b16-b88d-edfbd935b1f6 = org.apache.karaf.itests.StandardFeaturesTest;testSpringJdbcFeature
[org.ops4j.pax.tinybundles.core.intern.RawBuilder] : PaxExam-c42a6bdb-19f3-40f8-aaea-d90c3af1e235 = org.apache.karaf.itests.EnterpriseFeaturesTest;testHibernateEnversFeature
[org.ops4j.pax.tinybundles.core.intern.RawBuilder] : PaxExam-cb8e33e5-a61b-48bf-b20a-fa0e7e311674 = org.apache.karaf.itests.StandardFeaturesTest;testSpringTxFeature
[org.ops4j.pax.tinybundles.core.intern.RawBuilder] : PaxExam-2c03477e-2d07-4f9e-ae2e-54147f7ac333 = org.apache.karaf.itests.EnterpriseFeaturesTest;testApplicationWithoutIsolationFeature
[org.ops4j.pax.tinybundles.core.intern.RawBuilder] : PaxExam-e23ad003-5d37-4a24-aa72-2728986ed1bb = org.apache.karaf.itests.AdminTest;cloneViaMBean
[org.ops4j.pax.tinybundles.core.intern.RawBuilder] : PaxExam-8aef0a2e-c5e8-45ab-9172-e5aa2e5b5b4e = org.apache.karaf.itests.StandardFeaturesTest;testSpringStrutsFeature
[org.ops4j.pax.tinybundles.core.intern.RawBuilder] : PaxExam-59c4b573-6f70-4174-af43-6ea3c7ad7044 = org.apache.karaf.itests.StandardFeaturesTest;testWrapperFeature
[org.ops4j.pax.tinybundles.core.intern.RawBuilder] : PaxExam-81938d05-0e4d-4029-95b7-5db50f502d2a = org.apache.karaf.itests.ServicesTest;listCommand
[org.ops4j.pax.tinybundles.core.intern.RawBuilder] : PaxExam-920f20e7-fe0e-4bba-a1a3-96706adbca2d = org.apache.karaf.itests.LogTest;setDebugAndDisplay
[org.ops4j.pax.tinybundles.core.intern.RawBuilder] : PaxExam-4711ed1b-7b77-429f-9ddf-d316d5488b02 = org.apache.karaf.itests.OsgiTest;startLevelCommand
[org.ops4j.pax.tinybundles.core.intern.RawBuilder] : PaxExam-680566dd-a30e-4b79-ba68-afe4bec5fbad = org.apache.karaf.itests.JaasTest;testLoginSingleReg
[org.ops4j.pax.tinybundles.core.intern.RawBuilder] : PaxExam-a8fe54a9-3810-4a16-9630-ba329f0b6c5e = org.apache.karaf.itests.JMXSecurityTest;testJMXSecurityAsAdmin
[org.ops4j.pax.tinybundles.core.intern.RawBuilder] : PaxExam-8cbb3598-6e52-45e0-a5f0-21789809f31e = org.apache.karaf.itests.StandardFeaturesTest;testSpringWebFeature
[org.ops4j.pax.tinybundles.core.intern.RawBuilder] : PaxExam-8aa4cf1b-d130-44f4-b5ab-e989f8c40698 = org.apache.karaf.itests.FeaturesTest;repoAddRemoveCommand
[org.ops4j.pax.tinybundles.core.intern.RawBuilder] : PaxExam-56efdf6f-63a7-43e7-965a-412c9fc469e2 = org.apache.karaf.itests.StandardFeaturesTest;testSpringWebPortletFeature
[org.ops4j.pax.tinybundles.core.intern.RawBuilder] : PaxExam-a8c5457e-0dab-4aab-9e47-a10e3994cd4f = org.apache.karaf.itests.StandardFeaturesTest;testHttpWhiteboardFeature
[org.ops4j.pax.tinybundles.core.intern.RawBuilder] : PaxExam-cf68b7e3-a535-4c53-8969-d52e7bbbf559 = org.apache.karaf.itests.ObrTest;listsViaMBean
[org.ops4j.pax.tinybundles.core.intern.RawBuilder] : PaxExam-879e2636-110b-4f8b-aadb-7e5ef355fb7d = org.apache.karaf.itests.PackagesTest;importsViaMBean
[org.ops4j.pax.tinybundles.core.intern.RawBuilder] : PaxExam-7c60f0b9-090a-4ce9-a8aa-af058ab6f412 = org.apache.karaf.itests.EnterpriseFeaturesTest;testJndiFeature
[org.ops4j.pax.tinybundles.core.intern.RawBuilder] : DynamicImport-Package = *,org.apache.felix.service.*;status=provisional
[org.ops4j.pax.tinybundles.core.intern.RawBuilder] : PaxExam-3ced93cc-94f3-4238-aa7c-0b8dcfb67a5e = org.apache.karaf.itests.StandardFeaturesTest;testSpringDmWebFeature
[org.ops4j.pax.tinybundles.core.intern.RawBuilder] : PaxExam-be434933-1bcd-4130-915f-e28e067a4848 = org.apache.karaf.itests.LogTest;setDebugViaMBean
[org.ops4j.pax.tinybundles.core.intern.RawBuilder] : PaxExam-ced0aeac-7f02-4439-9807-fe500f999115 = org.apache.karaf.itests.JaasTest;realmListCommand
[org.ops4j.pax.tinybundles.core.intern.RawBuilder] : PaxExam-864851d3-6282-4204-a04c-54132f12c9e1 = org.apache.karaf.itests.PackagesTest;exportsViaMBean
[org.ops4j.pax.tinybundles.core.intern.RawBuilder] : PaxExam-c9b8a54c-f262-403d-b07c-05003441be27 = org.apache.karaf.itests.ConfigSshCommandSecurityTest;testConfigCommandSecurityWithoutEditSessionViaSsh
[org.ops4j.pax.tinybundles.core.intern.RawBuilder] : PaxExam-de14fc24-dd57-4042-b10c-bc52856924bd = org.apache.karaf.itests.StandardFeaturesTest;testEventadminFeature
[org.ops4j.pax.tinybundles.core.intern.RawBuilder] : PaxExam-7d795787-52f8-4902-9334-bed47b5a4fec = org.apache.karaf.itests.OsgiTest;headersCommand
[org.ops4j.pax.tinybundles.core.intern.RawBuilder] : PaxExam-3d275e6c-4e0d-4c0c-967f-52e07fa886a7 = org.apache.karaf.itests.StandardFeaturesTest;testSpringDmFeature
[org.ops4j.pax.tinybundles.core.intern.RawBuilder] : PaxExam-df528fcb-24c4-4289-93e3-74c39c7f201f = org.apache.karaf.itests.ObrTest;listCommands
[org.ops4j.pax.tinybundles.core.intern.RawBuilder] : PaxExam-8d6b614b-42f6-470f-a598-68f7a099b130 = org.apache.karaf.itests.ConfigTest;listViaMBean
[org.ops4j.pax.tinybundles.core.intern.RawBuilder] : PaxExam-a8a00055-78eb-404d-8eeb-b4b9c12dd607 = org.apache.karaf.itests.OsgiTest;nameCommand
[org.ops4j.pax.tinybundles.core.intern.RawBuilder] : PaxExam-29dff8b7-1e86-40c5-a505-781ddd8c045e = org.apache.karaf.itests.StandardFeaturesTest;testSpringInstrumentFeature
[org.ops4j.pax.tinybundles.core.intern.RawBuilder] : PaxExam-6b34a281-a2f8-4077-ba0c-95ad63bed935 = org.apache.karaf.itests.OsgiTest;listCommand
[org.ops4j.pax.tinybundles.core.intern.RawBuilder] : PaxExam-69fb03df-8bf4-42b7-b7ed-1acff5022d33 = org.apache.karaf.itests.StandardFeaturesTest;testJasyptEncryptionFeature
[org.ops4j.pax.tinybundles.core.intern.RawBuilder] : PaxExam-f686217c-e24b-429e-987c-21afd5e68bd2 = org.apache.karaf.itests.EnterpriseFeaturesTest;testJpaFeature
[org.ops4j.pax.tinybundles.core.intern.RawBuilder] : PaxExam-Executable = PaxExam-d6928d46-0dfd-4aa7-9112-e22acbb30e21,PaxExam-8aa4cf1b-d130-44f4-b5ab-e989f8c40698,PaxExam-4c301bf8-6217-4499-ac53-17901b134c79,PaxExam-0b589e40-e0ac-416c-ae82-db692a476549,PaxExam-4a6b9e7f-3ef6-4e0a-85dd-c2719402a7b2,PaxExam-a44c6cc8-8b09-4eb3-9d02-25c93bd75096,PaxExam-82c02612-70f5-488c-92d8-8565090d557c,PaxExam-a8fe54a9-3810-4a16-9630-ba329f0b6c5e,PaxExam-e0f6f4f1-efce-4583-8039-27a222eae0bc,PaxExam-204aa3dc-f7f0-4119-a21c-a820f9746229,PaxExam-879e2636-110b-4f8b-aadb-7e5ef355fb7d,PaxExam-864851d3-6282-4204-a04c-54132f12c9e1,PaxExam-5249cf25-de4a-4a7a-920a-5b3efd454450,PaxExam-fac97e44-e849-404d-9cd6-0916291646ed,PaxExam-1b06bf47-1b84-4987-a60f-fda602e0b57a,PaxExam-2a13cda5-5ac5-4eb9-8b4c-11b6e914ef9b,PaxExam-d7a7bf4b-cfaf-441e-af5e-3fd46c2890db,PaxExam-8d6b614b-42f6-470f-a598-68f7a099b130,PaxExam-da64c393-b799-4834-92a7-985e7e1eb31f,PaxExam-81938d05-0e4d-4029-95b7-5db50f502d2a,PaxExam-749fa2f8-9f41-4ffc-9491-b7f7ccfca024,PaxExam-bfe78beb-7768-43ac-a075-5718037b1892,PaxExam-c42a6bdb-19f3-40f8-aaea-d90c3af1e235,PaxExam-cbe9d7ff-5d82-4a51-a24a-50375db9c4d0,PaxExam-8a005775-3d43-40c9-aa3d-35d6183c7c5e,PaxExam-08b62b4a-7c88-4490-91c1-1e6cdfff7165,PaxExam-7c60f0b9-090a-4ce9-a8aa-af058ab6f412,PaxExam-2c03477e-2d07-4f9e-ae2e-54147f7ac333,PaxExam-3fb571fc-c2c0-4b9a-a802-f20a67dad341,PaxExam-f686217c-e24b-429e-987c-21afd5e68bd2,PaxExam-be434933-1bcd-4130-915f-e28e067a4848,PaxExam-920f20e7-fe0e-4bba-a1a3-96706adbca2d,PaxExam-a9bfe39f-5dc6-4187-b871-14b0340b6923,PaxExam-f71a14ed-e3fb-4a85-a0d2-e30eb7559624,PaxExam-c9b8a54c-f262-403d-b07c-05003441be27,PaxExam-4ce98ae1-3ce5-4cd2-b47c-131155451548,PaxExam-de14fc24-dd57-4042-b10c-bc52856924bd,PaxExam-3d275e6c-4e0d-4c0c-967f-52e07fa886a7,PaxExam-ae4f9310-0273-4fca-bce7-f17b50befa9d,PaxExam-8aef0a2e-c5e8-45ab-9172-e5aa2e5b5b4e,PaxExam-e68810c9-7fc6-464a-9596-7556514b4ea1,PaxExam-69fb03df-8bf4-42b7-b7ed-1acff5022d33,PaxExam-56efdf6f-63a7-43e7-965a-412c9fc469e2,PaxExam-59c4b573-6f70-4174-af43-6ea3c7ad7044,PaxExam-7f707827-4688-498f-825f-8eb780d496a7,PaxExam-225e96d8-6ebd-4760-81fb-fa07165307f4,PaxExam-fa6d570c-7004-4b85-a67b-7442740258ce,PaxExam-59156f73-880e-444a-bd9b-88f7ee74dece,PaxExam-98a4daff-76f6-435a-abda-f4e9478880b9,PaxExam-7617f1ab-a009-4ac3-85dc-46ae350d5240,PaxExam-0778836b-d1af-4932-8e15-1b5458125c38,PaxExam-977f77f4-6173-4b16-b88d-edfbd935b1f6,PaxExam-cb8e33e5-a61b-48bf-b20a-fa0e7e311674,PaxExam-04eb41e2-b710-47ad-9679-d9178d25e05b,PaxExam-7c210f70-af8d-4d5b-9634-d166f18d7fb7,PaxExam-29dff8b7-1e86-40c5-a505-781ddd8c045e,PaxExam-3ced93cc-94f3-4238-aa7c-0b8dcfb67a5e,PaxExam-60e01fdb-c093-4d5a-a0ba-c8a2abfe457c,PaxExam-8cbb3598-6e52-45e0-a5f0-21789809f31e,PaxExam-a8c5457e-0dab-4aab-9e47-a10e3994cd4f,PaxExam-680566dd-a30e-4b79-ba68-afe4bec5fbad,PaxExam-ced0aeac-7f02-4439-9807-fe500f999115,PaxExam-c5501eed-4929-40f1-8583-12390e6fdb5e,PaxExam-7d795787-52f8-4902-9334-bed47b5a4fec,PaxExam-4711ed1b-7b77-429f-9ddf-d316d5488b02,PaxExam-1e012b0a-fe68-4402-bd9a-801606a234e6,PaxExam-be2c8a85-7704-44e3-92df-4c00974af2f6,PaxExam-5e116897-02a0-41a5-8d78-40e03752d076,PaxExam-409ca4e3-120f-4dc4-8ead-19193e728502,PaxExam-a2a1d736-b3aa-427f-8c51-c6a06ef829ff,PaxExam-a8a00055-78eb-404d-8eeb-b4b9c12dd607,PaxExam-b0ec4070-0242-4461-992d-328c186b12b7,PaxExam-6b34a281-a2f8-4077-ba0c-95ad63bed935,PaxExam-d22070ee-f4f5-491b-87b6-f8143f09e40c,PaxExam-8172a1ba-1e5a-4832-a7c1-a2a865fe3848,PaxExam-df528fcb-24c4-4289-93e3-74c39c7f201f,PaxExam-cf68b7e3-a535-4c53-8969-d52e7bbbf559,PaxExam-786721d0-0b2d-4fb9-87dc-fde92e27492a,PaxExam-de4d6738-cc76-4aaf-adc3-9db27466d1ff,PaxExam-e23ad003-5d37-4a24-aa72-2728986ed1bb,PaxExam-5a75d0c6-5d89-4ab3-935c-d7e6bfa23c78,PaxExam-f537b8c6-b67f-442e-9e6e-895b441caf7f,
[org.ops4j.pax.tinybundles.core.intern.RawBuilder] : PaxExam-3fb571fc-c2c0-4b9a-a802-f20a67dad341 = org.apache.karaf.itests.EnterpriseFeaturesTest;testTransactionFeature
[org.ops4j.pax.tinybundles.core.intern.RawBuilder] : PaxExam-409ca4e3-120f-4dc4-8ead-19193e728502 = org.apache.karaf.itests.OsgiTest;findClassCommand
[org.ops4j.pax.tinybundles.core.intern.RawBuilder] : PaxExam-da64c393-b799-4834-92a7-985e7e1eb31f = org.apache.karaf.itests.WrapperTest;installCommand
[org.ops4j.pax.tinybundles.core.intern.RawBuilder] : PaxExam-a44c6cc8-8b09-4eb3-9d02-25c93bd75096 = org.apache.karaf.itests.FeaturesTest;listViaMBean
[org.ops4j.pax.tinybundles.core.intern.RawBuilder] : PaxExam-4c301bf8-6217-4499-ac53-17901b134c79 = org.apache.karaf.itests.FeaturesTest;installUninstallCommand
[org.ops4j.pax.tinybundles.core.intern.RawBuilder] : PaxExam-1e012b0a-fe68-4402-bd9a-801606a234e6 = org.apache.karaf.itests.OsgiTest;infoCommand
[org.ops4j.pax.tinybundles.core.intern.RawBuilder] : PaxExam-de4d6738-cc76-4aaf-adc3-9db27466d1ff = org.apache.karaf.itests.AdminTest;createDestroyCommand
[org.ops4j.pax.tinybundles.core.intern.RawBuilder] : PaxExam-e68810c9-7fc6-464a-9596-7556514b4ea1 = org.apache.karaf.itests.StandardFeaturesTest;testSpringTestFeature
[org.ops4j.pax.tinybundles.core.intern.RawBuilder] : PaxExam-7f707827-4688-498f-825f-8eb780d496a7 = org.apache.karaf.itests.StandardFeaturesTest;testBootFeatures
[org.ops4j.pax.tinybundles.core.intern.RawBuilder] : PaxExam-1b06bf47-1b84-4987-a60f-fda602e0b57a = org.apache.karaf.itests.ShellCommandSecurityTest;testShellCommandSecurityViaSsh
[org.ops4j.pax.tinybundles.core.intern.RawBuilder] : PaxExam-e0f6f4f1-efce-4583-8039-27a222eae0bc = org.apache.karaf.itests.JMXSecurityTest;testJMXSecurityAsManager
[org.ops4j.pax.tinybundles.core.intern.RawBuilder] : PaxExam-7c210f70-af8d-4d5b-9634-d166f18d7fb7 = org.apache.karaf.itests.StandardFeaturesTest;testJettyFeature
[org.ops4j.pax.tinybundles.core.intern.RawBuilder] : Bundle-SymbolicName = PAXEXAM-PROBE-2b466e74-f927-4a4c-8c90-2b6bc67a3506
[org.ops4j.pax.tinybundles.core.intern.RawBuilder] : PaxExam-bfe78beb-7768-43ac-a075-5718037b1892 = org.apache.karaf.itests.OsgiSshCommandSecurityTest;testOsgiCommandSecurityViaSsh
[org.ops4j.pax.tinybundles.core.intern.RawBuilder] : PaxExam-d22070ee-f4f5-491b-87b6-f8143f09e40c = org.apache.karaf.itests.OsgiTest;nameViaMBean
[org.ops4j.pax.tinybundles.core.intern.RawBuilder] : PaxExam-786721d0-0b2d-4fb9-87dc-fde92e27492a = org.apache.karaf.itests.AdminTest;renameCommand
[org.ops4j.pax.tinybundles.core.intern.RawBuilder] : PaxExam-2a13cda5-5ac5-4eb9-8b4c-11b6e914ef9b = org.apache.karaf.itests.FeaturesSshCommandSecurityTest;testFeatureCommandSecurityViaSsh
[org.ops4j.pax.tinybundles.core.intern.RawBuilder] : PaxExam-08b62b4a-7c88-4490-91c1-1e6cdfff7165 = org.apache.karaf.itests.EnterpriseFeaturesTest;testHibernateFeature
[org.ops4j.pax.tinybundles.core.intern.RawBuilder] : PaxExam-8a005775-3d43-40c9-aa3d-35d6183c7c5e = org.apache.karaf.itests.EnterpriseFeaturesTest;testHibernateValidatorFeature
[org.ops4j.pax.tinybundles.core.intern.RawBuilder] : PaxExam-f71a14ed-e3fb-4a85-a0d2-e30eb7559624 = org.apache.karaf.itests.JaasSshCommandSecurityTest;testJaasCommandSecurityViaSsh
[org.ops4j.pax.tinybundles.core.intern.RawBuilder] : PaxExam-d7a7bf4b-cfaf-441e-af5e-3fd46c2890db = org.apache.karaf.itests.ConfigTest;listCommand
[org.ops4j.pax.tinybundles.core.intern.RawBuilder] : PaxExam-82c02612-70f5-488c-92d8-8565090d557c = org.apache.karaf.itests.JMXSecurityTest;testJMXSecurityAsViewer
[org.ops4j.pax.tinybundles.core.intern.RawBuilder] : Bundle-ManifestVersion = 2
[org.ops4j.pax.tinybundles.core.intern.RawBuilder] : PaxExam-60e01fdb-c093-4d5a-a0ba-c8a2abfe457c = org.apache.karaf.itests.StandardFeaturesTest;testSpringAspectsFeature
[org.ops4j.pax.tinybundles.core.intern.RawBuilder] : PaxExam-0b589e40-e0ac-416c-ae82-db692a476549 = org.apache.karaf.itests.FeaturesTest;listCommand
[org.ops4j.pax.tinybundles.core.intern.RawBuilder] : PaxExam-be2c8a85-7704-44e3-92df-4c00974af2f6 = org.apache.karaf.itests.OsgiTest;shutdownCommand
[org.ops4j.pax.tinybundles.core.intern.RawBuilder] : PaxExam-4ce98ae1-3ce5-4cd2-b47c-131155451548 = org.apache.karaf.itests.ConfigSshCommandSecurityTest;testConfigCommandSecurityViaSsh
[org.ops4j.pax.tinybundles.core.intern.RawBuilder] : PaxExam-a9bfe39f-5dc6-4187-b871-14b0340b6923 = org.apache.karaf.itests.LogTest;setGetDebugAndClear
[org.ops4j.pax.tinybundles.core.intern.RawBuilder] : PaxExam-204aa3dc-f7f0-4119-a21c-a820f9746229 = org.apache.karaf.itests.JMXSecurityTest;testJMXSecurityCannotLogInAsGroupDirectly
[org.ops4j.pax.tinybundles.core.intern.RawBuilder] : PaxExam-8172a1ba-1e5a-4832-a7c1-a2a865fe3848 = org.apache.karaf.itests.OsgiTest;listViaMBean
[org.ops4j.pax.tinybundles.core.intern.RawBuilder] : Copying resource org/apache/karaf/itests/FeaturesSshCommandSecurityTest.class
[org.ops4j.pax.tinybundles.core.intern.RawBuilder] : Copying resource org/apache/karaf/itests/ShellCommandSecurityTest.class
[org.ops4j.pax.tinybundles.core.intern.RawBuilder] : Copying resource org/apache/karaf/itests/SshCommandTestBase$Result.class
[org.ops4j.pax.tinybundles.core.intern.RawBuilder] : Copying resource org/apache/karaf/itests/KarafTestSupport$2.class
[org.ops4j.pax.tinybundles.core.intern.RawBuilder] : Copying resource org/apache/karaf/itests/PackagesTest.class
[org.ops4j.pax.tinybundles.core.intern.RawBuilder] : Copying resource META-INF/DEPENDENCIES
[org.ops4j.pax.tinybundles.core.intern.RawBuilder] : Copying resource org/apache/karaf/itests/KarafTestSupport$1.class
[org.ops4j.pax.tinybundles.core.intern.RawBuilder] : Copying resource org/apache/karaf/itests/ObrTest.class
[org.ops4j.pax.tinybundles.core.intern.RawBuilder] : Copying resource org/apache/karaf/itests/KarafTestSupport$2$1.class
[org.ops4j.pax.tinybundles.core.intern.RawBuilder] : Copying resource org/apache/karaf/itests/FeaturesTest.class
[org.ops4j.pax.tinybundles.core.intern.RawBuilder] : Copying resource META-INF/LICENSE
[org.ops4j.pax.tinybundles.core.intern.RawBuilder] : Copying resource org/apache/karaf/itests/SshCommandTestBase.class
[org.ops4j.pax.tinybundles.core.intern.RawBuilder] : Copying resource org/apache/karaf/itests/JaasTest$1.class
[org.ops4j.pax.tinybundles.core.intern.RawBuilder] : Copying resource org/apache/karaf/itests/WrapperTest.class
[org.ops4j.pax.tinybundles.core.intern.RawBuilder] : Copying resource org/apache/karaf/itests/JaasTest.class
[org.ops4j.pax.tinybundles.core.intern.RawBuilder] : Copying resource org/apache/karaf/itests/OsgiSshCommandSecurityTest.class
[org.ops4j.pax.tinybundles.core.intern.RawBuilder] : Copying resource org/apache/karaf/itests/JMXSecurityTest.class
[org.ops4j.pax.tinybundles.core.intern.RawBuilder] : Copying resource META-INF/NOTICE
[org.ops4j.pax.tinybundles.core.intern.RawBuilder] : Copying resource org/apache/karaf/itests/EnterpriseFeaturesTest.class
[org.ops4j.pax.tinybundles.core.intern.RawBuilder] : Copying resource org/apache/karaf/itests/StandardFeaturesTest.class
[org.ops4j.pax.tinybundles.core.intern.RawBuilder] : Copying resource org/apache/karaf/itests/KarafTestSupport.class
[org.ops4j.pax.tinybundles.core.intern.RawBuilder] : Copying resource org/apache/karaf/itests/LogTest.class
[org.ops4j.pax.tinybundles.core.intern.RawBuilder] : Copying resource org/apache/karaf/itests/ServicesTest.class
[org.ops4j.pax.tinybundles.core.intern.RawBuilder] : Copying resource org/apache/karaf/itests/JaasSshCommandSecurityTest.class
[org.ops4j.pax.tinybundles.core.intern.RawBuilder] : Copying resource org/apache/karaf/itests/ConfigTest.class
[org.ops4j.pax.tinybundles.core.intern.RawBuilder] : Copying resource org/apache/karaf/itests/AdminTest.class
[org.ops4j.pax.tinybundles.core.intern.RawBuilder] : Copying resource org/apache/karaf/itests/SshCommandTestBase$1.class
[org.ops4j.pax.tinybundles.core.intern.RawBuilder] : Copying resource org/apache/karaf/itests/ConfigSshCommandSecurityTest.class
[org.ops4j.pax.tinybundles.core.intern.RawBuilder] : Copying resource org/apache/karaf/itests/OsgiTest.class
[org.ops4j.store.intern.TemporaryStore] : Exit store(): 3a0a95d42ba0b70775848db526510eef974effab
[org.ops4j.pax.exam.container.remote.RBCRemoteTarget] : Preparing and Installing bundle (from stream )..
[org.ops4j.pax.exam.rbc.client.RemoteBundleContextClient] : Packing probe into memory for true RMI. Hopefully things will fill in..
[org.ops4j.pax.exam.container.remote.RBCRemoteTarget] : Installed bundle (from stream) as ID: 76
[org.ops4j.pax.exam.container.remote.RBCRemoteTarget] : call [[TestAddress:PaxExam-1afd7667-e7bc-4b84-a324-ddd29c2d4d60 root:PaxExam-f537b8c6-b67f-442e-9e6e-895b441caf7f]]
Creating new instance on SSH port 8102 and RMI ports 1100/44445 at: <https://builds.apache.org/job/karaf-2.x/org.apache.karaf.itests$itests/ws/target/exam/01bedbb8-c0b5-4f87-a024-635f20d08eff/instances/itest>
Creating dir:  <https://builds.apache.org/job/karaf-2.x/org.apache.karaf.itests$itests/ws/target/exam/01bedbb8-c0b5-4f87-a024-635f20d08eff/instances/itest/bin>
Creating dir:  <https://builds.apache.org/job/karaf-2.x/org.apache.karaf.itests$itests/ws/target/exam/01bedbb8-c0b5-4f87-a024-635f20d08eff/instances/itest/etc>
Creating dir:  <https://builds.apache.org/job/karaf-2.x/org.apache.karaf.itests$itests/ws/target/exam/01bedbb8-c0b5-4f87-a024-635f20d08eff/instances/itest/system>
Creating dir:  <https://builds.apache.org/job/karaf-2.x/org.apache.karaf.itests$itests/ws/target/exam/01bedbb8-c0b5-4f87-a024-635f20d08eff/instances/itest/deploy>
Creating dir:  <https://builds.apache.org/job/karaf-2.x/org.apache.karaf.itests$itests/ws/target/exam/01bedbb8-c0b5-4f87-a024-635f20d08eff/instances/itest/data>
Creating file: <https://builds.apache.org/job/karaf-2.x/org.apache.karaf.itests$itests/ws/target/exam/01bedbb8-c0b5-4f87-a024-635f20d08eff/instances/itest/etc/all.policy>
Creating file: <https://builds.apache.org/job/karaf-2.x/org.apache.karaf.itests$itests/ws/target/exam/01bedbb8-c0b5-4f87-a024-635f20d08eff/instances/itest/etc/config.properties>
Creating file: <https://builds.apache.org/job/karaf-2.x/org.apache.karaf.itests$itests/ws/target/exam/01bedbb8-c0b5-4f87-a024-635f20d08eff/instances/itest/etc/custom.properties>
Creating file: <https://builds.apache.org/job/karaf-2.x/org.apache.karaf.itests$itests/ws/target/exam/01bedbb8-c0b5-4f87-a024-635f20d08eff/instances/itest/etc/java.util.logging.properties>
Creating file: <https://builds.apache.org/job/karaf-2.x/org.apache.karaf.itests$itests/ws/target/exam/01bedbb8-c0b5-4f87-a024-635f20d08eff/instances/itest/etc/jmx.acl.cfg>
Creating file: <https://builds.apache.org/job/karaf-2.x/org.apache.karaf.itests$itests/ws/target/exam/01bedbb8-c0b5-4f87-a024-635f20d08eff/instances/itest/etc/jmx.acl.java.lang.Memory.cfg>
Creating file: <https://builds.apache.org/job/karaf-2.x/org.apache.karaf.itests$itests/ws/target/exam/01bedbb8-c0b5-4f87-a024-635f20d08eff/instances/itest/etc/jmx.acl.org.apache.karaf.bundle.cfg>
Creating file: <https://builds.apache.org/job/karaf-2.x/org.apache.karaf.itests$itests/ws/target/exam/01bedbb8-c0b5-4f87-a024-635f20d08eff/instances/itest/etc/jmx.acl.org.apache.karaf.config.cfg>
Creating file: <https://builds.apache.org/job/karaf-2.x/org.apache.karaf.itests$itests/ws/target/exam/01bedbb8-c0b5-4f87-a024-635f20d08eff/instances/itest/etc/jmx.acl.org.apache.karaf.security.jmx.cfg>
Creating file: <https://builds.apache.org/job/karaf-2.x/org.apache.karaf.itests$itests/ws/target/exam/01bedbb8-c0b5-4f87-a024-635f20d08eff/instances/itest/etc/jmx.acl.osgi.compendium.cm.cfg>
Creating file: <https://builds.apache.org/job/karaf-2.x/org.apache.karaf.itests$itests/ws/target/exam/01bedbb8-c0b5-4f87-a024-635f20d08eff/instances/itest/etc/jre.properties>
Creating file: <https://builds.apache.org/job/karaf-2.x/org.apache.karaf.itests$itests/ws/target/exam/01bedbb8-c0b5-4f87-a024-635f20d08eff/instances/itest/etc/keys.properties>
Creating file: <https://builds.apache.org/job/karaf-2.x/org.apache.karaf.itests$itests/ws/target/exam/01bedbb8-c0b5-4f87-a024-635f20d08eff/instances/itest/etc/org.apache.felix.fileinstall-deploy.cfg>
Creating file: <https://builds.apache.org/job/karaf-2.x/org.apache.karaf.itests$itests/ws/target/exam/01bedbb8-c0b5-4f87-a024-635f20d08eff/instances/itest/etc/org.apache.karaf.features.cfg>
Creating file: <https://builds.apache.org/job/karaf-2.x/org.apache.karaf.itests$itests/ws/target/exam/01bedbb8-c0b5-4f87-a024-635f20d08eff/instances/itest/etc/org.apache.karaf.features.obr.cfg>
Creating file: <https://builds.apache.org/job/karaf-2.x/org.apache.karaf.itests$itests/ws/target/exam/01bedbb8-c0b5-4f87-a024-635f20d08eff/instances/itest/etc/org.apache.karaf.features.repos.cfg>
Creating file: <https://builds.apache.org/job/karaf-2.x/org.apache.karaf.itests$itests/ws/target/exam/01bedbb8-c0b5-4f87-a024-635f20d08eff/instances/itest/etc/org.apache.karaf.jaas.cfg>
Creating file: <https://builds.apache.org/job/karaf-2.x/org.apache.karaf.itests$itests/ws/target/exam/01bedbb8-c0b5-4f87-a024-635f20d08eff/instances/itest/etc/org.apache.karaf.kar.cfg>
Creating file: <https://builds.apache.org/job/karaf-2.x/org.apache.karaf.itests$itests/ws/target/exam/01bedbb8-c0b5-4f87-a024-635f20d08eff/instances/itest/etc/org.apache.karaf.log.cfg>
Creating file: <https://builds.apache.org/job/karaf-2.x/org.apache.karaf.itests$itests/ws/target/exam/01bedbb8-c0b5-4f87-a024-635f20d08eff/instances/itest/etc/org.ops4j.pax.logging.cfg>
Creating file: <https://builds.apache.org/job/karaf-2.x/org.apache.karaf.itests$itests/ws/target/exam/01bedbb8-c0b5-4f87-a024-635f20d08eff/instances/itest/etc/org.ops4j.pax.url.mvn.cfg>
Creating file: <https://builds.apache.org/job/karaf-2.x/org.apache.karaf.itests$itests/ws/target/exam/01bedbb8-c0b5-4f87-a024-635f20d08eff/instances/itest/etc/shell.init.script>
Creating file: <https://builds.apache.org/job/karaf-2.x/org.apache.karaf.itests$itests/ws/target/exam/01bedbb8-c0b5-4f87-a024-635f20d08eff/instances/itest/etc/startup.properties>
Creating file: <https://builds.apache.org/job/karaf-2.x/org.apache.karaf.itests$itests/ws/target/exam/01bedbb8-c0b5-4f87-a024-635f20d08eff/instances/itest/etc/users.properties>
Creating file: <https://builds.apache.org/job/karaf-2.x/org.apache.karaf.itests$itests/ws/target/exam/01bedbb8-c0b5-4f87-a024-635f20d08eff/instances/itest/etc/system.properties>
Creating file: <https://builds.apache.org/job/karaf-2.x/org.apache.karaf.itests$itests/ws/target/exam/01bedbb8-c0b5-4f87-a024-635f20d08eff/instances/itest/etc/org.apache.karaf.shell.cfg>
Creating file: <https://builds.apache.org/job/karaf-2.x/org.apache.karaf.itests$itests/ws/target/exam/01bedbb8-c0b5-4f87-a024-635f20d08eff/instances/itest/etc/org.apache.karaf.management.cfg>
Creating file: <https://builds.apache.org/job/karaf-2.x/org.apache.karaf.itests$itests/ws/target/exam/01bedbb8-c0b5-4f87-a024-635f20d08eff/instances/itest/bin/karaf>
Creating file: <https://builds.apache.org/job/karaf-2.x/org.apache.karaf.itests$itests/ws/target/exam/01bedbb8-c0b5-4f87-a024-635f20d08eff/instances/itest/bin/start>
Creating file: <https://builds.apache.org/job/karaf-2.x/org.apache.karaf.itests$itests/ws/target/exam/01bedbb8-c0b5-4f87-a024-635f20d08eff/instances/itest/bin/stop>
[org.ops4j.pax.exam.karaf.container.internal.KarafTestContainer] : Shutting down the test container (Pax Runner)
[org.ops4j.pax.exam.spi.reactors.ReactorManager] : suite finished
Tests run: 5, Failures: 0, Errors: 0, Skipped: 0, Time elapsed: 300.502 sec - in org.apache.karaf.itests.AdminTest

Results :

Tests in error: 
  JMXSecurityTest.testJMXSecurityAsViewer:103 ? NullPointer
  JMXSecurityTest.testJMXSecurityAsAdmin:168 ? NullPointer
  JMXSecurityTest.testJMXSecurityAsManager:144 ? NullPointer
  ShellCommandSecurityTest.testShellCommandSecurityViaSsh:36->SshCommandTestBase.assertCommand:91->SshCommandTestBase.openSshChannel:130 ? 
  FeaturesSshCommandSecurityTest.testFeatureCommandSecurityViaSsh:30->SshCommandTestBase.assertCommand:91->SshCommandTestBase.openSshChannel:130 ? 
  OsgiSshCommandSecurityTest.testOsgiCommandSecurityViaSsh:40->SshCommandTestBase.assertCommand:91->SshCommandTestBase.openSshChannel:130 ? 
  JaasSshCommandSecurityTest.testJaasCommandSecurityViaSsh:32->SshCommandTestBase.assertCommand:91->SshCommandTestBase.openSshChannel:130 ? 
  ConfigSshCommandSecurityTest.testConfigCommandSecurityWithoutEditSessionViaSsh:100->testConfigEditsNoSession:122->SshCommandTestBase.assertCommand:91->SshCommandTestBase.openSshChannel:130 ? 
  ConfigSshCommandSecurityTest.testConfigCommandSecurityViaSsh:41->SshCommandTestBase.assertCommand:91->SshCommandTestBase.openSshChannel:130 ? 
  StandardFeaturesTest.testSpringDmFeature:51->installAndAssertFeature:35 ?  No ...
  StandardFeaturesTest.testSpringJmsFeature:71->installAndAssertFeature:35 ?  No...
  StandardFeaturesTest.testSpringStrutsFeature:76->installAndAssertFeature:35 ? 
  StandardFeaturesTest.testSpringTestFeature:81->installAndAssertFeature:35 ?  N...
  StandardFeaturesTest.testSpringWebPortletFeature:106->installAndAssertFeature:35 ? 
  StandardFeaturesTest.testSpringOrmFeature:86->installAndAssertFeature:35 ?  No...
  StandardFeaturesTest.testSpringFeature:41->installAndAssertFeature:35 ?  No fe...
  StandardFeaturesTest.testSpringJdbcFeature:66->installAndAssertFeature:35 ?  N...
  StandardFeaturesTest.testSpringTxFeature:96->installAndAssertFeature:35 ?  No ...
  StandardFeaturesTest.testSpringOxmFeature:91->installAndAssertFeature:35 ?  No...
  StandardFeaturesTest.testSpringInstrumentFeature:61->installAndAssertFeature:35 ? 
  StandardFeaturesTest.testSpringDmWebFeature:56->installAndAssertFeature:35 ?  ...
  StandardFeaturesTest.testSpringAspectsFeature:46->installAndAssertFeature:35 ? 
  StandardFeaturesTest.testSpringWebFeature:101->installAndAssertFeature:35 ?  N...
  ObrTest.listsViaMBean:58 ? InstanceNotFound org.apache.karaf:type=obr,name=roo...

Tests run: 82, Failures: 0, Errors: 24, Skipped: 0

[ERROR] There are test failures.

Please refer to <https://builds.apache.org/job/karaf-2.x/org.apache.karaf.itests$itests/ws/target/surefire-reports> for the individual test results.
[JENKINS] Recording test results
[INFO] 
[INFO] --- maven-jar-plugin:2.4:jar (default-jar) @ itests ---
[INFO] Building jar: <https://builds.apache.org/job/karaf-2.x/org.apache.karaf.itests$itests/ws/target/itests-2.4.0-SNAPSHOT.jar>
[INFO] 
[INFO] --- maven-site-plugin:3.3:attach-descriptor (attach-descriptor) @ itests ---
[INFO] 
[INFO] --- maven-jar-plugin:2.4:test-jar (jar-test-classes) @ itests ---
[INFO] Building jar: <https://builds.apache.org/job/karaf-2.x/org.apache.karaf.itests$itests/ws/target/itests-2.4.0-SNAPSHOT-tests.jar>
[INFO] 
[INFO] --- apache-rat-plugin:0.10:check (default) @ itests ---
[INFO] 51 implicit excludes (use -debug for more details).
[INFO] Exclude: **/target/**/*
[INFO] Exclude: **/.git/**/*
[INFO] Exclude: **/.idea/**/*
[INFO] Exclude: **/*.iml
[INFO] Exclude: **/*.ipr
[INFO] Exclude: **/*.iws
[INFO] Exclude: **/.*
[INFO] Exclude: **/eclipse-classes/**/*
[INFO] Exclude: **/dependency-reduced-pom.xml
[INFO] Exclude: **/.settings/**/*
[INFO] Exclude: **/bundle.info
[INFO] Exclude: **/*.txt
[INFO] Exclude: **/foo
[INFO] Exclude: **/pom.properties
[INFO] Exclude: **/*.rat
[INFO] Exclude: **/build-main.xml
[INFO] Exclude: **/*.css
[INFO] Exclude: **/*.ssp
[INFO] Exclude: **/*.conf
[INFO] 22 resources included (use -debug for more details)
[INFO] Rat check: Summary of files. Unapproved: 0 unknown: 0 generated: 0 approved: 21 licence.
[INFO] 
[INFO] --- maven-install-plugin:2.5.1:install (default-install) @ itests ---
[INFO] Installing <https://builds.apache.org/job/karaf-2.x/org.apache.karaf.itests$itests/ws/target/itests-2.4.0-SNAPSHOT.jar> to /home/jenkins/jenkins-slave/maven-repositories/1/org/apache/karaf/itests/itests/2.4.0-SNAPSHOT/itests-2.4.0-SNAPSHOT.jar
[INFO] Installing <https://builds.apache.org/job/karaf-2.x/org.apache.karaf.itests$itests/ws/pom.xml> to /home/jenkins/jenkins-slave/maven-repositories/1/org/apache/karaf/itests/itests/2.4.0-SNAPSHOT/itests-2.4.0-SNAPSHOT.pom
[INFO] Installing <https://builds.apache.org/job/karaf-2.x/org.apache.karaf.itests$itests/ws/target/itests-2.4.0-SNAPSHOT-tests.jar> to /home/jenkins/jenkins-slave/maven-repositories/1/org/apache/karaf/itests/itests/2.4.0-SNAPSHOT/itests-2.4.0-SNAPSHOT-tests.jar
[INFO] 
[INFO] --- maven-deploy-plugin:2.8.1:deploy (default-deploy) @ itests ---
Downloading: https://repository.apache.org/content/repositories/snapshots/org/apache/karaf/itests/itests/2.4.0-SNAPSHOT/maven-metadata.xml
[WARNING] Could not transfer metadata org.apache.karaf.itests:itests:2.4.0-SNAPSHOT/maven-metadata.xml from/to apache.snapshots.https (https://repository.apache.org/content/repositories/snapshots): Failed to transfer file: https://repository.apache.org/content/repositories/snapshots/org/apache/karaf/itests/itests/2.4.0-SNAPSHOT/maven-metadata.xml. Return code is: 503, ReasonPhrase:Service Temporarily Unavailable.

Jenkins build is still unstable: karaf-2.x » Apache Karaf :: Integration Tests #107

Posted by Apache Jenkins Server <je...@builds.apache.org>.
See <https://builds.apache.org/job/karaf-2.x/org.apache.karaf.itests$itests/107/>


Jenkins build is still unstable: karaf-2.x » Apache Karaf :: Integration Tests #106

Posted by Apache Jenkins Server <je...@builds.apache.org>.
See <https://builds.apache.org/job/karaf-2.x/org.apache.karaf.itests$itests/106/>


Jenkins build is unstable: karaf-2.x » Apache Karaf :: Integration Tests #105

Posted by Apache Jenkins Server <je...@builds.apache.org>.
See <https://builds.apache.org/job/karaf-2.x/org.apache.karaf.itests$itests/105/>


Build failed in Jenkins: karaf-2.x » Apache Karaf :: Integration Tests #104

Posted by Apache Jenkins Server <je...@builds.apache.org>.
See <https://builds.apache.org/job/karaf-2.x/org.apache.karaf.itests$itests/104/>

------------------------------------------
[...truncated 14847 lines...]
Hit '<ctrl-d>' or type 'osgi:shutdown' or 'logout' to shutdown Karaf.

karaf@root> SLF4J: Failed to load class "org.slf4j.impl.StaticLoggerBinder".
SLF4J: Defaulting to no-operation (NOP) logger implementation
SLF4J: See http://www.slf4j.org/codes.html#StaticLoggerBinder for further details.
[org.ops4j.pax.exam.rbc.client.RemoteBundleContextClient] : Remote bundle context found after 6677 millis
[org.ops4j.pax.exam.spi.reactors.EagerSingleStagedReactor] : installing probe org.ops4j.pax.exam.spi.intern.TestProbeBuilderImpl@9086a1
[org.ops4j.pax.tinybundles.core.intern.RawBuilder] : make()
[org.ops4j.store.intern.TemporaryStore[org.ops4j.pax.tinybundles.core.intern.RawBuilder] : Creating manifest from added headers.
] : Enter store()
[org.ops4j.pax.tinybundles.core.intern.RawBuilder] : PaxExam-dddf89e2-61b5-46e6-bec1-b29a257857b7 = org.apache.karaf.itests.StandardFeaturesTest;testSpringJmsFeature
[org.ops4j.pax.tinybundles.core.intern.RawBuilder] : PaxExam-f4643c5e-19f3-438e-a9b6-0ca3deee28e5 = org.apache.karaf.itests.EnterpriseFeaturesTest;testTransactionFeature
[org.ops4j.pax.tinybundles.core.intern.RawBuilder] : PaxExam-a848e323-eb51-4389-a595-404d37ea4cd8 = org.apache.karaf.itests.OsgiTest;versionViaMBean
[org.ops4j.pax.tinybundles.core.intern.RawBuilder] : PaxExam-64c4aab7-734a-44e3-8e71-2d8c8b69ef29 = org.apache.karaf.itests.ConfigTest;listViaMBean
[org.ops4j.pax.tinybundles.core.intern.RawBuilder] : PaxExam-92dbf3a6-14d6-428e-ba6b-0ba6e2c35b3e = org.apache.karaf.itests.FeaturesTest;listViaMBean
[org.ops4j.pax.tinybundles.core.intern.RawBuilder] : PaxExam-f4c9cc02-b785-452d-90d4-c73157b5f879 = org.apache.karaf.itests.OsgiTest;listViaMBean
[org.ops4j.pax.tinybundles.core.intern.RawBuilder] : PaxExam-1165c99d-c49e-4f16-8c3f-3fb13706e0f2 = org.apache.karaf.itests.OsgiTest;installCommand
[org.ops4j.pax.tinybundles.core.intern.RawBuilder] : PaxExam-a11a1e5c-aed1-4e82-b374-464baea08435 = org.apache.karaf.itests.ShellCommandSecurityTest;testShellCommandSecurityViaSsh
[org.ops4j.pax.tinybundles.core.intern.RawBuilder] : PaxExam-6df62384-a9ab-403c-8a12-f78e0a0d8eba = org.apache.karaf.itests.ServicesTest;listCommand
[org.ops4j.pax.tinybundles.core.intern.RawBuilder] : PaxExam-96c24ff6-b963-45fa-b591-dc393a765923 = org.apache.karaf.itests.OsgiTest;classesCommand
[org.ops4j.pax.tinybundles.core.intern.RawBuilder] : PaxExam-4edeae60-d1d6-4127-97f1-716f5cea17fe = org.apache.karaf.itests.EnterpriseFeaturesTest;testHibernateFeature
[org.ops4j.pax.tinybundles.core.intern.RawBuilder] : PaxExam-82225693-333f-473c-80c1-71381b8342fb = org.apache.karaf.itests.PackagesTest;importsCommand
[org.ops4j.pax.tinybundles.core.intern.RawBuilder] : PaxExam-38893af5-302f-4332-90cc-8788a0f1dcb8 = org.apache.karaf.itests.StandardFeaturesTest;testSpringStrutsFeature
[org.ops4j.pax.tinybundles.core.intern.RawBuilder] : Ignore-Package = 
[org.ops4j.pax.tinybundles.core.intern.RawBuilder] : PaxExam-f9a58670-c9aa-4a08-b527-1215586d9959 = org.apache.karaf.itests.EnterpriseFeaturesTest;testJndiFeature
[org.ops4j.pax.tinybundles.core.intern.RawBuilder] : PaxExam-1a0fd9a9-691c-481e-af24-46ee4dba7692 = org.apache.karaf.itests.ConfigSshCommandSecurityTest;testConfigCommandSecurityViaSsh
[org.ops4j.pax.tinybundles.core.intern.RawBuilder] : PaxExam-fb445954-2c2c-42c4-96fe-cd3572efe0e5 = org.apache.karaf.itests.OsgiTest;versionCommand
[org.ops4j.pax.tinybundles.core.intern.RawBuilder] : PaxExam-f7c8b3a2-4d96-4069-bbbb-1082c0d98a3d = org.apache.karaf.itests.EnterpriseFeaturesTest;testHibernateEnversFeature
[org.ops4j.pax.tinybundles.core.intern.RawBuilder] : PaxExam-3e32525f-db01-47b1-af13-025d7c5dadf2 = org.apache.karaf.itests.EnterpriseFeaturesTest;testApplicationWithoutIsolationFeature
[org.ops4j.pax.tinybundles.core.intern.RawBuilder] : PaxExam-cf1d44bf-6526-43f1-94b7-24b7287040ba = org.apache.karaf.itests.ServicesTest;listViaMBean
[org.ops4j.pax.tinybundles.core.intern.RawBuilder] : PaxExam-f6614251-85cd-4d80-b034-fbb99d69a6d9 = org.apache.karaf.itests.StandardFeaturesTest;testSpringJdbcFeature
[org.ops4j.pax.tinybundles.core.intern.RawBuilder] : PaxExam-fecc02e9-6c3a-4a13-a8f3-0a41595c78e7 = org.apache.karaf.itests.FeaturesSshCommandSecurityTest;testFeatureCommandSecurityViaSsh
[org.ops4j.pax.tinybundles.core.intern.RawBuilder] : PaxExam-2444b475-4b68-4565-9a78-8f2eb91fcdcd = org.apache.karaf.itests.FeaturesTest;listCommand
[org.ops4j.pax.tinybundles.core.intern.RawBuilder] : PaxExam-0553869b-93d9-4c5f-9978-1ac735bc9dad = org.apache.karaf.itests.JMXSecurityTest;testJMXSecurityCannotLogInAsGroupDirectly
[org.ops4j.pax.tinybundles.core.intern.RawBuilder] : PaxExam-3b6801ae-2891-429e-8854-68442e90e2d6 = org.apache.karaf.itests.EnterpriseFeaturesTest;testOpenJpaFeature
[org.ops4j.pax.tinybundles.core.intern.RawBuilder] : PaxExam-0b28aa25-f1e8-46f3-a223-3d4b33d9f387 = org.apache.karaf.itests.OsgiTest;shutdownCommand
[org.ops4j.pax.tinybundles.core.intern.RawBuilder] : PaxExam-5a9504ad-2018-4a3c-be6e-f7d8f65374c1 = org.apache.karaf.itests.StandardFeaturesTest;testHttpWhiteboardFeature
[org.ops4j.pax.tinybundles.core.intern.RawBuilder] : PaxExam-252d57c4-04f7-4322-a8f4-a42a46f20179 = org.apache.karaf.itests.StandardFeaturesTest;testSpringOxmFeature
[org.ops4j.pax.tinybundles.core.intern.RawBuilder] : PaxExam-3deae04a-e11b-4c19-913e-cad2d93482bb = org.apache.karaf.itests.FeaturesTest;repoAddRemoveCommand
[org.ops4j.pax.tinybundles.core.intern.RawBuilder] : PaxExam-6de4454a-f804-4be9-b783-7e511d75d00d = org.apache.karaf.itests.JaasSshCommandSecurityTest;testJaasCommandSecurityViaSsh
[org.ops4j.pax.tinybundles.core.intern.RawBuilder] : PaxExam-121d8ccf-fbc2-491f-bc24-8d9c37564106 = org.apache.karaf.itests.AdminTest;cloneViaMBean
[org.ops4j.pax.tinybundles.core.intern.RawBuilder] : PaxExam-8520dc3e-cd48-408f-9f79-5449d91a12cd = org.apache.karaf.itests.StandardFeaturesTest;testObrFeature
[org.ops4j.pax.tinybundles.core.intern.RawBuilder] : PaxExam-fdde3138-d564-47fa-9c81-936bc70f876e = org.apache.karaf.itests.JaasTest;realmListCommand
[org.ops4j.pax.tinybundles.core.intern.RawBuilder] : PaxExam-98509fdd-b06e-46c0-bb12-7bd16c072e0e = org.apache.karaf.itests.JMXSecurityTest;testJMXSecurityAsViewer
[org.ops4j.pax.tinybundles.core.intern.RawBuilder] : PaxExam-3b4b3cf9-b6fe-44f8-a0f9-a184e95f3b9a = org.apache.karaf.itests.OsgiTest;nameCommand
[org.ops4j.pax.tinybundles.core.intern.RawBuilder] : DynamicImport-Package = *,org.apache.felix.service.*;status=provisional
[org.ops4j.pax.tinybundles.core.intern.RawBuilder] : PaxExam-d240ae1f-ee99-4b1d-af96-75770e583f72 = org.apache.karaf.itests.StandardFeaturesTest;testSpringOrmFeature
[org.ops4j.pax.tinybundles.core.intern.RawBuilder] : PaxExam-9b3d02d7-e28e-4749-a050-a0b64a793429 = org.apache.karaf.itests.StandardFeaturesTest;testWebconsoleFeature
[org.ops4j.pax.tinybundles.core.intern.RawBuilder] : PaxExam-79bf299f-f64a-4b10-b9c0-17fa47ca4539 = org.apache.karaf.itests.OsgiTest;listCommand
[org.ops4j.pax.tinybundles.core.intern.RawBuilder] : PaxExam-b19012a5-27f8-4c54-8d37-d6fb790bd7f7 = org.apache.karaf.itests.StandardFeaturesTest;testSpringAspectsFeature
[org.ops4j.pax.tinybundles.core.intern.RawBuilder] : PaxExam-c809f55b-4d31-4c4a-b524-1992520af345 = org.apache.karaf.itests.AdminTest;cloneCommand
[org.ops4j.pax.tinybundles.core.intern.RawBuilder] : PaxExam-36e465a8-a15d-402a-afba-13166b2b3920 = org.apache.karaf.itests.StandardFeaturesTest;testSpringTxFeature
[org.ops4j.pax.tinybundles.core.intern.RawBuilder] : PaxExam-46149b7a-4e37-4d56-be84-203d3f57ee54 = org.apache.karaf.itests.PackagesTest;exportsViaMBean
[org.ops4j.pax.tinybundles.core.intern.RawBuilder] : PaxExam-b00a2c27-8a50-4d0c-af05-f067f7fe5a36 = org.apache.karaf.itests.WrapperTest;installCommand
[org.ops4j.pax.tinybundles.core.intern.RawBuilder] : PaxExam-f0915b27-3d24-4589-920b-a066118beeea = org.apache.karaf.itests.StandardFeaturesTest;testSpringDmFeature
[org.ops4j.pax.tinybundles.core.intern.RawBuilder] : PaxExam-42e1d3b0-14be-413a-b6cb-4ab8b3c34cc1 = org.apache.karaf.itests.StandardFeaturesTest;testSpringWebPortletFeature
[org.ops4j.pax.tinybundles.core.intern.RawBuilder] : PaxExam-1ac4c585-dce1-4829-a449-12a525a092b6 = org.apache.karaf.itests.StandardFeaturesTest;testSpringWebFeature
[org.ops4j.pax.tinybundles.core.intern.RawBuilder] : PaxExam-ae3c1e7e-8af8-4d1f-8865-cfa8f713c68b = org.apache.karaf.itests.EnterpriseFeaturesTest;testJpaFeature
[org.ops4j.pax.tinybundles.core.intern.RawBuilder] : PaxExam-57a9f546-408c-4b0f-8f05-4afdbd25f7d9 = org.apache.karaf.itests.OsgiTest;headersCommand
[org.ops4j.pax.tinybundles.core.intern.RawBuilder] : PaxExam-Executable = PaxExam-da35cd4a-7d35-4ac2-b6c0-aa44a5578598,PaxExam-f0915b27-3d24-4589-920b-a066118beeea,PaxExam-dddf89e2-61b5-46e6-bec1-b29a257857b7,PaxExam-38893af5-302f-4332-90cc-8788a0f1dcb8,PaxExam-f370d536-e681-4e6b-be9b-4926f022e367,PaxExam-aa07c0eb-9a5c-498d-9405-7b7ee5f1a1ca,PaxExam-42e1d3b0-14be-413a-b6cb-4ab8b3c34cc1,PaxExam-8a9f6f71-61e4-4fd2-9310-85bb10bb0567,PaxExam-9d182782-9eb7-4ef7-9ec6-d2954f5c8df7,PaxExam-a920d0e4-c3d0-40bc-ac9f-3812ad5e5b1d,PaxExam-d240ae1f-ee99-4b1d-af96-75770e583f72,PaxExam-9b3d02d7-e28e-4749-a050-a0b64a793429,PaxExam-8520dc3e-cd48-408f-9f79-5449d91a12cd,PaxExam-0634edcf-b11a-4a6b-8b32-5fca4d5dd7a3,PaxExam-1453d310-3656-47c4-9ba9-836a67f24ad3,PaxExam-f6614251-85cd-4d80-b034-fbb99d69a6d9,PaxExam-36e465a8-a15d-402a-afba-13166b2b3920,PaxExam-252d57c4-04f7-4322-a8f4-a42a46f20179,PaxExam-1d94f9f7-8ed5-46db-bbff-b2a7d552807c,PaxExam-8757575c-45be-4569-ac75-c3f18bc09b34,PaxExam-b514b9d3-fce8-4582-ac39-d8b721d7fec7,PaxExam-b19012a5-27f8-4c54-8d37-d6fb790bd7f7,PaxExam-1ac4c585-dce1-4829-a449-12a525a092b6,PaxExam-5a9504ad-2018-4a3c-be6e-f7d8f65374c1,PaxExam-497c71cc-906a-40c6-9e50-cb34f06a186e,PaxExam-3deae04a-e11b-4c19-913e-cad2d93482bb,PaxExam-4aa2bef7-925d-459f-8adf-9ecfbe98c5d2,PaxExam-2444b475-4b68-4565-9a78-8f2eb91fcdcd,PaxExam-0ee818b4-d2ec-4952-98f8-37d78bae26b4,PaxExam-92dbf3a6-14d6-428e-ba6b-0ba6e2c35b3e,PaxExam-f7c8b3a2-4d96-4069-bbbb-1082c0d98a3d,PaxExam-3b6801ae-2891-429e-8854-68442e90e2d6,PaxExam-aaa1f2b6-a35c-400b-ac81-13e69059a658,PaxExam-4edeae60-d1d6-4127-97f1-716f5cea17fe,PaxExam-f9a58670-c9aa-4a08-b527-1215586d9959,PaxExam-3e32525f-db01-47b1-af13-025d7c5dadf2,PaxExam-f4643c5e-19f3-438e-a9b6-0ca3deee28e5,PaxExam-ae3c1e7e-8af8-4d1f-8865-cfa8f713c68b,PaxExam-98509fdd-b06e-46c0-bb12-7bd16c072e0e,PaxExam-481a73da-ac4c-41c9-9d9d-f0701367d6cd,PaxExam-0ecdeae2-9b69-4f8c-80c4-f0e750563e25,PaxExam-0553869b-93d9-4c5f-9978-1ac735bc9dad,PaxExam-6df62384-a9ab-403c-8a12-f78e0a0d8eba,PaxExam-cf1d44bf-6526-43f1-94b7-24b7287040ba,PaxExam-1165c99d-c49e-4f16-8c3f-3fb13706e0f2,PaxExam-57a9f546-408c-4b0f-8f05-4afdbd25f7d9,PaxExam-d2476066-86b2-4183-8437-11bd82716c51,PaxExam-bdfded61-bfbb-4423-80b9-61e6cd8bd210,PaxExam-0b28aa25-f1e8-46f3-a223-3d4b33d9f387,PaxExam-a848e323-eb51-4389-a595-404d37ea4cd8,PaxExam-9d140c75-2b3e-449d-a0e8-6db73d5b8ece,PaxExam-fb445954-2c2c-42c4-96fe-cd3572efe0e5,PaxExam-3b4b3cf9-b6fe-44f8-a0f9-a184e95f3b9a,PaxExam-96c24ff6-b963-45fa-b591-dc393a765923,PaxExam-79bf299f-f64a-4b10-b9c0-17fa47ca4539,PaxExam-524505ae-065d-4277-8f62-25bcbf874500,PaxExam-f4c9cc02-b785-452d-90d4-c73157b5f879,PaxExam-f3570e23-b6aa-4ae2-b613-4b02f2f6a46c,PaxExam-46149b7a-4e37-4d56-be84-203d3f57ee54,PaxExam-ff42bc2e-5157-436e-9f83-c1cfbff7c50c,PaxExam-82225693-333f-473c-80c1-71381b8342fb,PaxExam-b00a2c27-8a50-4d0c-af05-f067f7fe5a36,PaxExam-c77e2bc8-32e6-4e6a-9a2d-f4310f30901e,PaxExam-fdde3138-d564-47fa-9c81-936bc70f876e,PaxExam-04b6dd2a-0fb9-4d83-adf7-88af787f8312,PaxExam-1a0fd9a9-691c-481e-af24-46ee4dba7692,PaxExam-6de4454a-f804-4be9-b783-7e511d75d00d,PaxExam-ca3c8698-2f80-44ef-8169-1eef590d3929,PaxExam-19080c02-724e-43c5-ae71-a9017a783287,PaxExam-c91138a9-d609-4f9f-9552-5846fc8de485,PaxExam-cd84273a-dd75-4cb6-866c-5ad96cb78d0d,PaxExam-5ea3f672-4bb9-457f-96bc-c2a5ad516b83,PaxExam-64c4aab7-734a-44e3-8e71-2d8c8b69ef29,PaxExam-fecc02e9-6c3a-4a13-a8f3-0a41595c78e7,PaxExam-e4b05f75-3e5d-47d0-9381-4b07425c014b,PaxExam-56e14245-4394-488a-bee7-9197cf92030f,PaxExam-9e28ca18-7f75-43b0-970c-4c56e4b61337,PaxExam-79fe455e-e0a4-4247-b2d4-fc3e9ede9aa5,PaxExam-121d8ccf-fbc2-491f-bc24-8d9c37564106,PaxExam-c809f55b-4d31-4c4a-b524-1992520af345,PaxExam-ebe7a83b-7740-4c78-b0ee-167576ba6132,PaxExam-a11a1e5c-aed1-4e82-b374-464baea08435,
[org.ops4j.pax.tinybundles.core.intern.RawBuilder] : PaxExam-ebe7a83b-7740-4c78-b0ee-167576ba6132 = org.apache.karaf.itests.AdminTest;createDestroyViaMBean
[org.ops4j.pax.tinybundles.core.intern.RawBuilder] : PaxExam-1d94f9f7-8ed5-46db-bbff-b2a7d552807c = org.apache.karaf.itests.StandardFeaturesTest;testJettyFeature
[org.ops4j.pax.tinybundles.core.intern.RawBuilder] : PaxExam-497c71cc-906a-40c6-9e50-cb34f06a186e = org.apache.karaf.itests.FeaturesTest;repoAddRemoveViaMBean
[org.ops4j.pax.tinybundles.core.intern.RawBuilder] : PaxExam-481a73da-ac4c-41c9-9d9d-f0701367d6cd = org.apache.karaf.itests.JMXSecurityTest;testJMXSecurityAsAdmin
[org.ops4j.pax.tinybundles.core.intern.RawBuilder] : PaxExam-cd84273a-dd75-4cb6-866c-5ad96cb78d0d = org.apache.karaf.itests.LogTest;setGetDebugAndClear
[org.ops4j.pax.tinybundles.core.intern.RawBuilder] : PaxExam-56e14245-4394-488a-bee7-9197cf92030f = org.apache.karaf.itests.ObrTest;listsViaMBean
[org.ops4j.pax.tinybundles.core.intern.RawBuilder] : PaxExam-ca3c8698-2f80-44ef-8169-1eef590d3929 = org.apache.karaf.itests.OsgiSshCommandSecurityTest;testOsgiCommandSecurityViaSsh
[org.ops4j.pax.tinybundles.core.intern.RawBuilder] : PaxExam-f3570e23-b6aa-4ae2-b613-4b02f2f6a46c = org.apache.karaf.itests.PackagesTest;importsViaMBean
[org.ops4j.pax.tinybundles.core.intern.RawBuilder] : Bundle-SymbolicName = PAXEXAM-PROBE-9fd6a671-c2e3-437b-a381-229a64816f60
[org.ops4j.pax.tinybundles.core.intern.RawBuilder] : PaxExam-0ee818b4-d2ec-4952-98f8-37d78bae26b4 = org.apache.karaf.itests.FeaturesTest;installUninstallViaMBean
[org.ops4j.pax.tinybundles.core.intern.RawBuilder] : PaxExam-a920d0e4-c3d0-40bc-ac9f-3812ad5e5b1d = org.apache.karaf.itests.StandardFeaturesTest;testHttpFeature
[org.ops4j.pax.tinybundles.core.intern.RawBuilder] : PaxExam-da35cd4a-7d35-4ac2-b6c0-aa44a5578598 = org.apache.karaf.itests.StandardFeaturesTest;testEventadminFeature
[org.ops4j.pax.tinybundles.core.intern.RawBuilder] : PaxExam-9e28ca18-7f75-43b0-970c-4c56e4b61337 = org.apache.karaf.itests.AdminTest;renameCommand
[org.ops4j.pax.tinybundles.core.intern.RawBuilder] : PaxExam-9d182782-9eb7-4ef7-9ec6-d2954f5c8df7 = org.apache.karaf.itests.StandardFeaturesTest;testBootFeatures
[org.ops4j.pax.tinybundles.core.intern.RawBuilder] : PaxExam-5ea3f672-4bb9-457f-96bc-c2a5ad516b83 = org.apache.karaf.itests.ConfigTest;listCommand
[org.ops4j.pax.tinybundles.core.intern.RawBuilder] : PaxExam-bdfded61-bfbb-4423-80b9-61e6cd8bd210 = org.apache.karaf.itests.OsgiTest;infoCommand
[org.ops4j.pax.tinybundles.core.intern.RawBuilder] : PaxExam-c77e2bc8-32e6-4e6a-9a2d-f4310f30901e = org.apache.karaf.itests.JaasTest;testLoginSingleReg
[org.ops4j.pax.tinybundles.core.intern.RawBuilder] : Bundle-ManifestVersion = 2
[org.ops4j.pax.tinybundles.core.intern.RawBuilder] : PaxExam-79fe455e-e0a4-4247-b2d4-fc3e9ede9aa5 = org.apache.karaf.itests.AdminTest;createDestroyCommand
[org.ops4j.pax.tinybundles.core.intern.RawBuilder] : PaxExam-c91138a9-d609-4f9f-9552-5846fc8de485 = org.apache.karaf.itests.LogTest;setDebugAndDisplay
[org.ops4j.pax.tinybundles.core.intern.RawBuilder] : PaxExam-d2476066-86b2-4183-8437-11bd82716c51 = org.apache.karaf.itests.OsgiTest;startLevelCommand
[org.ops4j.pax.tinybundles.core.intern.RawBuilder] : PaxExam-19080c02-724e-43c5-ae71-a9017a783287 = org.apache.karaf.itests.LogTest;setDebugViaMBean
[org.ops4j.pax.tinybundles.core.intern.RawBuilder] : PaxExam-aa07c0eb-9a5c-498d-9405-7b7ee5f1a1ca = org.apache.karaf.itests.StandardFeaturesTest;testJasyptEncryptionFeature
[org.ops4j.pax.tinybundles.core.intern.RawBuilder] : PaxExam-4aa2bef7-925d-459f-8adf-9ecfbe98c5d2 = org.apache.karaf.itests.FeaturesTest;installUninstallCommand
[org.ops4j.pax.tinybundles.core.intern.RawBuilder] : PaxExam-1453d310-3656-47c4-9ba9-836a67f24ad3 = org.apache.karaf.itests.StandardFeaturesTest;testSpringFeature
[org.ops4j.pax.tinybundles.core.intern.RawBuilder] : PaxExam-8757575c-45be-4569-ac75-c3f18bc09b34 = org.apache.karaf.itests.StandardFeaturesTest;testSpringInstrumentFeature
[org.ops4j.pax.tinybundles.core.intern.RawBuilder] : PaxExam-0ecdeae2-9b69-4f8c-80c4-f0e750563e25 = org.apache.karaf.itests.JMXSecurityTest;testJMXSecurityAsManager
[org.ops4j.pax.tinybundles.core.intern.RawBuilder] : PaxExam-524505ae-065d-4277-8f62-25bcbf874500 = org.apache.karaf.itests.OsgiTest;nameViaMBean
[org.ops4j.pax.tinybundles.core.intern.RawBuilder] : PaxExam-0634edcf-b11a-4a6b-8b32-5fca4d5dd7a3 = org.apache.karaf.itests.StandardFeaturesTest;testWarFeature
[org.ops4j.pax.tinybundles.core.intern.RawBuilder] : PaxExam-aaa1f2b6-a35c-400b-ac81-13e69059a658 = org.apache.karaf.itests.EnterpriseFeaturesTest;testHibernateValidatorFeature
[org.ops4j.pax.tinybundles.core.intern.RawBuilder] : PaxExam-9d140c75-2b3e-449d-a0e8-6db73d5b8ece = org.apache.karaf.itests.OsgiTest;findClassCommand
[org.ops4j.pax.tinybundles.core.intern.RawBuilder] : PaxExam-ff42bc2e-5157-436e-9f83-c1cfbff7c50c = org.apache.karaf.itests.PackagesTest;exportsCommand
[org.ops4j.pax.tinybundles.core.intern.RawBuilder] : PaxExam-e4b05f75-3e5d-47d0-9381-4b07425c014b = org.apache.karaf.itests.ObrTest;listCommands
[org.ops4j.pax.tinybundles.core.intern.RawBuilder] : PaxExam-f370d536-e681-4e6b-be9b-4926f022e367 = org.apache.karaf.itests.StandardFeaturesTest;testSpringTestFeature
[org.ops4j.pax.tinybundles.core.intern.RawBuilder] : PaxExam-b514b9d3-fce8-4582-ac39-d8b721d7fec7 = org.apache.karaf.itests.StandardFeaturesTest;testSpringDmWebFeature
[org.ops4j.pax.tinybundles.core.intern.RawBuilder] : PaxExam-8a9f6f71-61e4-4fd2-9310-85bb10bb0567 = org.apache.karaf.itests.StandardFeaturesTest;testWrapperFeature
[org.ops4j.pax.tinybundles.core.intern.RawBuilder] : PaxExam-04b6dd2a-0fb9-4d83-adf7-88af787f8312 = org.apache.karaf.itests.ConfigSshCommandSecurityTest;testConfigCommandSecurityWithoutEditSessionViaSsh
[org.ops4j.pax.tinybundles.core.intern.RawBuilder] : Copying resource org/apache/karaf/itests/FeaturesSshCommandSecurityTest.class
[org.ops4j.pax.tinybundles.core.intern.RawBuilder] : Copying resource org/apache/karaf/itests/ShellCommandSecurityTest.class
[org.ops4j.pax.tinybundles.core.intern.RawBuilder] : Copying resource org/apache/karaf/itests/SshCommandTestBase$Result.class
[org.ops4j.pax.tinybundles.core.intern.RawBuilder] : Copying resource org/apache/karaf/itests/KarafTestSupport$2.class
[org.ops4j.pax.tinybundles.core.intern.RawBuilder] : Copying resource org/apache/karaf/itests/PackagesTest.class
[org.ops4j.pax.tinybundles.core.intern.RawBuilder] : Copying resource org/apache/karaf/itests/KarafTestSupport$1.class
[org.ops4j.pax.tinybundles.core.intern.RawBuilder] : Copying resource META-INF/DEPENDENCIES
[org.ops4j.pax.tinybundles.core.intern.RawBuilder] : Copying resource org/apache/karaf/itests/ObrTest.class
[org.ops4j.pax.tinybundles.core.intern.RawBuilder] : Copying resource org/apache/karaf/itests/KarafTestSupport$2$1.class
[org.ops4j.pax.tinybundles.core.intern.RawBuilder] : Copying resource org/apache/karaf/itests/FeaturesTest.class
[org.ops4j.pax.tinybundles.core.intern.RawBuilder] : Copying resource META-INF/LICENSE
[org.ops4j.pax.tinybundles.core.intern.RawBuilder] : Copying resource org/apache/karaf/itests/SshCommandTestBase.class
[org.ops4j.pax.tinybundles.core.intern.RawBuilder] : Copying resource org/apache/karaf/itests/JaasTest$1.class
[org.ops4j.pax.tinybundles.core.intern.RawBuilder] : Copying resource org/apache/karaf/itests/WrapperTest.class
[org.ops4j.pax.tinybundles.core.intern.RawBuilder] : Copying resource org/apache/karaf/itests/JaasTest.class
[org.ops4j.pax.tinybundles.core.intern.RawBuilder] : Copying resource org/apache/karaf/itests/OsgiSshCommandSecurityTest.class
[org.ops4j.pax.tinybundles.core.intern.RawBuilder] : Copying resource org/apache/karaf/itests/JMXSecurityTest.class
[org.ops4j.pax.tinybundles.core.intern.RawBuilder] : Copying resource META-INF/NOTICE
[org.ops4j.pax.tinybundles.core.intern.RawBuilder] : Copying resource org/apache/karaf/itests/EnterpriseFeaturesTest.class
[org.ops4j.pax.tinybundles.core.intern.RawBuilder] : Copying resource org/apache/karaf/itests/StandardFeaturesTest.class
[org.ops4j.pax.tinybundles.core.intern.RawBuilder] : Copying resource org/apache/karaf/itests/KarafTestSupport.class
[org.ops4j.pax.tinybundles.core.intern.RawBuilder] : Copying resource org/apache/karaf/itests/LogTest.class
[org.ops4j.pax.tinybundles.core.intern.RawBuilder] : Copying resource org/apache/karaf/itests/ServicesTest.class
[org.ops4j.pax.tinybundles.core.intern.RawBuilder] : Copying resource org/apache/karaf/itests/JaasSshCommandSecurityTest.class
[org.ops4j.pax.tinybundles.core.intern.RawBuilder] : Copying resource org/apache/karaf/itests/ConfigTest.class
[org.ops4j.pax.tinybundles.core.intern.RawBuilder] : Copying resource org/apache/karaf/itests/AdminTest.class
[org.ops4j.pax.tinybundles.core.intern.RawBuilder] : Copying resource org/apache/karaf/itests/SshCommandTestBase$1.class
[org.ops4j.pax.tinybundles.core.intern.RawBuilder] : Copying resource org/apache/karaf/itests/ConfigSshCommandSecurityTest.class
[org.ops4j.pax.tinybundles.core.intern.RawBuilder] : Copying resource org/apache/karaf/itests/OsgiTest.class
[org.ops4j.store.intern.TemporaryStore] : Exit store(): d310ca898fd52dfeb96b99fc4ec9165086221cad
[org.ops4j.pax.exam.container.remote.RBCRemoteTarget] : Preparing and Installing bundle (from stream )..
[org.ops4j.pax.exam.rbc.client.RemoteBundleContextClient] : Packing probe into memory for true RMI. Hopefully things will fill in..
[org.ops4j.pax.exam.container.remote.RBCRemoteTarget] : Installed bundle (from stream) as ID: 76
[org.ops4j.pax.exam.junit.impl.ProbeRunner] : Invoke testShellCommandSecurityViaSsh @ [TestAddress:PaxExam-2e3eca5f-8f3d-4545-8f2f-fe30327c9c3f root:PaxExam-a11a1e5c-aed1-4e82-b374-464baea08435] Arguments: [Ljava.lang.Object;@d7454b
[org.ops4j.pax.exam.container.remote.RBCRemoteTarget] : call [[TestAddress:PaxExam-2e3eca5f-8f3d-4545-8f2f-fe30327c9c3f root:PaxExam-a11a1e5c-aed1-4e82-b374-464baea08435]]
        __ __                  ____      
       / //_/____ __________ _/ __/      
      / ,<  / __ `/ ___/ __ `/ /_        
     / /| |/ /_/ / /  / /_/ / __/        
    /_/ |_|\__,_/_/   \__,_/_/         

  Apache Karaf (2.3.6-SNAPSHOT)

Hit '<tab>' for a list of available commands
and '[cmd] --help' for help on a specific command.
Hit 'osgi:shutdown' to shutdown Karaf.
Hit '<ctrl-d>' or type 'logout' to disconnect shell from current session.

karaf@root> jaas:manage --realm=karaf;jaas:useradd view3544036016944836_0 view35 
44036016944836_0;jaas:roleadd view3544036016944836_0 viewer;jaas:update;jaas:man 
age --realm=karaf;jaas:users
User Name            Role                
karaf                admin               
man3543297630733389_0 manager             
man3543297630733389_0 viewer              
view3543297630754169_1 viewer              
man3543298765259102_2 manager             
man3543298765259102_2 viewer              
view3543298765263541_3 viewer              
viewer3543304953802871_jaas viewer              
man3543310003195035_0 manager             
man3543310003195035_0 viewer              
view3543310003213966_1 viewer              
viewer3543622976233053_features viewer              
view3544036016944836_0 viewer              
karaf@root> logout

[org.ops4j.pax.exam.karaf.container.internal.KarafTestContainer] : Shutting down the test container (Pax Runner)
[org.ops4j.pax.exam.spi.reactors.ReactorManager] : suite finished
Tests run: 1, Failures: 0, Errors: 1, Skipped: 0, Time elapsed: 8.7 sec <<< FAILURE! - in org.apache.karaf.itests.ShellCommandSecurityTest
testShellCommandSecurityViaSsh(org.apache.karaf.itests.ShellCommandSecurityTest)  Time elapsed: 0.363 sec  <<< ERROR!
java.lang.Exception: Could not open SSH channel
	at org.apache.karaf.itests.SshCommandTestBase.openSshChannel(SshCommandTestBase.java:130)
	at org.apache.karaf.itests.SshCommandTestBase.assertCommand(SshCommandTestBase.java:91)
	at org.apache.karaf.itests.ShellCommandSecurityTest.testShellCommandSecurityViaSsh(ShellCommandSecurityTest.java:36)


Results :

Tests in error: 
  StandardFeaturesTest.testSpringDmFeature:51->installAndAssertFeature:35 ?  No ...
  StandardFeaturesTest.testSpringJmsFeature:71->installAndAssertFeature:35 ?  No...
  StandardFeaturesTest.testSpringStrutsFeature:76->installAndAssertFeature:35 ? 
  StandardFeaturesTest.testSpringTestFeature:81->installAndAssertFeature:35 ?  N...
  StandardFeaturesTest.testSpringWebPortletFeature:106->installAndAssertFeature:35 ? 
  StandardFeaturesTest.testSpringOrmFeature:86->installAndAssertFeature:35 ?  No...
  StandardFeaturesTest.testSpringFeature:41->installAndAssertFeature:35 ?  No fe...
  StandardFeaturesTest.testSpringJdbcFeature:66->installAndAssertFeature:35 ?  N...
  StandardFeaturesTest.testSpringTxFeature:96->installAndAssertFeature:35 ?  No ...
  StandardFeaturesTest.testSpringOxmFeature:91->installAndAssertFeature:35 ?  No...
  StandardFeaturesTest.testSpringInstrumentFeature:61->installAndAssertFeature:35 ? 
  StandardFeaturesTest.testSpringDmWebFeature:56->installAndAssertFeature:35 ?  ...
  StandardFeaturesTest.testSpringAspectsFeature:46->installAndAssertFeature:35 ? 
  StandardFeaturesTest.testSpringWebFeature:101->installAndAssertFeature:35 ?  N...
  JMXSecurityTest.testJMXSecurityAsViewer:103 ? NullPointer
  JMXSecurityTest.testJMXSecurityAsAdmin:168 ? NullPointer
  JMXSecurityTest.testJMXSecurityAsManager:144 ? NullPointer
  ConfigSshCommandSecurityTest.testConfigCommandSecurityWithoutEditSessionViaSsh:100->testConfigEditsNoSession:122->SshCommandTestBase.assertCommand:91->SshCommandTestBase.openSshChannel:130 ? 
  ConfigSshCommandSecurityTest.testConfigCommandSecurityViaSsh:41->SshCommandTestBase.assertCommand:91->SshCommandTestBase.openSshChannel:130 ? 
  JaasSshCommandSecurityTest.testJaasCommandSecurityViaSsh:32->SshCommandTestBase.assertCommand:91->SshCommandTestBase.openSshChannel:130 ? 
  OsgiSshCommandSecurityTest.testOsgiCommandSecurityViaSsh:40->SshCommandTestBase.assertCommand:91->SshCommandTestBase.openSshChannel:130 ? 
  FeaturesSshCommandSecurityTest.testFeatureCommandSecurityViaSsh:30->SshCommandTestBase.assertCommand:91->SshCommandTestBase.openSshChannel:130 ? 
  ObrTest.listsViaMBean:58 ? InstanceNotFound org.apache.karaf:type=obr,name=roo...
  ShellCommandSecurityTest.testShellCommandSecurityViaSsh:36->SshCommandTestBase.assertCommand:91->SshCommandTestBase.openSshChannel:130 ? 

Tests run: 82, Failures: 0, Errors: 24, Skipped: 0

[ERROR] There are test failures.

Please refer to <https://builds.apache.org/job/karaf-2.x/org.apache.karaf.itests$itests/ws/target/surefire-reports> for the individual test results.
[JENKINS] Recording test results
[INFO] 
[INFO] --- maven-jar-plugin:2.4:jar (default-jar) @ itests ---
[INFO] Building jar: <https://builds.apache.org/job/karaf-2.x/org.apache.karaf.itests$itests/ws/target/itests-2.4.0-SNAPSHOT.jar>
[INFO] 
[INFO] --- maven-site-plugin:3.3:attach-descriptor (attach-descriptor) @ itests ---
[INFO] 
[INFO] --- maven-jar-plugin:2.4:test-jar (jar-test-classes) @ itests ---
[INFO] Building jar: <https://builds.apache.org/job/karaf-2.x/org.apache.karaf.itests$itests/ws/target/itests-2.4.0-SNAPSHOT-tests.jar>
[INFO] 
[INFO] --- apache-rat-plugin:0.10:check (default) @ itests ---
[INFO] 51 implicit excludes (use -debug for more details).
[INFO] Exclude: **/target/**/*
[INFO] Exclude: **/.git/**/*
[INFO] Exclude: **/.idea/**/*
[INFO] Exclude: **/*.iml
[INFO] Exclude: **/*.ipr
[INFO] Exclude: **/*.iws
[INFO] Exclude: **/.*
[INFO] Exclude: **/eclipse-classes/**/*
[INFO] Exclude: **/dependency-reduced-pom.xml
[INFO] Exclude: **/.settings/**/*
[INFO] Exclude: **/bundle.info
[INFO] Exclude: **/*.txt
[INFO] Exclude: **/foo
[INFO] Exclude: **/pom.properties
[INFO] Exclude: **/*.rat
[INFO] Exclude: **/build-main.xml
[INFO] Exclude: **/*.css
[INFO] Exclude: **/*.ssp
[INFO] Exclude: **/*.conf
[INFO] 22 resources included (use -debug for more details)
[INFO] Rat check: Summary of files. Unapproved: 0 unknown: 0 generated: 0 approved: 21 licence.
[INFO] 
[INFO] --- maven-install-plugin:2.5.1:install (default-install) @ itests ---
[INFO] Installing <https://builds.apache.org/job/karaf-2.x/org.apache.karaf.itests$itests/ws/target/itests-2.4.0-SNAPSHOT.jar> to /home/jenkins/jenkins-slave/maven-repositories/1/org/apache/karaf/itests/itests/2.4.0-SNAPSHOT/itests-2.4.0-SNAPSHOT.jar
[INFO] Installing <https://builds.apache.org/job/karaf-2.x/org.apache.karaf.itests$itests/ws/pom.xml> to /home/jenkins/jenkins-slave/maven-repositories/1/org/apache/karaf/itests/itests/2.4.0-SNAPSHOT/itests-2.4.0-SNAPSHOT.pom
[INFO] Installing <https://builds.apache.org/job/karaf-2.x/org.apache.karaf.itests$itests/ws/target/itests-2.4.0-SNAPSHOT-tests.jar> to /home/jenkins/jenkins-slave/maven-repositories/1/org/apache/karaf/itests/itests/2.4.0-SNAPSHOT/itests-2.4.0-SNAPSHOT-tests.jar
[INFO] 
[INFO] --- maven-deploy-plugin:2.8.1:deploy (default-deploy) @ itests ---
Downloading: https://repository.apache.org/content/repositories/snapshots/org/apache/karaf/itests/itests/2.4.0-SNAPSHOT/maven-metadata.xml
[WARNING] Could not transfer metadata org.apache.karaf.itests:itests:2.4.0-SNAPSHOT/maven-metadata.xml from/to apache.snapshots.https (https://repository.apache.org/content/repositories/snapshots): Failed to transfer file: https://repository.apache.org/content/repositories/snapshots/org/apache/karaf/itests/itests/2.4.0-SNAPSHOT/maven-metadata.xml. Return code is: 503, ReasonPhrase:Service Temporarily Unavailable.

Jenkins build is still unstable: karaf-2.x » Apache Karaf :: Integration Tests #103

Posted by Apache Jenkins Server <je...@builds.apache.org>.
See <https://builds.apache.org/job/karaf-2.x/org.apache.karaf.itests$itests/103/>