You are viewing a plain text version of this content. The canonical link for it is here.
Posted to commits@phoenix.apache.org by Apache Jenkins Server <je...@builds.apache.org> on 2015/09/21 14:58:45 UTC

Build failed in Jenkins: Phoenix | Master #899

See <https://builds.apache.org/job/Phoenix-master/899/changes>

Changes:

[dumindukarunathilaka] PHOENIX-2205 Group by a divided value (e.g., time/10) returns NULL

------------------------------------------
[...truncated 123148 lines...]
[INFO] Copying 5 resources
[INFO] skip non existing resourceDirectory <https://builds.apache.org/job/Phoenix-master/ws/phoenix-pherf/src/it/resources>
[INFO] Copying 3 resources
[INFO] 
[INFO] --- maven-compiler-plugin:3.0:testCompile (default-testCompile) @ phoenix-pherf ---
[INFO] Changes detected - recompiling the module!
[INFO] Compiling 13 source files to <https://builds.apache.org/job/Phoenix-master/ws/phoenix-pherf/target/test-classes>
[WARNING] <https://builds.apache.org/job/Phoenix-master/ws/phoenix-pherf/src/test/java/org/apache/phoenix/pherf/RowCalculatorTest.java>: <https://builds.apache.org/job/Phoenix-master/ws/phoenix-pherf/src/test/java/org/apache/phoenix/pherf/RowCalculatorTest.java> uses or overrides a deprecated API.
[WARNING] <https://builds.apache.org/job/Phoenix-master/ws/phoenix-pherf/src/test/java/org/apache/phoenix/pherf/RowCalculatorTest.java>: Recompile with -Xlint:deprecation for details.
[WARNING] <https://builds.apache.org/job/Phoenix-master/ws/phoenix-pherf/src/test/java/org/apache/phoenix/pherf/ResultTest.java>: Some input files use unchecked or unsafe operations.
[WARNING] <https://builds.apache.org/job/Phoenix-master/ws/phoenix-pherf/src/test/java/org/apache/phoenix/pherf/ResultTest.java>: Recompile with -Xlint:unchecked for details.
[INFO] 
[INFO] --- maven-surefire-plugin:2.18:test (default-test) @ phoenix-pherf ---
[INFO] Surefire report directory: <https://builds.apache.org/job/Phoenix-master/ws/phoenix-pherf/target/surefire-reports>

-------------------------------------------------------
 T E S T S
-------------------------------------------------------
Running org.apache.phoenix.pherf.ResourceTest
Tests run: 3, Failures: 0, Errors: 0, Skipped: 0, Time elapsed: 0.612 sec - in org.apache.phoenix.pherf.ResourceTest
Running org.apache.phoenix.pherf.ConfigurationParserTest
Tests run: 2, Failures: 0, Errors: 0, Skipped: 0, Time elapsed: 0.556 sec - in org.apache.phoenix.pherf.ConfigurationParserTest
Running org.apache.phoenix.pherf.RuleGeneratorTest
Tests run: 4, Failures: 0, Errors: 0, Skipped: 0, Time elapsed: 1.483 sec - in org.apache.phoenix.pherf.RuleGeneratorTest
Running org.apache.phoenix.pherf.ResultTest
Tests run: 4, Failures: 0, Errors: 0, Skipped: 0, Time elapsed: 4.854 sec - in org.apache.phoenix.pherf.ResultTest
Running org.apache.phoenix.pherf.RowCalculatorTest
Tests run: 4, Failures: 0, Errors: 0, Skipped: 0, Time elapsed: 0 sec - in org.apache.phoenix.pherf.RowCalculatorTest
Running org.apache.phoenix.pherf.PherfTest
Tests run: 2, Failures: 0, Errors: 0, Skipped: 0, Time elapsed: 0.444 sec - in org.apache.phoenix.pherf.PherfTest
Running org.apache.phoenix.pherf.TestHBaseProps
Tests run: 1, Failures: 0, Errors: 0, Skipped: 0, Time elapsed: 0.103 sec - in org.apache.phoenix.pherf.TestHBaseProps
Running org.apache.phoenix.pherf.ColumnTest
Tests run: 1, Failures: 0, Errors: 0, Skipped: 0, Time elapsed: 0 sec - in org.apache.phoenix.pherf.ColumnTest

Results :




Tests run: 21, Failures: 0, Errors: 0, Skipped: 0

[INFO] 
[INFO] --- maven-source-plugin:2.2.1:jar-no-fork (attach-sources) @ phoenix-pherf ---
[INFO] Building jar: <https://builds.apache.org/job/Phoenix-master/899/artifact/phoenix-pherf/target/phoenix-pherf-4.6.0-HBase-1.1-SNAPSHOT-sources.jar>
[INFO] 
[INFO] --- maven-jar-plugin:2.4:test-jar (default) @ phoenix-pherf ---
[INFO] Building jar: <https://builds.apache.org/job/Phoenix-master/899/artifact/phoenix-pherf/target/phoenix-pherf-4.6.0-HBase-1.1-SNAPSHOT-tests.jar>
[INFO] 
[INFO] --- maven-jar-plugin:2.4:jar (default-jar) @ phoenix-pherf ---
[INFO] Building jar: <https://builds.apache.org/job/Phoenix-master/899/artifact/phoenix-pherf/target/phoenix-pherf-4.6.0-HBase-1.1-SNAPSHOT.jar>
[INFO] 
[INFO] --- maven-site-plugin:3.2:attach-descriptor (attach-descriptor) @ phoenix-pherf ---
[INFO] 
[INFO] --- maven-assembly-plugin:2.5.2:single (make-dependency-jar) @ phoenix-pherf ---
[INFO] artifact junit:junit-dep: checking for updates from apache release
[INFO] artifact junit:junit-dep: checking for updates from conjars.org
[INFO] artifact junit:junit-dep: checking for updates from apache snapshot
[INFO] artifact junit:junit-dep: checking for updates from sonatype-nexus-snapshots
[INFO] artifact junit:junit-dep: checking for updates from central
[INFO] artifact junit:junit: checking for updates from apache release
[INFO] artifact junit:junit: checking for updates from conjars.org
[INFO] artifact junit:junit: checking for updates from apache snapshot
[INFO] artifact junit:junit: checking for updates from sonatype-nexus-snapshots
[INFO] artifact junit:junit: checking for updates from central
[INFO] artifact commons-io:commons-io: checking for updates from apache release
[INFO] artifact commons-io:commons-io: checking for updates from conjars.org
[INFO] artifact commons-io:commons-io: checking for updates from apache snapshot
[INFO] artifact commons-io:commons-io: checking for updates from sonatype-nexus-snapshots
[INFO] artifact commons-io:commons-io: checking for updates from central
[INFO] Building jar: <https://builds.apache.org/job/Phoenix-master/899/artifact/phoenix-pherf/target/phoenix-pherf-4.6.0-HBase-1.1-SNAPSHOT-jar-with-dependencies.jar>
[INFO] 
[INFO] --- maven-assembly-plugin:2.5.2:single (make-assembly) @ phoenix-pherf ---
[INFO] Reading assembly descriptor: src/main/assembly/minimal.xml
[INFO] Reading assembly descriptor: src/main/assembly/standalone.xml
[INFO] Reading assembly descriptor: src/main/assembly/cluster.xml
[INFO] artifact junit:junit-dep: checking for updates from apache release
[INFO] artifact junit:junit-dep: checking for updates from conjars.org
[INFO] artifact junit:junit-dep: checking for updates from apache snapshot
[INFO] artifact junit:junit-dep: checking for updates from sonatype-nexus-snapshots
[INFO] artifact junit:junit-dep: checking for updates from central
[INFO] artifact junit:junit: checking for updates from apache release
[INFO] artifact junit:junit: checking for updates from conjars.org
[INFO] artifact junit:junit: checking for updates from apache snapshot
[INFO] artifact junit:junit: checking for updates from sonatype-nexus-snapshots
[INFO] artifact junit:junit: checking for updates from central
[INFO] artifact commons-io:commons-io: checking for updates from apache release
[INFO] artifact commons-io:commons-io: checking for updates from conjars.org
[INFO] artifact commons-io:commons-io: checking for updates from apache snapshot
[INFO] artifact commons-io:commons-io: checking for updates from sonatype-nexus-snapshots
[INFO] artifact commons-io:commons-io: checking for updates from central
[INFO] Building jar: <https://builds.apache.org/job/Phoenix-master/899/artifact/phoenix-pherf/target/phoenix-pherf-4.6.0-HBase-1.1-SNAPSHOT-minimal.jar>
[INFO] Building zip: <https://builds.apache.org/job/Phoenix-master/ws/phoenix-pherf/target/phoenix-pherf-4.6.0-HBase-1.1-SNAPSHOT-standalone.zip>
[INFO] Building zip: <https://builds.apache.org/job/Phoenix-master/ws/phoenix-pherf/target/phoenix-pherf-4.6.0-HBase-1.1-SNAPSHOT-cluster.zip>
[INFO] 
[INFO] --- maven-failsafe-plugin:2.18:integration-test (ClientManagedTimeTests) @ phoenix-pherf ---
[INFO] Failsafe report directory: <https://builds.apache.org/job/Phoenix-master/ws/phoenix-pherf/target/failsafe-reports>
[INFO] parallel='none', perCoreThreadCount=true, threadCount=0, useUnlimitedThreads=false, threadCountSuites=0, threadCountClasses=0, threadCountMethods=0, parallelOptimized=true

-------------------------------------------------------
 T E S T S
-------------------------------------------------------

Results :




Tests run: 0, Failures: 0, Errors: 0, Skipped: 0

[INFO] 
[INFO] --- maven-failsafe-plugin:2.18:integration-test (HBaseManagedTimeTests) @ phoenix-pherf ---
[INFO] Failsafe report directory: <https://builds.apache.org/job/Phoenix-master/ws/phoenix-pherf/target/failsafe-reports>
[INFO] parallel='none', perCoreThreadCount=true, threadCount=0, useUnlimitedThreads=false, threadCountSuites=0, threadCountClasses=0, threadCountMethods=0, parallelOptimized=true

-------------------------------------------------------
 T E S T S
-------------------------------------------------------
Running org.apache.phoenix.pherf.SchemaReaderIT
Running org.apache.phoenix.pherf.PherfMainIT
Running org.apache.phoenix.pherf.DataIngestIT
Tests run: 1, Failures: 0, Errors: 0, Skipped: 0, Time elapsed: 37.548 sec - in org.apache.phoenix.pherf.SchemaReaderIT
Tests run: 1, Failures: 0, Errors: 0, Skipped: 0, Time elapsed: 58.89 sec - in org.apache.phoenix.pherf.PherfMainIT
Tests run: 4, Failures: 0, Errors: 1, Skipped: 0, Time elapsed: 59.106 sec <<< FAILURE! - in org.apache.phoenix.pherf.DataIngestIT
testColumnRulesApplied(org.apache.phoenix.pherf.DataIngestIT)  Time elapsed: 4.024 sec  <<< ERROR!
java.sql.SQLException: ERROR 1010 (42M01): Not allowed to mutate table. tableName=PHERF.TEST_MULTI_TENANT_TABLE
	at org.apache.phoenix.exception.SQLExceptionCode$Factory$1.newException(SQLExceptionCode.java:389)
	at org.apache.phoenix.exception.SQLExceptionInfo.buildException(SQLExceptionInfo.java:145)
	at org.apache.phoenix.schema.MetaDataClient.dropTable(MetaDataClient.java:2130)
	at org.apache.phoenix.schema.MetaDataClient.dropTable(MetaDataClient.java:2043)
	at org.apache.phoenix.jdbc.PhoenixStatement$ExecutableDropTableStatement$1.execute(PhoenixStatement.java:878)
	at org.apache.phoenix.jdbc.PhoenixStatement$2.call(PhoenixStatement.java:320)
	at org.apache.phoenix.jdbc.PhoenixStatement$2.call(PhoenixStatement.java:312)
	at org.apache.phoenix.call.CallRunner.run(CallRunner.java:53)
	at org.apache.phoenix.jdbc.PhoenixStatement.executeMutation(PhoenixStatement.java:310)
	at org.apache.phoenix.jdbc.PhoenixStatement.executeUpdate(PhoenixStatement.java:1422)
	at org.apache.phoenix.query.BaseTest.deletePriorTables(BaseTest.java:833)
	at org.apache.phoenix.query.BaseTest.deletePriorTables(BaseTest.java:799)
	at org.apache.phoenix.query.BaseTest.deletePriorTables(BaseTest.java:788)
	at org.apache.phoenix.end2end.BaseHBaseManagedTimeIT.cleanUpAfterTest(BaseHBaseManagedTimeIT.java:64)
	at sun.reflect.NativeMethodAccessorImpl.invoke0(Native Method)
	at sun.reflect.NativeMethodAccessorImpl.invoke(NativeMethodAccessorImpl.java:57)
	at sun.reflect.DelegatingMethodAccessorImpl.invoke(DelegatingMethodAccessorImpl.java:43)
	at java.lang.reflect.Method.invoke(Method.java:606)
	at org.junit.runners.model.FrameworkMethod$1.runReflectiveCall(FrameworkMethod.java:50)
	at org.junit.internal.runners.model.ReflectiveCallable.run(ReflectiveCallable.java:12)
	at org.junit.runners.model.FrameworkMethod.invokeExplosively(FrameworkMethod.java:47)
	at org.junit.internal.runners.statements.RunAfters.evaluate(RunAfters.java:33)
	at org.junit.runners.ParentRunner.runLeaf(ParentRunner.java:325)
	at org.junit.runners.BlockJUnit4ClassRunner.runChild(BlockJUnit4ClassRunner.java:78)
	at org.junit.runners.BlockJUnit4ClassRunner.runChild(BlockJUnit4ClassRunner.java:57)
	at org.junit.runners.ParentRunner$3.run(ParentRunner.java:290)
	at org.junit.runners.ParentRunner$1.schedule(ParentRunner.java:71)
	at org.junit.runners.ParentRunner.runChildren(ParentRunner.java:288)
	at org.junit.runners.ParentRunner.access$000(ParentRunner.java:58)
	at org.junit.runners.ParentRunner$2.evaluate(ParentRunner.java:268)
	at org.junit.internal.runners.statements.RunBefores.evaluate(RunBefores.java:26)
	at org.junit.internal.runners.statements.RunAfters.evaluate(RunAfters.java:27)
	at org.junit.runners.ParentRunner.run(ParentRunner.java:363)
	at org.junit.runners.Suite.runChild(Suite.java:128)
	at org.junit.runners.Suite.runChild(Suite.java:27)
	at org.junit.runners.ParentRunner$3.run(ParentRunner.java:290)
	at org.junit.runners.ParentRunner$1.schedule(ParentRunner.java:71)
	at org.junit.runners.ParentRunner.runChildren(ParentRunner.java:288)
	at org.junit.runners.ParentRunner.access$000(ParentRunner.java:58)
	at org.junit.runners.ParentRunner$2.evaluate(ParentRunner.java:268)
	at org.junit.runners.ParentRunner.run(ParentRunner.java:363)
	at org.junit.runner.JUnitCore.run(JUnitCore.java:137)
	at org.junit.runner.JUnitCore.run(JUnitCore.java:115)
	at org.apache.maven.surefire.junitcore.JUnitCoreWrapper.createRequestAndRun(JUnitCoreWrapper.java:107)
	at org.apache.maven.surefire.junitcore.JUnitCoreWrapper.executeLazy(JUnitCoreWrapper.java:88)
	at org.apache.maven.surefire.junitcore.JUnitCoreWrapper.execute(JUnitCoreWrapper.java:57)
	at org.apache.maven.surefire.junitcore.JUnitCoreProvider.invoke(JUnitCoreProvider.java:144)
	at org.apache.maven.surefire.booter.ForkedBooter.invokeProviderInSameClassLoader(ForkedBooter.java:203)
	at org.apache.maven.surefire.booter.ForkedBooter.runSuitesInProcess(ForkedBooter.java:155)
	at org.apache.maven.surefire.booter.ForkedBooter.main(ForkedBooter.java:103)


Results :


Tests in error: 
  DataIngestIT>BaseHBaseManagedTimeIT.cleanUpAfterTest:64->BaseTest.deletePriorTables:788->BaseTest.deletePriorTables:799->BaseTest.deletePriorTables:833 ยป SQL


Tests run: 6, Failures: 0, Errors: 1, Skipped: 0

[INFO] 
[INFO] --- maven-failsafe-plugin:2.18:integration-test (NeedTheirOwnClusterTests) @ phoenix-pherf ---
[INFO] Failsafe report directory: <https://builds.apache.org/job/Phoenix-master/ws/phoenix-pherf/target/failsafe-reports>
[INFO] parallel='none', perCoreThreadCount=true, threadCount=0, useUnlimitedThreads=false, threadCountSuites=0, threadCountClasses=0, threadCountMethods=0, parallelOptimized=true

-------------------------------------------------------
 T E S T S
-------------------------------------------------------

Results :




Tests run: 0, Failures: 0, Errors: 0, Skipped: 0

[INFO] 
[INFO] --- maven-failsafe-plugin:2.18:verify (ClientManagedTimeTests) @ phoenix-pherf ---
[INFO] Failsafe report directory: <https://builds.apache.org/job/Phoenix-master/ws/phoenix-pherf/target/failsafe-reports>
[INFO] ------------------------------------------------------------------------
[INFO] Reactor Summary:
[INFO] 
[INFO] Apache Phoenix .................................... SUCCESS [3.497s]
[INFO] Phoenix Core ...................................... SUCCESS [53:16.891s]
[INFO] Phoenix - Flume ................................... SUCCESS [1:12.205s]
[INFO] Phoenix - Pig ..................................... SUCCESS [2:36.225s]
[INFO] Phoenix Query Server Client ....................... SUCCESS [1.192s]
[INFO] Phoenix Query Server .............................. SUCCESS [1:58.422s]
[INFO] Phoenix - Pherf ................................... FAILURE [2:07.780s]
[INFO] Phoenix - Spark ................................... SKIPPED
[INFO] Phoenix Assembly .................................. SKIPPED
[INFO] Phoenix - Tracing Web Application ................. SKIPPED
[INFO] ------------------------------------------------------------------------
[INFO] BUILD FAILURE
[INFO] ------------------------------------------------------------------------
[INFO] Total time: 1:01:16.831s
[INFO] Finished at: Mon Sep 21 12:54:53 UTC 2015
[INFO] Final Memory: 68M/1141M
[INFO] ------------------------------------------------------------------------
[ERROR] Failed to execute goal org.apache.maven.plugins:maven-failsafe-plugin:2.18:verify (ClientManagedTimeTests) on project phoenix-pherf: There are test failures.
[ERROR] 
[ERROR] Please refer to <https://builds.apache.org/job/Phoenix-master/ws/phoenix-pherf/target/failsafe-reports> for the individual test results.
[ERROR] -> [Help 1]
[ERROR] 
[ERROR] To see the full stack trace of the errors, re-run Maven with the -e switch.
[ERROR] Re-run Maven using the -X switch to enable full debug logging.
[ERROR] 
[ERROR] For more information about the errors and possible solutions, please read the following articles:
[ERROR] [Help 1] http://cwiki.apache.org/confluence/display/MAVEN/MojoFailureException
[ERROR] 
[ERROR] After correcting the problems, you can resume the build with the command
[ERROR]   mvn <goals> -rf :phoenix-pherf
Build step 'Invoke top-level Maven targets' marked build as failure
Archiving artifacts
Sending artifact delta relative to Phoenix | Master #896
Archived 1306 artifacts
Archive block size is 32768
Received 21628 blocks and 576454625 bytes
Compression is 55.1%
Took 4 min 1 sec
Updating PHOENIX-2205
Recording test results

Jenkins build is back to normal : Phoenix | Master #900

Posted by Apache Jenkins Server <je...@builds.apache.org>.
See <https://builds.apache.org/job/Phoenix-master/900/changes>