You are viewing a plain text version of this content. The canonical link for it is here.
Posted to builds@solr.apache.org by Policeman Jenkins Server via builds <bu...@solr.apache.org> on 2026/06/22 18:27:08 UTC
[JENKINS] Solr-main-macOS (64bit/hotspot/jdk-22.0.2) - Build # 9450 - Still Unstable!
Build: https://jenkins.thetaphi.de/job/Solr-main-macOS/9450/
Java: 64bit/hotspot/jdk-22.0.2 -XX:+UseCompressedOops -XX:+UseSerialGC
6 tests failed.
FAILED: org.apache.solr.cloud.BasicDistributedZkTest.test
Error Message:
com.carrotsearch.randomizedtesting.UncaughtExceptionError: Captured an uncaught exception in thread: Thread[id=2126, name=updateExecutor-959-thread-7, state=RUNNABLE, group=TGRP-BasicDistributedZkTest]
Stack Trace:
com.carrotsearch.randomizedtesting.UncaughtExceptionError: Captured an uncaught exception in thread: Thread[id=2126, name=updateExecutor-959-thread-7, state=RUNNABLE, group=TGRP-BasicDistributedZkTest]
at __randomizedtesting.SeedInfo.seed([8D0B196182C3C1A2:55F26BB2C3FAC5A]:0)
Caused by: org.apache.solr.common.SolrException: java.lang.InterruptedException
at __randomizedtesting.SeedInfo.seed([8D0B196182C3C1A2]:0)
at app//org.apache.solr.update.DefaultSolrCoreState$2.run(DefaultSolrCoreState.java:355)
at app//org.apache.solr.util.stats.OtelInstrumentedExecutorService$InstrumentedRunnable.run(OtelInstrumentedExecutorService.java:256)
at app//org.apache.solr.common.util.ExecutorUtil$MDCAwareThreadPoolExecutor.lambda$execute$0(ExecutorUtil.java:408)
at java.base@22.0.2/java.util.concurrent.ThreadPoolExecutor.runWorker(ThreadPoolExecutor.java:1144)
at java.base@22.0.2/java.util.concurrent.ThreadPoolExecutor$Worker.run(ThreadPoolExecutor.java:642)
at java.base@22.0.2/java.lang.Thread.run(Thread.java:1570)
Caused by: java.lang.InterruptedException
at java.base/java.util.concurrent.FutureTask.awaitDone(FutureTask.java:471)
at java.base/java.util.concurrent.FutureTask.get(FutureTask.java:190)
at org.apache.solr.update.DefaultSolrCoreState$2.run(DefaultSolrCoreState.java:352)
... 5 more
FAILED: org.apache.solr.cloud.BasicDistributedZkTest.classMethod
Error Message:
java.lang.AssertionError: ObjectTracker found 2 object(s) that were not released!!! [HttpJettySolrClient, HttpJettySolrClient]
org.apache.solr.client.solrj.jetty.HttpJettySolrClient:org.apache.solr.common.util.ObjectReleaseTracker$ObjectTrackerException: org.apache.solr.client.solrj.jetty.HttpJettySolrClient@90623640
at org.apache.solr.common.util.ObjectReleaseTracker.track(ObjectReleaseTracker.java:57)
at org.apache.solr.client.solrj.jetty.HttpJettySolrClient.<init>(HttpJettySolrClient.java:178)
at org.apache.solr.client.solrj.jetty.HttpJettySolrClient$Builder.build(HttpJettySolrClient.java:1055)
at org.apache.solr.update.UpdateShardHandler.<init>(UpdateShardHandler.java:119)
at org.apache.solr.core.CoreContainer.loadInternal(CoreContainer.java:799)
at org.apache.solr.core.CoreContainer.load(CoreContainer.java:753)
at org.apache.solr.servlet.CoreContainerProvider.createCoreContainer(CoreContainerProvider.java:341)
at org.apache.solr.servlet.CoreContainerProvider.init(CoreContainerProvider.java:181)
at org.apache.solr.servlet.CoreContainerProvider.contextInitialized(CoreContainerProvider.java:84)
at org.apache.solr.embedded.JettySolrRunner$1.contextInitialized(JettySolrRunner.java:317)
at org.eclipse.jetty.ee10.servlet.ServletContextHandler.callContextInitialized(ServletContextHandler.java:1592)
at org.eclipse.jetty.ee10.servlet.ServletContextHandler.contextInitialized(ServletContextHandler.java:500)
at org.eclipse.jetty.ee10.servlet.ServletHandler.initialize(ServletHandler.java:678)
at org.eclipse.jetty.ee10.servlet.ServletContextHandler.startContext(ServletContextHandler.java:1326)
at org.eclipse.jetty.ee10.servlet.ServletContextHandler.lambda$doStart$0(ServletContextHandler.java:1052)
at org.eclipse.jetty.server.handler.ContextHandler$ScopedContext.call(ContextHandler.java:1494)
at org.eclipse.jetty.ee10.servlet.ServletContextHandler.doStart(ServletContextHandler.java:1049)
at org.eclipse.jetty.util.component.AbstractLifeCycle.start(AbstractLifeCycle.java:93)
at org.eclipse.jetty.util.component.ContainerLifeCycle.start(ContainerLifeCycle.java:169)
at org.eclipse.jetty.util.component.ContainerLifeCycle.doStart(ContainerLifeCycle.java:120)
at org.eclipse.jetty.server.Handler$Abstract.doStart(Handler.java:491)
at org.eclipse.jetty.util.component.AbstractLifeCycle.start(AbstractLifeCycle.java:93)
at org.eclipse.jetty.util.component.ContainerLifeCycle.start(ContainerLifeCycle.java:169)
at org.eclipse.jetty.server.Server.start(Server.java:643)
at org.eclipse.jetty.util.component.ContainerLifeCycle.doStart(ContainerLifeCycle.java:120)
at org.eclipse.jetty.server.Handler$Abstract.doStart(Handler.java:491)
at org.eclipse.jetty.server.Server.doStart(Server.java:584)
at org.eclipse.jetty.util.component.AbstractLifeCycle.start(AbstractLifeCycle.java:93)
at org.apache.solr.embedded.JettySolrRunner.retryOnPortBindFailure(JettySolrRunner.java:531)
at org.apache.solr.embedded.JettySolrRunner.start(JettySolrRunner.java:474)
at org.apache.solr.embedded.JettySolrRunner.start(JettySolrRunner.java:446)
at org.apache.solr.cloud.BasicDistributedZkTest.testStopAndStartCoresInOneInstance(BasicDistributedZkTest.java:1068)
at org.apache.solr.cloud.BasicDistributedZkTest.test(BasicDistributedZkTest.java:754)
at java.base/jdk.internal.reflect.DirectMethodHandleAccessor.invoke(DirectMethodHandleAccessor.java:103)
at java.base/java.lang.reflect.Method.invoke(Method.java:580)
at com.carrotsearch.randomizedtesting.RandomizedRunner.invoke(RandomizedRunner.java:1763)
at com.carrotsearch.randomizedtesting.RandomizedRunner$8.evaluate(RandomizedRunner.java:946)
at com.carrotsearch.randomizedtesting.RandomizedRunner$9.evaluate(RandomizedRunner.java:982)
at com.carrotsearch.randomizedtesting.RandomizedRunner$10.evaluate(RandomizedRunner.java:996)
at org.apache.solr.BaseDistributedSearchTestCase$ShardsRepeatRule$ShardsFixedStatement.callStatement(BaseDistributedSearchTestCase.java:1071)
at org.apache.solr.BaseDistributedSearchTestCase$ShardsRepeatRule$ShardsStatement.evaluate(BaseDistributedSearchTestCase.java:1042)
at com.carrotsearch.randomizedtesting.rules.SystemPropertiesRestoreRule$1.evaluate(SystemPropertiesRestoreRule.java:80)
at org.junit.rules.RunRules.evaluate(RunRules.java:20)
at org.apache.lucene.tests.util.TestRuleSetupTeardownChained$1.evaluate(TestRuleSetupTeardownChained.java:48)
at org.apache.lucene.tests.util.AbstractBeforeAfterRule$1.evaluate(AbstractBeforeAfterRule.java:43)
at org.apache.lucene.tests.util.TestRuleThreadAndTestName$1.evaluate(TestRuleThreadAndTestName.java:45)
at org.apache.lucene.tests.util.TestRuleIgnoreAfterMaxFailures$1.evaluate(TestRuleIgnoreAfterMaxFailures.java:60)
at org.apache.lucene.tests.util.TestRuleMarkFailure$1.evaluate(TestRuleMarkFailure.java:44)
at org.junit.rules.RunRules.evaluate(RunRules.java:20)
at com.carrotsearch.randomizedtesting.rules.StatementAdapter.evaluate(StatementAdapter.java:36)
at com.carrotsearch.randomizedtesting.ThreadLeakControl$StatementRunner.run(ThreadLeakControl.java:390)
at com.carrotsearch.randomizedtesting.ThreadLeakControl.forkTimeoutingTask(ThreadLeakControl.java:843)
at com.carrotsearch.randomizedtesting.ThreadLeakControl$3.evaluate(ThreadLeakControl.java:490)
at com.carrotsearch.randomizedtesting.RandomizedRunner.runSingleTest(RandomizedRunner.java:955)
at com.carrotsearch.randomizedtesting.RandomizedRunner$5.evaluate(RandomizedRunner.java:840)
at com.carrotsearch.randomizedtesting.RandomizedRunner$6.evaluate(RandomizedRunner.java:891)
at com.carrotsearch.randomizedtesting.RandomizedRunner$7.evaluate(RandomizedRunner.java:902)
at com.carrotsearch.randomizedtesting.rules.StatementAdapter.evaluate(StatementAdapter.java:36)
at com.carrotsearch.randomizedtesting.rules.StatementAdapter.evaluate(StatementAdapter.java:36)
at org.apache.lucene.tests.util.AbstractBeforeAfterRule$1.evaluate(AbstractBeforeAfterRule.java:43)
at com.carrotsearch.randomizedtesting.rules.SystemPropertiesRestoreRule$1.evaluate(SystemPropertiesRestoreRule.java:80)
at org.junit.rules.RunRules.evaluate(RunRules.java:20)
at org.apache.lucene.tests.util.AbstractBeforeAfterRule$1.evaluate(AbstractBeforeAfterRule.java:43)
at com.carrotsearch.randomizedtesting.rules.StatementAdapter.evaluate(StatementAdapter.java:36)
at org.apache.lucene.tests.util.TestRuleStoreClassName$1.evaluate(TestRuleStoreClassName.java:38)
at com.carrotsearch.randomizedtesting.rules.NoShadowingOrOverridesOnMethodsRule$1.evaluate(NoShadowingOrOverridesOnMethodsRule.java:40)
at com.carrotsearch.randomizedtesting.rules.NoShadowingOrOverridesOnMethodsRule$1.evaluate(NoShadowingOrOverridesOnMethodsRule.java:40)
at com.carrotsearch.randomizedtesting.rules.StatementAdapter.evaluate(StatementAdapter.java:36)
at com.carrotsearch.randomizedtesting.rules.StatementAdapter.evaluate(StatementAdapter.java:36)
at org.apache.lucene.tests.util.TestRuleAssertionsRequired$1.evaluate(TestRuleAssertionsRequired.java:53)
at org.apache.lucene.tests.util.AbstractBeforeAfterRule$1.evaluate(AbstractBeforeAfterRule.java:43)
at org.apache.lucene.tests.util.TestRuleMarkFailure$1.evaluate(TestRuleMarkFailure.java:44)
at org.apache.lucene.tests.util.TestRuleIgnoreAfterMaxFailures$1.evaluate(TestRuleIgnoreAfterMaxFailures.java:60)
at org.apache.lucene.tests.util.TestRuleIgnoreTestSuites$1.evaluate(TestRuleIgnoreTestSuites.java:47)
at org.junit.rules.RunRules.evaluate(RunRules.java:20)
at com.carrotsearch.randomizedtesting.rules.StatementAdapter.evaluate(StatementAdapter.java:36)
at com.carrotsearch.randomizedtesting.ThreadLeakControl$StatementRunner.run(ThreadLeakControl.java:390)
at com.carrotsearch.randomizedtesting.ThreadLeakControl.lambda$forkTimeoutingTask$0(ThreadLeakControl.java:850)
at java.base/java.lang.Thread.run(Thread.java:1570)
org.apache.solr.client.solrj.jetty.HttpJettySolrClient:org.apache.solr.common.util.ObjectReleaseTracker$ObjectTrackerException: org.apache.solr.client.solrj.jetty.HttpJettySolrClient@1006682787
at org.apache.solr.common.util.ObjectReleaseTracker.track(ObjectReleaseTracker.java:57)
at org.apache.solr.client.solrj.jetty.HttpJettySolrClient.<init>(HttpJettySolrClient.java:178)
at org.apache.solr.client.solrj.jetty.HttpJettySolrClient$Builder.build(HttpJettySolrClient.java:1055)
at org.apache.solr.update.UpdateShardHandler.<init>(UpdateShardHandler.java:121)
at org.apache.solr.core.CoreContainer.loadInternal(CoreContainer.java:799)
at org.apache.solr.core.CoreContainer.load(CoreContainer.java:753)
at org.apache.solr.servlet.CoreContainerProvider.createCoreContainer(CoreContainerProvider.java:341)
at org.apache.solr.servlet.CoreContainerProvider.init(CoreContainerProvider.java:181)
at org.apache.solr.servlet.CoreContainerProvider.contextInitialized(CoreContainerProvider.java:84)
at org.apache.solr.embedded.JettySolrRunner$1.contextInitialized(JettySolrRunner.java:317)
at org.eclipse.jetty.ee10.servlet.ServletContextHandler.callContextInitialized(ServletContextHandler.java:1592)
at org.eclipse.jetty.ee10.servlet.ServletContextHandler.contextInitialized(ServletContextHandler.java:500)
at org.eclipse.jetty.ee10.servlet.ServletHandler.initialize(ServletHandler.java:678)
at org.eclipse.jetty.ee10.servlet.ServletContextHandler.startContext(ServletContextHandler.java:1326)
at org.eclipse.jetty.ee10.servlet.ServletContextHandler.lambda$doStart$0(ServletContextHandler.java:1052)
at org.eclipse.jetty.server.handler.ContextHandler$ScopedContext.call(ContextHandler.java:1494)
at org.eclipse.jetty.ee10.servlet.ServletContextHandler.doStart(ServletContextHandler.java:1049)
at org.eclipse.jetty.util.component.AbstractLifeCycle.start(AbstractLifeCycle.java:93)
at org.eclipse.jetty.util.component.ContainerLifeCycle.start(ContainerLifeCycle.java:169)
at org.eclipse.jetty.util.component.ContainerLifeCycle.doStart(ContainerLifeCycle.java:120)
at org.eclipse.jetty.server.Handler$Abstract.doStart(Handler.java:491)
at org.eclipse.jetty.util.component.AbstractLifeCycle.start(AbstractLifeCycle.java:93)
at org.eclipse.jetty.util.component.ContainerLifeCycle.start(ContainerLifeCycle.java:169)
at org.eclipse.jetty.server.Server.start(Server.java:643)
at org.eclipse.jetty.util.component.ContainerLifeCycle.doStart(ContainerLifeCycle.java:120)
at org.eclipse.jetty.server.Handler$Abstract.doStart(Handler.java:491)
at org.eclipse.jetty.server.Server.doStart(Server.java:584)
at org.eclipse.jetty.util.component.AbstractLifeCycle.start(AbstractLifeCycle.java:93)
at org.apache.solr.embedded.JettySolrRunner.retryOnPortBindFailure(JettySolrRunner.java:531)
at org.apache.solr.embedded.JettySolrRunner.start(JettySolrRunner.java:474)
at org.apache.solr.embedded.JettySolrRunner.start(JettySolrRunner.java:446)
at org.apache.solr.cloud.BasicDistributedZkTest.testStopAndStartCoresInOneInstance(BasicDistributedZkTest.java:1068)
at org.apache.solr.cloud.BasicDistributedZkTest.test(BasicDistributedZkTest.java:754)
at java.base/jdk.internal.reflect.DirectMethodHandleAccessor.invoke(DirectMethodHandleAccessor.java:103)
at java.base/java.lang.reflect.Method.invoke(Method.java:580)
at com.carrotsearch.randomizedtesting.RandomizedRunner.invoke(RandomizedRunner.java:1763)
at com.carrotsearch.randomizedtesting.RandomizedRunner$8.evaluate(RandomizedRunner.java:946)
at com.carrotsearch.randomizedtesting.RandomizedRunner$9.evaluate(RandomizedRunner.java:982)
at com.carrotsearch.randomizedtesting.RandomizedRunner$10.evaluate(RandomizedRunner.java:996)
at org.apache.solr.BaseDistributedSearchTestCase$ShardsRepeatRule$ShardsFixedStatement.callStatement(BaseDistributedSearchTestCase.java:1071)
at org.apache.solr.BaseDistributedSearchTestCase$ShardsRepeatRule$ShardsStatement.evaluate(BaseDistributedSearchTestCase.java:1042)
at com.carrotsearch.randomizedtesting.rules.SystemPropertiesRestoreRule$1.evaluate(SystemPropertiesRestoreRule.java:80)
at org.junit.rules.RunRules.evaluate(RunRules.java:20)
at org.apache.lucene.tests.util.TestRuleSetupTeardownChained$1.evaluate(TestRuleSetupTeardownChained.java:48)
at org.apache.lucene.tests.util.AbstractBeforeAfterRule$1.evaluate(AbstractBeforeAfterRule.java:43)
at org.apache.lucene.tests.util.TestRuleThreadAndTestName$1.evaluate(TestRuleThreadAndTestName.java:45)
at org.apache.lucene.tests.util.TestRuleIgnoreAfterMaxFailures$1.evaluate(TestRuleIgnoreAfterMaxFailures.java:60)
at org.apache.lucene.tests.util.TestRuleMarkFailure$1.evaluate(TestRuleMarkFailure.java:44)
at org.junit.rules.RunRules.evaluate(RunRules.java:20)
at com.carrotsearch.randomizedtesting.rules.StatementAdapter.evaluate(StatementAdapter.java:36)
at com.carrotsearch.randomizedtesting.ThreadLeakControl$StatementRunner.run(ThreadLeakControl.java:390)
at com.carrotsearch.randomizedtesting.ThreadLeakControl.forkTimeoutingTask(ThreadLeakControl.java:843)
at com.carrotsearch.randomizedtesting.ThreadLeakControl$3.evaluate(ThreadLeakControl.java:490)
at com.carrotsearch.randomizedtesting.RandomizedRunner.runSingleTest(RandomizedRunner.java:955)
at com.carrotsearch.randomizedtesting.RandomizedRunner$5.evaluate(RandomizedRunner.java:840)
at com.carrotsearch.randomizedtesting.RandomizedRunner$6.evaluate(RandomizedRunner.java:891)
at com.carrotsearch.randomizedtesting.RandomizedRunner$7.evaluate(RandomizedRunner.java:902)
at com.carrotsearch.randomizedtesting.rules.StatementAdapter.evaluate(StatementAdapter.java:36)
at com.carrotsearch.randomizedtesting.rules.StatementAdapter.evaluate(StatementAdapter.java:36)
at org.apache.lucene.tests.util.AbstractBeforeAfterRule$1.evaluate(AbstractBeforeAfterRule.java:43)
at com.carrotsearch.randomizedtesting.rules.SystemPropertiesRestoreRule$1.evaluate(SystemPropertiesRestoreRule.java:80)
at org.junit.rules.RunRules.evaluate(RunRules.java:20)
at org.apache.lucene.tests.util.AbstractBeforeAfterRule$1.evaluate(AbstractBeforeAfterRule.java:43)
at com.carrotsearch.randomizedtesting.rules.StatementAdapter.evaluate(StatementAdapter.java:36)
at org.apache.lucene.tests.util.TestRuleStoreClassName$1.evaluate(TestRuleStoreClassName.java:38)
at com.carrotsearch.randomizedtesting.rules.NoShadowingOrOverridesOnMethodsRule$1.evaluate(NoShadowingOrOverridesOnMethodsRule.java:40)
at com.carrotsearch.randomizedtesting.rules.NoShadowingOrOverridesOnMethodsRule$1.evaluate(NoShadowingOrOverridesOnMethodsRule.java:40)
at com.carrotsearch.randomizedtesting.rules.StatementAdapter.evaluate(StatementAdapter.java:36)
at com.carrotsearch.randomizedtesting.rules.StatementAdapter.evaluate(StatementAdapter.java:36)
at org.apache.lucene.tests.util.TestRuleAssertionsRequired$1.evaluate(TestRuleAssertionsRequired.java:53)
at org.apache.lucene.tests.util.AbstractBeforeAfterRule$1.evaluate(AbstractBeforeAfterRule.java:43)
at org.apache.lucene.tests.util.TestRuleMarkFailure$1.evaluate(TestRuleMarkFailure.java:44)
at org.apache.lucene.tests.util.TestRuleIgnoreAfterMaxFailures$1.evaluate(TestRuleIgnoreAfterMaxFailures.java:60)
at org.apache.lucene.tests.util.TestRuleIgnoreTestSuites$1.evaluate(TestRuleIgnoreTestSuites.java:47)
at org.junit.rules.RunRules.evaluate(RunRules.java:20)
at com.carrotsearch.randomizedtesting.rules.StatementAdapter.evaluate(StatementAdapter.java:36)
at com.carrotsearch.randomizedtesting.ThreadLeakControl$StatementRunner.run(ThreadLeakControl.java:390)
at com.carrotsearch.randomizedtesting.ThreadLeakControl.lambda$forkTimeoutingTask$0(ThreadLeakControl.java:850)
at java.base/java.lang.Thread.run(Thread.java:1570)
expected null, but was:<ObjectTracker found 2 object(s) that were not released!!! [HttpJettySolrClient, HttpJettySolrClient]
org.apache.solr.client.solrj.jetty.HttpJettySolrClient:org.apache.solr.common.util.ObjectReleaseTracker$ObjectTrackerException: org.apache.solr.client.solrj.jetty.HttpJettySolrClient@90623640
at org.apache.solr.common.util.ObjectReleaseTracker.track(ObjectReleaseTracker.java:57)
at org.apache.solr.client.solrj.jetty.HttpJettySolrClient.<init>(HttpJettySolrClient.java:178)
at org.apache.solr.client.solrj.jetty.HttpJettySolrClient$Builder.build(HttpJettySolrClient.java:1055)
at org.apache.solr.update.UpdateShardHandler.<init>(UpdateShardHandler.java:119)
at org.apache.solr.core.CoreContainer.loadInternal(CoreContainer.java:799)
at org.apache.solr.core.CoreContainer.load(CoreContainer.java:753)
at org.apache.solr.servlet.CoreContainerProvider.createCoreContainer(CoreContainerProvider.java:341)
at org.apache.solr.servlet.CoreContainerProvider.init(CoreContainerProvider.java:181)
at org.apache.solr.servlet.CoreContainerProvider.contextInitialized(CoreContainerProvider.java:84)
at org.apache.solr.embedded.JettySolrRunner$1.contextInitialized(JettySolrRunner.java:317)
at org.eclipse.jetty.ee10.servlet.ServletContextHandler.callContextInitialized(ServletContextHandler.java:1592)
at org.eclipse.jetty.ee10.servlet.ServletContextHandler.contextInitialized(ServletContextHandler.java:500)
at org.eclipse.jetty.ee10.servlet.ServletHandler.initialize(ServletHandler.java:678)
at org.eclipse.jetty.ee10.servlet.ServletContextHandler.startContext(ServletContextHandler.java:1326)
at org.eclipse.jetty.ee10.servlet.ServletContextHandler.lambda$doStart$0(ServletContextHandler.java:1052)
at org.eclipse.jetty.server.handler.ContextHandler$ScopedContext.call(ContextHandler.java:1494)
at org.eclipse.jetty.ee10.servlet.ServletContextHandler.doStart(ServletContextHandler.java:1049)
at org.eclipse.jetty.util.component.AbstractLifeCycle.start(AbstractLifeCycle.java:93)
at org.eclipse.jetty.util.component.ContainerLifeCycle.start(ContainerLifeCycle.java:169)
at org.eclipse.jetty.util.component.ContainerLifeCycle.doStart(ContainerLifeCycle.java:120)
at org.eclipse.jetty.server.Handler$Abstract.doStart(Handler.java:491)
at org.eclipse.jetty.util.component.AbstractLifeCycle.start(AbstractLifeCycle.java:93)
at org.eclipse.jetty.util.component.ContainerLifeCycle.start(ContainerLifeCycle.java:169)
at org.eclipse.jetty.server.Server.start(Server.java:643)
at org.eclipse.jetty.util.component.ContainerLifeCycle.doStart(ContainerLifeCycle.java:120)
at org.eclipse.jetty.server.Handler$Abstract.doStart(Handler.java:491)
at org.eclipse.jetty.server.Server.doStart(Server.java:584)
at org.eclipse.jetty.util.component.AbstractLifeCycle.start(AbstractLifeCycle.java:93)
at org.apache.solr.embedded.JettySolrRunner.retryOnPortBindFailure(JettySolrRunner.java:531)
at org.apache.solr.embedded.JettySolrRunner.start(JettySolrRunner.java:474)
at org.apache.solr.embedded.JettySolrRunner.start(JettySolrRunner.java:446)
at org.apache.solr.cloud.BasicDistributedZkTest.testStopAndStartCoresInOneInstance(BasicDistributedZkTest.java:1068)
at org.apache.solr.cloud.BasicDistributedZkTest.test(BasicDistributedZkTest.java:754)
at java.base/jdk.internal.reflect.DirectMethodHandleAccessor.invoke(DirectMethodHandleAccessor.java:103)
at java.base/java.lang.reflect.Method.invoke(Method.java:580)
at com.carrotsearch.randomizedtesting.RandomizedRunner.invoke(RandomizedRunner.java:1763)
at com.carrotsearch.randomizedtesting.RandomizedRunner$8.evaluate(RandomizedRunner.java:946)
at com.carrotsearch.randomizedtesting.RandomizedRunner$9.evaluate(RandomizedRunner.java:982)
at com.carrotsearch.randomizedtesting.RandomizedRunner$10.evaluate(RandomizedRunner.java:996)
at org.apache.solr.BaseDistributedSearchTestCase$ShardsRepeatRule$ShardsFixedStatement.callStatement(BaseDistributedSearchTestCase.java:1071)
at org.apache.solr.BaseDistributedSearchTestCase$ShardsRepeatRule$ShardsStatement.evaluate(BaseDistributedSearchTestCase.java:1042)
at com.carrotsearch.randomizedtesting.rules.SystemPropertiesRestoreRule$1.evaluate(SystemPropertiesRestoreRule.java:80)
at org.junit.rules.RunRules.evaluate(RunRules.java:20)
at org.apache.lucene.tests.util.TestRuleSetupTeardownChained$1.evaluate(TestRuleSetupTeardownChained.java:48)
at org.apache.lucene.tests.util.AbstractBeforeAfterRule$1.evaluate(AbstractBeforeAfterRule.java:43)
at org.apache.lucene.tests.util.TestRuleThreadAndTestName$1.evaluate(TestRuleThreadAndTestName.java:45)
at org.apache.lucene.tests.util.TestRuleIgnoreAfterMaxFailures$1.evaluate(TestRuleIgnoreAfterMaxFailures.java:60)
at org.apache.lucene.tests.util.TestRuleMarkFailure$1.evaluate(TestRuleMarkFailure.java:44)
at org.junit.rules.RunRules.evaluate(RunRules.java:20)
at com.carrotsearch.randomizedtesting.rules.StatementAdapter.evaluate(StatementAdapter.java:36)
at com.carrotsearch.randomizedtesting.ThreadLeakControl$StatementRunner.run(ThreadLeakControl.java:390)
at com.carrotsearch.randomizedtesting.ThreadLeakControl.forkTimeoutingTask(ThreadLeakControl.java:843)
at com.carrotsearch.randomizedtesting.ThreadLeakControl$3.evaluate(ThreadLeakControl.java:490)
at com.carrotsearch.randomizedtesting.RandomizedRunner.runSingleTest(RandomizedRunner.java:955)
at com.carrotsearch.randomizedtesting.RandomizedRunner$5.evaluate(RandomizedRunner.java:840)
at com.carrotsearch.randomizedtesting.RandomizedRunner$6.evaluate(RandomizedRunner.java:891)
at com.carrotsearch.randomizedtesting.RandomizedRunner$7.evaluate(RandomizedRunner.java:902)
at com.carrotsearch.randomizedtesting.rules.StatementAdapter.evaluate(StatementAdapter.java:36)
at com.carrotsearch.randomizedtesting.rules.StatementAdapter.evaluate(StatementAdapter.java:36)
at org.apache.lucene.tests.util.AbstractBeforeAfterRule$1.evaluate(AbstractBeforeAfterRule.java:43)
at com.carrotsearch.randomizedtesting.rules.SystemPropertiesRestoreRule$1.evaluate(SystemPropertiesRestoreRule.java:80)
at org.junit.rules.RunRules.evaluate(RunRules.java:20)
at org.apache.lucene.tests.util.AbstractBeforeAfterRule$1.evaluate(AbstractBeforeAfterRule.java:43)
at com.carrotsearch.randomizedtesting.rules.StatementAdapter.evaluate(StatementAdapter.java:36)
at org.apache.lucene.tests.util.TestRuleStoreClassName$1.evaluate(TestRuleStoreClassName.java:38)
at com.carrotsearch.randomizedtesting.rules.NoShadowingOrOverridesOnMethodsRule$1.evaluate(NoShadowingOrOverridesOnMethodsRule.java:40)
at com.carrotsearch.randomizedtesting.rules.NoShadowingOrOverridesOnMethodsRule$1.evaluate(NoShadowingOrOverridesOnMethodsRule.java:40)
at com.carrotsearch.randomizedtesting.rules.StatementAdapter.evaluate(StatementAdapter.java:36)
at com.carrotsearch.randomizedtesting.rules.StatementAdapter.evaluate(StatementAdapter.java:36)
at org.apache.lucene.tests.util.TestRuleAssertionsRequired$1.evaluate(TestRuleAssertionsRequired.java:53)
at org.apache.lucene.tests.util.AbstractBeforeAfterRule$1.evaluate(AbstractBeforeAfterRule.java:43)
at org.apache.lucene.tests.util.TestRuleMarkFailure$1.evaluate(TestRuleMarkFailure.java:44)
at org.apache.lucene.tests.util.TestRuleIgnoreAfterMaxFailures$1.evaluate(TestRuleIgnoreAfterMaxFailures.java:60)
at org.apache.lucene.tests.util.TestRuleIgnoreTestSuites$1.evaluate(TestRuleIgnoreTestSuites.java:47)
at org.junit.rules.RunRules.evaluate(RunRules.java:20)
at com.carrotsearch.randomizedtesting.rules.StatementAdapter.evaluate(StatementAdapter.java:36)
at com.carrotsearch.randomizedtesting.ThreadLeakControl$StatementRunner.run(ThreadLeakControl.java:390)
at com.carrotsearch.randomizedtesting.ThreadLeakControl.lambda$forkTimeoutingTask$0(ThreadLeakControl.java:850)
at java.base/java.lang.Thread.run(Thread.java:1570)
org.apache.solr.client.solrj.jetty.HttpJettySolrClient:org.apache.solr.common.util.ObjectReleaseTracker$ObjectTrackerException: org.apache.solr.client.solrj.jetty.HttpJettySolrClient@1006682787
at org.apache.solr.common.util.ObjectReleaseTracker.track(ObjectReleaseTracker.java:57)
at org.apache.solr.client.solrj.jetty.HttpJettySolrClient.<init>(HttpJettySolrClient.java:178)
at org.apache.solr.client.solrj.jetty.HttpJettySolrClient$Builder.build(HttpJettySolrClient.java:1055)
at org.apache.solr.update.UpdateShardHandler.<init>(UpdateShardHandler.java:121)
at org.apache.solr.core.CoreContainer.loadInternal(CoreContainer.java:799)
at org.apache.solr.core.CoreContainer.load(CoreContainer.java:753)
at org.apache.solr.servlet.CoreContainerProvider.createCoreContainer(CoreContainerProvider.java:341)
at org.apache.solr.servlet.CoreContainerProvider.init(CoreContainerProvider.java:181)
at org.apache.solr.servlet.CoreContainerProvider.contextInitialized(CoreContainerProvider.java:84)
at org.apache.solr.embedded.JettySolrRunner$1.contextInitialized(JettySolrRunner.java:317)
at org.eclipse.jetty.ee10.servlet.ServletContextHandler.callContextInitialized(ServletContextHandler.java:1592)
at org.eclipse.jetty.ee10.servlet.ServletContextHandler.contextInitialized(ServletContextHandler.java:500)
at org.eclipse.jetty.ee10.servlet.ServletHandler.initialize(ServletHandler.java:678)
at org.eclipse.jetty.ee10.servlet.ServletContextHandler.startContext(ServletContextHandler.java:1326)
at org.eclipse.jetty.ee10.servlet.ServletContextHandler.lambda$doStart$0(ServletContextHandler.java:1052)
at org.eclipse.jetty.server.handler.ContextHandler$ScopedContext.call(ContextHandler.java:1494)
at org.eclipse.jetty.ee10.servlet.ServletContextHandler.doStart(ServletContextHandler.java:1049)
at org.eclipse.jetty.util.component.AbstractLifeCycle.start(AbstractLifeCycle.java:93)
at org.eclipse.jetty.util.component.ContainerLifeCycle.start(ContainerLifeCycle.java:169)
at org.eclipse.jetty.util.component.ContainerLifeCycle.doStart(ContainerLifeCycle.java:120)
at org.eclipse.jetty.server.Handler$Abstract.doStart(Handler.java:491)
at org.eclipse.jetty.util.component.AbstractLifeCycle.start(AbstractLifeCycle.java:93)
at org.eclipse.jetty.util.component.ContainerLifeCycle.start(ContainerLifeCycle.java:169)
at org.eclipse.jetty.server.Server.start(Server.java:643)
at org.eclipse.jetty.util.component.ContainerLifeCycle.doStart(ContainerLifeCycle.java:120)
at org.eclipse.jetty.server.Handler$Abstract.doStart(Handler.java:491)
at org.eclipse.jetty.server.Server.doStart(Server.java:584)
at org.eclipse.jetty.util.component.AbstractLifeCycle.start(AbstractLifeCycle.java:93)
at org.apache.solr.embedded.JettySolrRunner.retryOnPortBindFailure(JettySolrRunner.java:531)
at org.apache.solr.embedded.JettySolrRunner.start(JettySolrRunner.java:474)
at org.apache.solr.embedded.JettySolrRunner.start(JettySolrRunner.java:446)
at org.apache.solr.cloud.BasicDistributedZkTest.testStopAndStartCoresInOneInstance(BasicDistributedZkTest.java:1068)
at org.apache.solr.cloud.BasicDistributedZkTest.test(BasicDistributedZkTest.java:754)
at java.base/jdk.internal.reflect.DirectMethodHandleAccessor.invoke(DirectMethodHandleAccessor.java:103)
at java.base/java.lang.reflect.Method.invoke(Method.java:580)
at com.carrotsearch.randomizedtesting.RandomizedRunner.invoke(RandomizedRunner.java:1763)
at com.carrotsearch.randomizedtesting.RandomizedRunner$8.evaluate(RandomizedRunner.java:946)
at com.carrotsearch.randomizedtesting.RandomizedRunner$9.evaluate(RandomizedRunner.java:982)
at com.carrotsearch.randomizedtesting.RandomizedRunner$10.evaluate(RandomizedRunner.java:996)
at org.apache.solr.BaseDistributedSearchTestCase$ShardsRepeatRule$ShardsFixedStatement.callStatement(BaseDistributedSearchTestCase.java:1071)
at org.apache.solr.BaseDistributedSearchTestCase$ShardsRepeatRule$ShardsStatement.evaluate(BaseDistributedSearchTestCase.java:1042)
at com.carrotsearch.randomizedtesting.rules.SystemPropertiesRestoreRule$1.evaluate(SystemPropertiesRestoreRule.java:80)
at org.junit.rules.RunRules.evaluate(RunRules.java:20)
at org.apache.lucene.tests.util.TestRuleSetupTeardownChained$1.evaluate(TestRuleSetupTeardownChained.java:48)
at org.apache.lucene.tests.util.AbstractBeforeAfterRule$1.evaluate(AbstractBeforeAfterRule.java:43)
at org.apache.lucene.tests.util.TestRuleThreadAndTestName$1.evaluate(TestRuleThreadAndTestName.java:45)
at org.apache.lucene.tests.util.TestRuleIgnoreAfterMaxFailures$1.evaluate(TestRuleIgnoreAfterMaxFailures.java:60)
at org.apache.lucene.tests.util.TestRuleMarkFailure$1.evaluate(TestRuleMarkFailure.java:44)
at org.junit.rules.RunRules.evaluate(RunRules.java:20)
at com.carrotsearch.randomizedtesting.rules.StatementAdapter.evaluate(StatementAdapter.java:36)
at com.carrotsearch.randomizedtesting.ThreadLeakControl$StatementRunner.run(ThreadLeakControl.java:390)
at com.carrotsearch.randomizedtesting.ThreadLeakControl.forkTimeoutingTask(ThreadLeakControl.java:843)
at com.carrotsearch.randomizedtesting.ThreadLeakControl$3.evaluate(ThreadLeakControl.java:490)
at com.carrotsearch.randomizedtesting.RandomizedRunner.runSingleTest(RandomizedRunner.java:955)
at com.carrotsearch.randomizedtesting.RandomizedRunner$5.evaluate(RandomizedRunner.java:840)
at com.carrotsearch.randomizedtesting.RandomizedRunner$6.evaluate(RandomizedRunner.java:891)
at com.carrotsearch.randomizedtesting.RandomizedRunner$7.evaluate(RandomizedRunner.java:902)
at com.carrotsearch.randomizedtesting.rules.StatementAdapter.evaluate(StatementAdapter.java:36)
at com.carrotsearch.randomizedtesting.rules.StatementAdapter.evaluate(StatementAdapter.java:36)
at org.apache.lucene.tests.util.AbstractBeforeAfterRule$1.evaluate(AbstractBeforeAfterRule.java:43)
at com.carrotsearch.randomizedtesting.rules.SystemPropertiesRestoreRule$1.evaluate(SystemPropertiesRestoreRule.java:80)
at org.junit.rules.RunRules.evaluate(RunRules.java:20)
at org.apache.lucene.tests.util.AbstractBeforeAfterRule$1.evaluate(AbstractBeforeAfterRule.java:43)
at com.carrotsearch.randomizedtesting.rules.StatementAdapter.evaluate(StatementAdapter.java:36)
at org.apache.lucene.tests.util.TestRuleStoreClassName$1.evaluate(TestRuleStoreClassName.java:38)
at com.carrotsearch.randomizedtesting.rules.NoShadowingOrOverridesOnMethodsRule$1.evaluate(NoShadowingOrOverridesOnMethodsRule.java:40)
at com.carrotsearch.randomizedtesting.rules.NoShadowingOrOverridesOnMethodsRule$1.evaluate(NoShadowingOrOverridesOnMethodsRule.java:40)
at com.carrotsearch.randomizedtesting.rules.StatementAdapter.evaluate(StatementAdapter.java:36)
at com.carrotsearch.randomizedtesting.rules.StatementAdapter.evaluate(StatementAdapter.java:36)
at org.apache.lucene.tests.util.TestRuleAssertionsRequired$1.evaluate(TestRuleAssertionsRequired.java:53)
at org.apache.lucene.tests.util.AbstractBeforeAfterRule$1.evaluate(AbstractBeforeAfterRule.java:43)
at org.apache.lucene.tests.util.TestRuleMarkFailure$1.evaluate(TestRuleMarkFailure.java:44)
at org.apache.lucene.tests.util.TestRuleIgnoreAfterMaxFailures$1.evaluate(TestRuleIgnoreAfterMaxFailures.java:60)
at org.apache.lucene.tests.util.TestRuleIgnoreTestSuites$1.evaluate(TestRuleIgnoreTestSuites.java:47)
at org.junit.rules.RunRules.evaluate(RunRules.java:20)
at com.carrotsearch.randomizedtesting.rules.StatementAdapter.evaluate(StatementAdapter.java:36)
at com.carrotsearch.randomizedtesting.ThreadLeakControl$StatementRunner.run(ThreadLeakControl.java:390)
at com.carrotsearch.randomizedtesting.ThreadLeakControl.lambda$forkTimeoutingTask$0(ThreadLeakControl.java:850)
at java.base/java.lang.Thread.run(Thread.java:1570)
>
Stack Trace:
java.lang.AssertionError: ObjectTracker found 2 object(s) that were not released!!! [HttpJettySolrClient, HttpJettySolrClient]
org.apache.solr.client.solrj.jetty.HttpJettySolrClient:org.apache.solr.common.util.ObjectReleaseTracker$ObjectTrackerException: org.apache.solr.client.solrj.jetty.HttpJettySolrClient@90623640
at org.apache.solr.common.util.ObjectReleaseTracker.track(ObjectReleaseTracker.java:57)
at org.apache.solr.client.solrj.jetty.HttpJettySolrClient.<init>(HttpJettySolrClient.java:178)
at org.apache.solr.client.solrj.jetty.HttpJettySolrClient$Builder.build(HttpJettySolrClient.java:1055)
at org.apache.solr.update.UpdateShardHandler.<init>(UpdateShardHandler.java:119)
at org.apache.solr.core.CoreContainer.loadInternal(CoreContainer.java:799)
at org.apache.solr.core.CoreContainer.load(CoreContainer.java:753)
at org.apache.solr.servlet.CoreContainerProvider.createCoreContainer(CoreContainerProvider.java:341)
at org.apache.solr.servlet.CoreContainerProvider.init(CoreContainerProvider.java:181)
at org.apache.solr.servlet.CoreContainerProvider.contextInitialized(CoreContainerProvider.java:84)
at org.apache.solr.embedded.JettySolrRunner$1.contextInitialized(JettySolrRunner.java:317)
at org.eclipse.jetty.ee10.servlet.ServletContextHandler.callContextInitialized(ServletContextHandler.java:1592)
at org.eclipse.jetty.ee10.servlet.ServletContextHandler.contextInitialized(ServletContextHandler.java:500)
at org.eclipse.jetty.ee10.servlet.ServletHandler.initialize(ServletHandler.java:678)
at org.eclipse.jetty.ee10.servlet.ServletContextHandler.startContext(ServletContextHandler.java:1326)
at org.eclipse.jetty.ee10.servlet.ServletContextHandler.lambda$doStart$0(ServletContextHandler.java:1052)
at org.eclipse.jetty.server.handler.ContextHandler$ScopedContext.call(ContextHandler.java:1494)
at org.eclipse.jetty.ee10.servlet.ServletContextHandler.doStart(ServletContextHandler.java:1049)
at org.eclipse.jetty.util.component.AbstractLifeCycle.start(AbstractLifeCycle.java:93)
at org.eclipse.jetty.util.component.ContainerLifeCycle.start(ContainerLifeCycle.java:169)
at org.eclipse.jetty.util.component.ContainerLifeCycle.doStart(ContainerLifeCycle.java:120)
at org.eclipse.jetty.server.Handler$Abstract.doStart(Handler.java:491)
at org.eclipse.jetty.util.component.AbstractLifeCycle.start(AbstractLifeCycle.java:93)
at org.eclipse.jetty.util.component.ContainerLifeCycle.start(ContainerLifeCycle.java:169)
at org.eclipse.jetty.server.Server.start(Server.java:643)
at org.eclipse.jetty.util.component.ContainerLifeCycle.doStart(ContainerLifeCycle.java:120)
at org.eclipse.jetty.server.Handler$Abstract.doStart(Handler.java:491)
at org.eclipse.jetty.server.Server.doStart(Server.java:584)
at org.eclipse.jetty.util.component.AbstractLifeCycle.start(AbstractLifeCycle.java:93)
at org.apache.solr.embedded.JettySolrRunner.retryOnPortBindFailure(JettySolrRunner.java:531)
at org.apache.solr.embedded.JettySolrRunner.start(JettySolrRunner.java:474)
at org.apache.solr.embedded.JettySolrRunner.start(JettySolrRunner.java:446)
at org.apache.solr.cloud.BasicDistributedZkTest.testStopAndStartCoresInOneInstance(BasicDistributedZkTest.java:1068)
at org.apache.solr.cloud.BasicDistributedZkTest.test(BasicDistributedZkTest.java:754)
at java.base/jdk.internal.reflect.DirectMethodHandleAccessor.invoke(DirectMethodHandleAccessor.java:103)
at java.base/java.lang.reflect.Method.invoke(Method.java:580)
at com.carrotsearch.randomizedtesting.RandomizedRunner.invoke(RandomizedRunner.java:1763)
at com.carrotsearch.randomizedtesting.RandomizedRunner$8.evaluate(RandomizedRunner.java:946)
at com.carrotsearch.randomizedtesting.RandomizedRunner$9.evaluate(RandomizedRunner.java:982)
at com.carrotsearch.randomizedtesting.RandomizedRunner$10.evaluate(RandomizedRunner.java:996)
at org.apache.solr.BaseDistributedSearchTestCase$ShardsRepeatRule$ShardsFixedStatement.callStatement(BaseDistributedSearchTestCase.java:1071)
at org.apache.solr.BaseDistributedSearchTestCase$ShardsRepeatRule$ShardsStatement.evaluate(BaseDistributedSearchTestCase.java:1042)
at com.carrotsearch.randomizedtesting.rules.SystemPropertiesRestoreRule$1.evaluate(SystemPropertiesRestoreRule.java:80)
at org.junit.rules.RunRules.evaluate(RunRules.java:20)
at org.apache.lucene.tests.util.TestRuleSetupTeardownChained$1.evaluate(TestRuleSetupTeardownChained.java:48)
at org.apache.lucene.tests.util.AbstractBeforeAfterRule$1.evaluate(AbstractBeforeAfterRule.java:43)
at org.apache.lucene.tests.util.TestRuleThreadAndTestName$1.evaluate(TestRuleThreadAndTestName.java:45)
at org.apache.lucene.tests.util.TestRuleIgnoreAfterMaxFailures$1.evaluate(TestRuleIgnoreAfterMaxFailures.java:60)
at org.apache.lucene.tests.util.TestRuleMarkFailure$1.evaluate(TestRuleMarkFailure.java:44)
at org.junit.rules.RunRules.evaluate(RunRules.java:20)
at com.carrotsearch.randomizedtesting.rules.StatementAdapter.evaluate(StatementAdapter.java:36)
at com.carrotsearch.randomizedtesting.ThreadLeakControl$StatementRunner.run(ThreadLeakControl.java:390)
at com.carrotsearch.randomizedtesting.ThreadLeakControl.forkTimeoutingTask(ThreadLeakControl.java:843)
at com.carrotsearch.randomizedtesting.ThreadLeakControl$3.evaluate(ThreadLeakControl.java:490)
at com.carrotsearch.randomizedtesting.RandomizedRunner.runSingleTest(RandomizedRunner.java:955)
at com.carrotsearch.randomizedtesting.RandomizedRunner$5.evaluate(RandomizedRunner.java:840)
at com.carrotsearch.randomizedtesting.RandomizedRunner$6.evaluate(RandomizedRunner.java:891)
at com.carrotsearch.randomizedtesting.RandomizedRunner$7.evaluate(RandomizedRunner.java:902)
at com.carrotsearch.randomizedtesting.rules.StatementAdapter.evaluate(StatementAdapter.java:36)
at com.carrotsearch.randomizedtesting.rules.StatementAdapter.evaluate(StatementAdapter.java:36)
at org.apache.lucene.tests.util.AbstractBeforeAfterRule$1.evaluate(AbstractBeforeAfterRule.java:43)
at com.carrotsearch.randomizedtesting.rules.SystemPropertiesRestoreRule$1.evaluate(SystemPropertiesRestoreRule.java:80)
at org.junit.rules.RunRules.evaluate(RunRules.java:20)
at org.apache.lucene.tests.util.AbstractBeforeAfterRule$1.evaluate(AbstractBeforeAfterRule.java:43)
at com.carrotsearch.randomizedtesting.rules.StatementAdapter.evaluate(StatementAdapter.java:36)
at org.apache.lucene.tests.util.TestRuleStoreClassName$1.evaluate(TestRuleStoreClassName.java:38)
at com.carrotsearch.randomizedtesting.rules.NoShadowingOrOverridesOnMethodsRule$1.evaluate(NoShadowingOrOverridesOnMethodsRule.java:40)
at com.carrotsearch.randomizedtesting.rules.NoShadowingOrOverridesOnMethodsRule$1.evaluate(NoShadowingOrOverridesOnMethodsRule.java:40)
at com.carrotsearch.randomizedtesting.rules.StatementAdapter.evaluate(StatementAdapter.java:36)
at com.carrotsearch.randomizedtesting.rules.StatementAdapter.evaluate(StatementAdapter.java:36)
at org.apache.lucene.tests.util.TestRuleAssertionsRequired$1.evaluate(TestRuleAssertionsRequired.java:53)
at org.apache.lucene.tests.util.AbstractBeforeAfterRule$1.evaluate(AbstractBeforeAfterRule.java:43)
at org.apache.lucene.tests.util.TestRuleMarkFailure$1.evaluate(TestRuleMarkFailure.java:44)
at org.apache.lucene.tests.util.TestRuleIgnoreAfterMaxFailures$1.evaluate(TestRuleIgnoreAfterMaxFailures.java:60)
at org.apache.lucene.tests.util.TestRuleIgnoreTestSuites$1.evaluate(TestRuleIgnoreTestSuites.java:47)
at org.junit.rules.RunRules.evaluate(RunRules.java:20)
at com.carrotsearch.randomizedtesting.rules.StatementAdapter.evaluate(StatementAdapter.java:36)
at com.carrotsearch.randomizedtesting.ThreadLeakControl$StatementRunner.run(ThreadLeakControl.java:390)
at com.carrotsearch.randomizedtesting.ThreadLeakControl.lambda$forkTimeoutingTask$0(ThreadLeakControl.java:850)
at java.base/java.lang.Thread.run(Thread.java:1570)
org.apache.solr.client.solrj.jetty.HttpJettySolrClient:org.apache.solr.common.util.ObjectReleaseTracker$ObjectTrackerException: org.apache.solr.client.solrj.jetty.HttpJettySolrClient@1006682787
at org.apache.solr.common.util.ObjectReleaseTracker.track(ObjectReleaseTracker.java:57)
at org.apache.solr.client.solrj.jetty.HttpJettySolrClient.<init>(HttpJettySolrClient.java:178)
at org.apache.solr.client.solrj.jetty.HttpJettySolrClient$Builder.build(HttpJettySolrClient.java:1055)
at org.apache.solr.update.UpdateShardHandler.<init>(UpdateShardHandler.java:121)
at org.apache.solr.core.CoreContainer.loadInternal(CoreContainer.java:799)
at org.apache.solr.core.CoreContainer.load(CoreContainer.java:753)
at org.apache.solr.servlet.CoreContainerProvider.createCoreContainer(CoreContainerProvider.java:341)
at org.apache.solr.servlet.CoreContainerProvider.init(CoreContainerProvider.java:181)
at org.apache.solr.servlet.CoreContainerProvider.contextInitialized(CoreContainerProvider.java:84)
at org.apache.solr.embedded.JettySolrRunner$1.contextInitialized(JettySolrRunner.java:317)
at org.eclipse.jetty.ee10.servlet.ServletContextHandler.callContextInitialized(ServletContextHandler.java:1592)
at org.eclipse.jetty.ee10.servlet.ServletContextHandler.contextInitialized(ServletContextHandler.java:500)
at org.eclipse.jetty.ee10.servlet.ServletHandler.initialize(ServletHandler.java:678)
at org.eclipse.jetty.ee10.servlet.ServletContextHandler.startContext(ServletContextHandler.java:1326)
at org.eclipse.jetty.ee10.servlet.ServletContextHandler.lambda$doStart$0(ServletContextHandler.java:1052)
at org.eclipse.jetty.server.handler.ContextHandler$ScopedContext.call(ContextHandler.java:1494)
at org.eclipse.jetty.ee10.servlet.ServletContextHandler.doStart(ServletContextHandler.java:1049)
at org.eclipse.jetty.util.component.AbstractLifeCycle.start(AbstractLifeCycle.java:93)
at org.eclipse.jetty.util.component.ContainerLifeCycle.start(ContainerLifeCycle.java:169)
at org.eclipse.jetty.util.component.ContainerLifeCycle.doStart(ContainerLifeCycle.java:120)
at org.eclipse.jetty.server.Handler$Abstract.doStart(Handler.java:491)
at org.eclipse.jetty.util.component.AbstractLifeCycle.start(AbstractLifeCycle.java:93)
at org.eclipse.jetty.util.component.ContainerLifeCycle.start(ContainerLifeCycle.java:169)
at org.eclipse.jetty.server.Server.start(Server.java:643)
at org.eclipse.jetty.util.component.ContainerLifeCycle.doStart(ContainerLifeCycle.java:120)
at org.eclipse.jetty.server.Handler$Abstract.doStart(Handler.java:491)
at org.eclipse.jetty.server.Server.doStart(Server.java:584)
at org.eclipse.jetty.util.component.AbstractLifeCycle.start(AbstractLifeCycle.java:93)
at org.apache.solr.embedded.JettySolrRunner.retryOnPortBindFailure(JettySolrRunner.java:531)
at org.apache.solr.embedded.JettySolrRunner.start(JettySolrRunner.java:474)
at org.apache.solr.embedded.JettySolrRunner.start(JettySolrRunner.java:446)
at org.apache.solr.cloud.BasicDistributedZkTest.testStopAndStartCoresInOneInstance(BasicDistributedZkTest.java:1068)
at org.apache.solr.cloud.BasicDistributedZkTest.test(BasicDistributedZkTest.java:754)
at java.base/jdk.internal.reflect.DirectMethodHandleAccessor.invoke(DirectMethodHandleAccessor.java:103)
at java.base/java.lang.reflect.Method.invoke(Method.java:580)
at com.carrotsearch.randomizedtesting.RandomizedRunner.invoke(RandomizedRunner.java:1763)
at com.carrotsearch.randomizedtesting.RandomizedRunner$8.evaluate(RandomizedRunner.java:946)
at com.carrotsearch.randomizedtesting.RandomizedRunner$9.evaluate(RandomizedRunner.java:982)
at com.carrotsearch.randomizedtesting.RandomizedRunner$10.evaluate(RandomizedRunner.java:996)
at org.apache.solr.BaseDistributedSearchTestCase$ShardsRepeatRule$ShardsFixedStatement.callStatement(BaseDistributedSearchTestCase.java:1071)
at org.apache.solr.BaseDistributedSearchTestCase$ShardsRepeatRule$ShardsStatement.evaluate(BaseDistributedSearchTestCase.java:1042)
at com.carrotsearch.randomizedtesting.rules.SystemPropertiesRestoreRule$1.evaluate(SystemPropertiesRestoreRule.java:80)
at org.junit.rules.RunRules.evaluate(RunRules.java:20)
at org.apache.lucene.tests.util.TestRuleSetupTeardownChained$1.evaluate(TestRuleSetupTeardownChained.java:48)
at org.apache.lucene.tests.util.AbstractBeforeAfterRule$1.evaluate(AbstractBeforeAfterRule.java:43)
at org.apache.lucene.tests.util.TestRuleThreadAndTestName$1.evaluate(TestRuleThreadAndTestName.java:45)
at org.apache.lucene.tests.util.TestRuleIgnoreAfterMaxFailures$1.evaluate(TestRuleIgnoreAfterMaxFailures.java:60)
at org.apache.lucene.tests.util.TestRuleMarkFailure$1.evaluate(TestRuleMarkFailure.java:44)
at org.junit.rules.RunRules.evaluate(RunRules.java:20)
at com.carrotsearch.randomizedtesting.rules.StatementAdapter.evaluate(StatementAdapter.java:36)
at com.carrotsearch.randomizedtesting.ThreadLeakControl$StatementRunner.run(ThreadLeakControl.java:390)
at com.carrotsearch.randomizedtesting.ThreadLeakControl.forkTimeoutingTask(ThreadLeakControl.java:843)
at com.carrotsearch.randomizedtesting.ThreadLeakControl$3.evaluate(ThreadLeakControl.java:490)
at com.carrotsearch.randomizedtesting.RandomizedRunner.runSingleTest(RandomizedRunner.java:955)
at com.carrotsearch.randomizedtesting.RandomizedRunner$5.evaluate(RandomizedRunner.java:840)
at com.carrotsearch.randomizedtesting.RandomizedRunner$6.evaluate(RandomizedRunner.java:891)
at com.carrotsearch.randomizedtesting.RandomizedRunner$7.evaluate(RandomizedRunner.java:902)
at com.carrotsearch.randomizedtesting.rules.StatementAdapter.evaluate(StatementAdapter.java:36)
at com.carrotsearch.randomizedtesting.rules.StatementAdapter.evaluate(StatementAdapter.java:36)
at org.apache.lucene.tests.util.AbstractBeforeAfterRule$1.evaluate(AbstractBeforeAfterRule.java:43)
at com.carrotsearch.randomizedtesting.rules.SystemPropertiesRestoreRule$1.evaluate(SystemPropertiesRestoreRule.java:80)
at org.junit.rules.RunRules.evaluate(RunRules.java:20)
at org.apache.lucene.tests.util.AbstractBeforeAfterRule$1.evaluate(AbstractBeforeAfterRule.java:43)
at com.carrotsearch.randomizedtesting.rules.StatementAdapter.evaluate(StatementAdapter.java:36)
at org.apache.lucene.tests.util.TestRuleStoreClassName$1.evaluate(TestRuleStoreClassName.java:38)
at com.carrotsearch.randomizedtesting.rules.NoShadowingOrOverridesOnMethodsRule$1.evaluate(NoShadowingOrOverridesOnMethodsRule.java:40)
at com.carrotsearch.randomizedtesting.rules.NoShadowingOrOverridesOnMethodsRule$1.evaluate(NoShadowingOrOverridesOnMethodsRule.java:40)
at com.carrotsearch.randomizedtesting.rules.StatementAdapter.evaluate(StatementAdapter.java:36)
at com.carrotsearch.randomizedtesting.rules.StatementAdapter.evaluate(StatementAdapter.java:36)
at org.apache.lucene.tests.util.TestRuleAssertionsRequired$1.evaluate(TestRuleAssertionsRequired.java:53)
at org.apache.lucene.tests.util.AbstractBeforeAfterRule$1.evaluate(AbstractBeforeAfterRule.java:43)
at org.apache.lucene.tests.util.TestRuleMarkFailure$1.evaluate(TestRuleMarkFailure.java:44)
at org.apache.lucene.tests.util.TestRuleIgnoreAfterMaxFailures$1.evaluate(TestRuleIgnoreAfterMaxFailures.java:60)
at org.apache.lucene.tests.util.TestRuleIgnoreTestSuites$1.evaluate(TestRuleIgnoreTestSuites.java:47)
at org.junit.rules.RunRules.evaluate(RunRules.java:20)
at com.carrotsearch.randomizedtesting.rules.StatementAdapter.evaluate(StatementAdapter.java:36)
at com.carrotsearch.randomizedtesting.ThreadLeakControl$StatementRunner.run(ThreadLeakControl.java:390)
at com.carrotsearch.randomizedtesting.ThreadLeakControl.lambda$forkTimeoutingTask$0(ThreadLeakControl.java:850)
at java.base/java.lang.Thread.run(Thread.java:1570)
expected null, but was:<ObjectTracker found 2 object(s) that were not released!!! [HttpJettySolrClient, HttpJettySolrClient]
org.apache.solr.client.solrj.jetty.HttpJettySolrClient:org.apache.solr.common.util.ObjectReleaseTracker$ObjectTrackerException: org.apache.solr.client.solrj.jetty.HttpJettySolrClient@90623640
at org.apache.solr.common.util.ObjectReleaseTracker.track(ObjectReleaseTracker.java:57)
at org.apache.solr.client.solrj.jetty.HttpJettySolrClient.<init>(HttpJettySolrClient.java:178)
at org.apache.solr.client.solrj.jetty.HttpJettySolrClient$Builder.build(HttpJettySolrClient.java:1055)
at org.apache.solr.update.UpdateShardHandler.<init>(UpdateShardHandler.java:119)
at org.apache.solr.core.CoreContainer.loadInternal(CoreContainer.java:799)
at org.apache.solr.core.CoreContainer.load(CoreContainer.java:753)
at org.apache.solr.servlet.CoreContainerProvider.createCoreContainer(CoreContainerProvider.java:341)
at org.apache.solr.servlet.CoreContainerProvider.init(CoreContainerProvider.java:181)
at org.apache.solr.servlet.CoreContainerProvider.contextInitialized(CoreContainerProvider.java:84)
at org.apache.solr.embedded.JettySolrRunner$1.contextInitialized(JettySolrRunner.java:317)
at org.eclipse.jetty.ee10.servlet.ServletContextHandler.callContextInitialized(ServletContextHandler.java:1592)
at org.eclipse.jetty.ee10.servlet.ServletContextHandler.contextInitialized(ServletContextHandler.java:500)
at org.eclipse.jetty.ee10.servlet.ServletHandler.initialize(ServletHandler.java:678)
at org.eclipse.jetty.ee10.servlet.ServletContextHandler.startContext(ServletContextHandler.java:1326)
at org.eclipse.jetty.ee10.servlet.ServletContextHandler.lambda$doStart$0(ServletContextHandler.java:1052)
at org.eclipse.jetty.server.handler.ContextHandler$ScopedContext.call(ContextHandler.java:1494)
at org.eclipse.jetty.ee10.servlet.ServletContextHandler.doStart(ServletContextHandler.java:1049)
at org.eclipse.jetty.util.component.AbstractLifeCycle.start(AbstractLifeCycle.java:93)
at org.eclipse.jetty.util.component.ContainerLifeCycle.start(ContainerLifeCycle.java:169)
at org.eclipse.jetty.util.component.ContainerLifeCycle.doStart(ContainerLifeCycle.java:120)
at org.eclipse.jetty.server.Handler$Abstract.doStart(Handler.java:491)
at org.eclipse.jetty.util.component.AbstractLifeCycle.start(AbstractLifeCycle.java:93)
at org.eclipse.jetty.util.component.ContainerLifeCycle.start(ContainerLifeCycle.java:169)
at org.eclipse.jetty.server.Server.start(Server.java:643)
at org.eclipse.jetty.util.component.ContainerLifeCycle.doStart(ContainerLifeCycle.java:120)
at org.eclipse.jetty.server.Handler$Abstract.doStart(Handler.java:491)
at org.eclipse.jetty.server.Server.doStart(Server.java:584)
at org.eclipse.jetty.util.component.AbstractLifeCycle.start(AbstractLifeCycle.java:93)
at org.apache.solr.embedded.JettySolrRunner.retryOnPortBindFailure(JettySolrRunner.java:531)
at org.apache.solr.embedded.JettySolrRunner.start(JettySolrRunner.java:474)
at org.apache.solr.embedded.JettySolrRunner.start(JettySolrRunner.java:446)
at org.apache.solr.cloud.BasicDistributedZkTest.testStopAndStartCoresInOneInstance(BasicDistributedZkTest.java:1068)
at org.apache.solr.cloud.BasicDistributedZkTest.test(BasicDistributedZkTest.java:754)
at java.base/jdk.internal.reflect.DirectMethodHandleAccessor.invoke(DirectMethodHandleAccessor.java:103)
at java.base/java.lang.reflect.Method.invoke(Method.java:580)
at com.carrotsearch.randomizedtesting.RandomizedRunner.invoke(RandomizedRunner.java:1763)
at com.carrotsearch.randomizedtesting.RandomizedRunner$8.evaluate(RandomizedRunner.java:946)
at com.carrotsearch.randomizedtesting.RandomizedRunner$9.evaluate(RandomizedRunner.java:982)
at com.carrotsearch.randomizedtesting.RandomizedRunner$10.evaluate(RandomizedRunner.java:996)
at org.apache.solr.BaseDistributedSearchTestCase$ShardsRepeatRule$ShardsFixedStatement.callStatement(BaseDistributedSearchTestCase.java:1071)
at org.apache.solr.BaseDistributedSearchTestCase$ShardsRepeatRule$ShardsStatement.evaluate(BaseDistributedSearchTestCase.java:1042)
at com.carrotsearch.randomizedtesting.rules.SystemPropertiesRestoreRule$1.evaluate(SystemPropertiesRestoreRule.java:80)
at org.junit.rules.RunRules.evaluate(RunRules.java:20)
at org.apache.lucene.tests.util.TestRuleSetupTeardownChained$1.evaluate(TestRuleSetupTeardownChained.java:48)
at org.apache.lucene.tests.util.AbstractBeforeAfterRule$1.evaluate(AbstractBeforeAfterRule.java:43)
at org.apache.lucene.tests.util.TestRuleThreadAndTestName$1.evaluate(TestRuleThreadAndTestName.java:45)
at org.apache.lucene.tests.util.TestRuleIgnoreAfterMaxFailures$1.evaluate(TestRuleIgnoreAfterMaxFailures.java:60)
at org.apache.lucene.tests.util.TestRuleMarkFailure$1.evaluate(TestRuleMarkFailure.java:44)
at org.junit.rules.RunRules.evaluate(RunRules.java:20)
at com.carrotsearch.randomizedtesting.rules.StatementAdapter.evaluate(StatementAdapter.java:36)
at com.carrotsearch.randomizedtesting.ThreadLeakControl$StatementRunner.run(ThreadLeakControl.java:390)
at com.carrotsearch.randomizedtesting.ThreadLeakControl.forkTimeoutingTask(ThreadLeakControl.java:843)
at com.carrotsearch.randomizedtesting.ThreadLeakControl$3.evaluate(ThreadLeakControl.java:490)
at com.carrotsearch.randomizedtesting.RandomizedRunner.runSingleTest(RandomizedRunner.java:955)
at com.carrotsearch.randomizedtesting.RandomizedRunner$5.evaluate(RandomizedRunner.java:840)
at com.carrotsearch.randomizedtesting.RandomizedRunner$6.evaluate(RandomizedRunner.java:891)
at com.carrotsearch.randomizedtesting.RandomizedRunner$7.evaluate(RandomizedRunner.java:902)
at com.carrotsearch.randomizedtesting.rules.StatementAdapter.evaluate(StatementAdapter.java:36)
at com.carrotsearch.randomizedtesting.rules.StatementAdapter.evaluate(StatementAdapter.java:36)
at org.apache.lucene.tests.util.AbstractBeforeAfterRule$1.evaluate(AbstractBeforeAfterRule.java:43)
at com.carrotsearch.randomizedtesting.rules.SystemPropertiesRestoreRule$1.evaluate(SystemPropertiesRestoreRule.java:80)
at org.junit.rules.RunRules.evaluate(RunRules.java:20)
at org.apache.lucene.tests.util.AbstractBeforeAfterRule$1.evaluate(AbstractBeforeAfterRule.java:43)
at com.carrotsearch.randomizedtesting.rules.StatementAdapter.evaluate(StatementAdapter.java:36)
at org.apache.lucene.tests.util.TestRuleStoreClassName$1.evaluate(TestRuleStoreClassName.java:38)
at com.carrotsearch.randomizedtesting.rules.NoShadowingOrOverridesOnMethodsRule$1.evaluate(NoShadowingOrOverridesOnMethodsRule.java:40)
at com.carrotsearch.randomizedtesting.rules.NoShadowingOrOverridesOnMethodsRule$1.evaluate(NoShadowingOrOverridesOnMethodsRule.java:40)
at com.carrotsearch.randomizedtesting.rules.StatementAdapter.evaluate(StatementAdapter.java:36)
at com.carrotsearch.randomizedtesting.rules.StatementAdapter.evaluate(StatementAdapter.java:36)
at org.apache.lucene.tests.util.TestRuleAssertionsRequired$1.evaluate(TestRuleAssertionsRequired.java:53)
at org.apache.lucene.tests.util.AbstractBeforeAfterRule$1.evaluate(AbstractBeforeAfterRule.java:43)
at org.apache.lucene.tests.util.TestRuleMarkFailure$1.evaluate(TestRuleMarkFailure.java:44)
at org.apache.lucene.tests.util.TestRuleIgnoreAfterMaxFailures$1.evaluate(TestRuleIgnoreAfterMaxFailures.java:60)
at org.apache.lucene.tests.util.TestRuleIgnoreTestSuites$1.evaluate(TestRuleIgnoreTestSuites.java:47)
at org.junit.rules.RunRules.evaluate(RunRules.java:20)
at com.carrotsearch.randomizedtesting.rules.StatementAdapter.evaluate(StatementAdapter.java:36)
at com.carrotsearch.randomizedtesting.ThreadLeakControl$StatementRunner.run(ThreadLeakControl.java:390)
at com.carrotsearch.randomizedtesting.ThreadLeakControl.lambda$forkTimeoutingTask$0(ThreadLeakControl.java:850)
at java.base/java.lang.Thread.run(Thread.java:1570)
org.apache.solr.client.solrj.jetty.HttpJettySolrClient:org.apache.solr.common.util.ObjectReleaseTracker$ObjectTrackerException: org.apache.solr.client.solrj.jetty.HttpJettySolrClient@1006682787
at org.apache.solr.common.util.ObjectReleaseTracker.track(ObjectReleaseTracker.java:57)
at org.apache.solr.client.solrj.jetty.HttpJettySolrClient.<init>(HttpJettySolrClient.java:178)
at org.apache.solr.client.solrj.jetty.HttpJettySolrClient$Builder.build(HttpJettySolrClient.java:1055)
at org.apache.solr.update.UpdateShardHandler.<init>(UpdateShardHandler.java:121)
at org.apache.solr.core.CoreContainer.loadInternal(CoreContainer.java:799)
at org.apache.solr.core.CoreContainer.load(CoreContainer.java:753)
at org.apache.solr.servlet.CoreContainerProvider.createCoreContainer(CoreContainerProvider.java:341)
at org.apache.solr.servlet.CoreContainerProvider.init(CoreContainerProvider.java:181)
at org.apache.solr.servlet.CoreContainerProvider.contextInitialized(CoreContainerProvider.java:84)
at org.apache.solr.embedded.JettySolrRunner$1.contextInitialized(JettySolrRunner.java:317)
at org.eclipse.jetty.ee10.servlet.ServletContextHandler.callContextInitialized(ServletContextHandler.java:1592)
at org.eclipse.jetty.ee10.servlet.ServletContextHandler.contextInitialized(ServletContextHandler.java:500)
at org.eclipse.jetty.ee10.servlet.ServletHandler.initialize(ServletHandler.java:678)
at org.eclipse.jetty.ee10.servlet.ServletContextHandler.startContext(ServletContextHandler.java:1326)
at org.eclipse.jetty.ee10.servlet.ServletContextHandler.lambda$doStart$0(ServletContextHandler.java:1052)
at org.eclipse.jetty.server.handler.ContextHandler$ScopedContext.call(ContextHandler.java:1494)
at org.eclipse.jetty.ee10.servlet.ServletContextHandler.doStart(ServletContextHandler.java:1049)
at org.eclipse.jetty.util.component.AbstractLifeCycle.start(AbstractLifeCycle.java:93)
at org.eclipse.jetty.util.component.ContainerLifeCycle.start(ContainerLifeCycle.java:169)
at org.eclipse.jetty.util.component.ContainerLifeCycle.doStart(ContainerLifeCycle.java:120)
at org.eclipse.jetty.server.Handler$Abstract.doStart(Handler.java:491)
at org.eclipse.jetty.util.component.AbstractLifeCycle.start(AbstractLifeCycle.java:93)
at org.eclipse.jetty.util.component.ContainerLifeCycle.start(ContainerLifeCycle.java:169)
at org.eclipse.jetty.server.Server.start(Server.java:643)
at org.eclipse.jetty.util.component.ContainerLifeCycle.doStart(ContainerLifeCycle.java:120)
at org.eclipse.jetty.server.Handler$Abstract.doStart(Handler.java:491)
at org.eclipse.jetty.server.Server.doStart(Server.java:584)
at org.eclipse.jetty.util.component.AbstractLifeCycle.start(AbstractLifeCycle.java:93)
at org.apache.solr.embedded.JettySolrRunner.retryOnPortBindFailure(JettySolrRunner.java:531)
at org.apache.solr.embedded.JettySolrRunner.start(JettySolrRunner.java:474)
at org.apache.solr.embedded.JettySolrRunner.start(JettySolrRunner.java:446)
at org.apache.solr.cloud.BasicDistributedZkTest.testStopAndStartCoresInOneInstance(BasicDistributedZkTest.java:1068)
at org.apache.solr.cloud.BasicDistributedZkTest.test(BasicDistributedZkTest.java:754)
at java.base/jdk.internal.reflect.DirectMethodHandleAccessor.invoke(DirectMethodHandleAccessor.java:103)
at java.base/java.lang.reflect.Method.invoke(Method.java:580)
at com.carrotsearch.randomizedtesting.RandomizedRunner.invoke(RandomizedRunner.java:1763)
at com.carrotsearch.randomizedtesting.RandomizedRunner$8.evaluate(RandomizedRunner.java:946)
at com.carrotsearch.randomizedtesting.RandomizedRunner$9.evaluate(RandomizedRunner.java:982)
at com.carrotsearch.randomizedtesting.RandomizedRunner$10.evaluate(RandomizedRunner.java:996)
at org.apache.solr.BaseDistributedSearchTestCase$ShardsRepeatRule$ShardsFixedStatement.callStatement(BaseDistributedSearchTestCase.java:1071)
at org.apache.solr.BaseDistributedSearchTestCase$ShardsRepeatRule$ShardsStatement.evaluate(BaseDistributedSearchTestCase.java:1042)
at com.carrotsearch.randomizedtesting.rules.SystemPropertiesRestoreRule$1.evaluate(SystemPropertiesRestoreRule.java:80)
at org.junit.rules.RunRules.evaluate(RunRules.java:20)
at org.apache.lucene.tests.util.TestRuleSetupTeardownChained$1.evaluate(TestRuleSetupTeardownChained.java:48)
at org.apache.lucene.tests.util.AbstractBeforeAfterRule$1.evaluate(AbstractBeforeAfterRule.java:43)
at org.apache.lucene.tests.util.TestRuleThreadAndTestName$1.evaluate(TestRuleThreadAndTestName.java:45)
at org.apache.lucene.tests.util.TestRuleIgnoreAfterMaxFailures$1.evaluate(TestRuleIgnoreAfterMaxFailures.java:60)
at org.apache.lucene.tests.util.TestRuleMarkFailure$1.evaluate(TestRuleMarkFailure.java:44)
at org.junit.rules.RunRules.evaluate(RunRules.java:20)
at com.carrotsearch.randomizedtesting.rules.StatementAdapter.evaluate(StatementAdapter.java:36)
at com.carrotsearch.randomizedtesting.ThreadLeakControl$StatementRunner.run(ThreadLeakControl.java:390)
at com.carrotsearch.randomizedtesting.ThreadLeakControl.forkTimeoutingTask(ThreadLeakControl.java:843)
at com.carrotsearch.randomizedtesting.ThreadLeakControl$3.evaluate(ThreadLeakControl.java:490)
at com.carrotsearch.randomizedtesting.RandomizedRunner.runSingleTest(RandomizedRunner.java:955)
at com.carrotsearch.randomizedtesting.RandomizedRunner$5.evaluate(RandomizedRunner.java:840)
at com.carrotsearch.randomizedtesting.RandomizedRunner$6.evaluate(RandomizedRunner.java:891)
at com.carrotsearch.randomizedtesting.RandomizedRunner$7.evaluate(RandomizedRunner.java:902)
at com.carrotsearch.randomizedtesting.rules.StatementAdapter.evaluate(StatementAdapter.java:36)
at com.carrotsearch.randomizedtesting.rules.StatementAdapter.evaluate(StatementAdapter.java:36)
at org.apache.lucene.tests.util.AbstractBeforeAfterRule$1.evaluate(AbstractBeforeAfterRule.java:43)
at com.carrotsearch.randomizedtesting.rules.SystemPropertiesRestoreRule$1.evaluate(SystemPropertiesRestoreRule.java:80)
at org.junit.rules.RunRules.evaluate(RunRules.java:20)
at org.apache.lucene.tests.util.AbstractBeforeAfterRule$1.evaluate(AbstractBeforeAfterRule.java:43)
at com.carrotsearch.randomizedtesting.rules.StatementAdapter.evaluate(StatementAdapter.java:36)
at org.apache.lucene.tests.util.TestRuleStoreClassName$1.evaluate(TestRuleStoreClassName.java:38)
at com.carrotsearch.randomizedtesting.rules.NoShadowingOrOverridesOnMethodsRule$1.evaluate(NoShadowingOrOverridesOnMethodsRule.java:40)
at com.carrotsearch.randomizedtesting.rules.NoShadowingOrOverridesOnMethodsRule$1.evaluate(NoShadowingOrOverridesOnMethodsRule.java:40)
at com.carrotsearch.randomizedtesting.rules.StatementAdapter.evaluate(StatementAdapter.java:36)
at com.carrotsearch.randomizedtesting.rules.StatementAdapter.evaluate(StatementAdapter.java:36)
at org.apache.lucene.tests.util.TestRuleAssertionsRequired$1.evaluate(TestRuleAssertionsRequired.java:53)
at org.apache.lucene.tests.util.AbstractBeforeAfterRule$1.evaluate(AbstractBeforeAfterRule.java:43)
at org.apache.lucene.tests.util.TestRuleMarkFailure$1.evaluate(TestRuleMarkFailure.java:44)
at org.apache.lucene.tests.util.TestRuleIgnoreAfterMaxFailures$1.evaluate(TestRuleIgnoreAfterMaxFailures.java:60)
at org.apache.lucene.tests.util.TestRuleIgnoreTestSuites$1.evaluate(TestRuleIgnoreTestSuites.java:47)
at org.junit.rules.RunRules.evaluate(RunRules.java:20)
at com.carrotsearch.randomizedtesting.rules.StatementAdapter.evaluate(StatementAdapter.java:36)
at com.carrotsearch.randomizedtesting.ThreadLeakControl$StatementRunner.run(ThreadLeakControl.java:390)
at com.carrotsearch.randomizedtesting.ThreadLeakControl.lambda$forkTimeoutingTask$0(ThreadLeakControl.java:850)
at java.base/java.lang.Thread.run(Thread.java:1570)
>
at org.junit.Assert.fail(Assert.java:89)
at org.junit.Assert.failNotNull(Assert.java:756)
at org.junit.Assert.assertNull(Assert.java:738)
at org.apache.solr.SolrTestCase$1.afterIfSuccessful(SolrTestCase.java:100)
at com.carrotsearch.randomizedtesting.rules.TestRuleAdapter$1.afterIfSuccessful(TestRuleAdapter.java:36)
at com.carrotsearch.randomizedtesting.rules.StatementAdapter.evaluate(StatementAdapter.java:37)
at com.carrotsearch.randomizedtesting.rules.StatementAdapter.evaluate(StatementAdapter.java:36)
at org.apache.lucene.tests.util.AbstractBeforeAfterRule$1.evaluate(AbstractBeforeAfterRule.java:43)
at com.carrotsearch.randomizedtesting.rules.SystemPropertiesRestoreRule$1.evaluate(SystemPropertiesRestoreRule.java:80)
at org.junit.rules.RunRules.evaluate(RunRules.java:20)
at org.apache.lucene.tests.util.AbstractBeforeAfterRule$1.evaluate(AbstractBeforeAfterRule.java:43)
at com.carrotsearch.randomizedtesting.rules.StatementAdapter.evaluate(StatementAdapter.java:36)
at org.apache.lucene.tests.util.TestRuleStoreClassName$1.evaluate(TestRuleStoreClassName.java:38)
at com.carrotsearch.randomizedtesting.rules.NoShadowingOrOverridesOnMethodsRule$1.evaluate(NoShadowingOrOverridesOnMethodsRule.java:40)
at com.carrotsearch.randomizedtesting.rules.NoShadowingOrOverridesOnMethodsRule$1.evaluate(NoShadowingOrOverridesOnMethodsRule.java:40)
at com.carrotsearch.randomizedtesting.rules.StatementAdapter.evaluate(StatementAdapter.java:36)
at com.carrotsearch.randomizedtesting.rules.StatementAdapter.evaluate(StatementAdapter.java:36)
at org.apache.lucene.tests.util.TestRuleAssertionsRequired$1.evaluate(TestRuleAssertionsRequired.java:53)
at org.apache.lucene.tests.util.AbstractBeforeAfterRule$1.evaluate(AbstractBeforeAfterRule.java:43)
at org.apache.lucene.tests.util.TestRuleMarkFailure$1.evaluate(TestRuleMarkFailure.java:44)
at org.apache.lucene.tests.util.TestRuleIgnoreAfterMaxFailures$1.evaluate(TestRuleIgnoreAfterMaxFailures.java:60)
at org.apache.lucene.tests.util.TestRuleIgnoreTestSuites$1.evaluate(TestRuleIgnoreTestSuites.java:47)
at org.junit.rules.RunRules.evaluate(RunRules.java:20)
at com.carrotsearch.randomizedtesting.rules.StatementAdapter.evaluate(StatementAdapter.java:36)
at com.carrotsearch.randomizedtesting.ThreadLeakControl$StatementRunner.run(ThreadLeakControl.java:390)
at com.carrotsearch.randomizedtesting.ThreadLeakControl.lambda$forkTimeoutingTask$0(ThreadLeakControl.java:850)
at java.base/java.lang.Thread.run(Thread.java:1570)
FAILED: org.apache.solr.cloud.BasicDistributedZkTest.classMethod
Error Message:
com.carrotsearch.randomizedtesting.ThreadLeakError: 20 threads leaked from SUITE scope at org.apache.solr.cloud.BasicDistributedZkTest:
1) Thread[id=2041, name=h2sc-961-thread-1, state=RUNNABLE, group=TGRP-BasicDistributedZkTest]
at java.base/sun.nio.ch.KQueue.poll(Native Method)
at java.base/sun.nio.ch.KQueueSelectorImpl.doSelect(KQueueSelectorImpl.java:125)
at java.base/sun.nio.ch.SelectorImpl.lockAndDoSelect(SelectorImpl.java:130)
at java.base/sun.nio.ch.SelectorImpl.select(SelectorImpl.java:147)
at org.eclipse.jetty.io.ManagedSelector.nioSelect(ManagedSelector.java:182)
at org.eclipse.jetty.io.ManagedSelector.select(ManagedSelector.java:189)
at org.eclipse.jetty.io.ManagedSelector$SelectorProducer.select(ManagedSelector.java:616)
at org.eclipse.jetty.io.ManagedSelector$SelectorProducer.produce(ManagedSelector.java:550)
at org.eclipse.jetty.util.thread.strategy.AdaptiveExecutionStrategy.produceTask(AdaptiveExecutionStrategy.java:526)
at org.eclipse.jetty.util.thread.strategy.AdaptiveExecutionStrategy.tryProduce(AdaptiveExecutionStrategy.java:251)
at org.eclipse.jetty.util.thread.strategy.AdaptiveExecutionStrategy.produce(AdaptiveExecutionStrategy.java:196)
at org.apache.solr.common.util.ExecutorUtil$MDCAwareThreadPoolExecutor.lambda$execute$0(ExecutorUtil.java:408)
at java.base/java.util.concurrent.ThreadPoolExecutor.runWorker(ThreadPoolExecutor.java:1144)
at java.base/java.util.concurrent.ThreadPoolExecutor$Worker.run(ThreadPoolExecutor.java:642)
at java.base/java.lang.Thread.run(Thread.java:1570)
2) Thread[id=2111, name=h2sc-961-thread-8, state=WAITING, group=TGRP-BasicDistributedZkTest]
at java.base/jdk.internal.misc.Unsafe.park(Native Method)
at java.base/java.util.concurrent.locks.LockSupport.park(LockSupport.java:371)
at java.base/java.util.concurrent.locks.AbstractQueuedSynchronizer$ConditionNode.block(AbstractQueuedSynchronizer.java:519)
at java.base/java.util.concurrent.ForkJoinPool.unmanagedBlock(ForkJoinPool.java:4011)
at java.base/java.util.concurrent.ForkJoinPool.managedBlock(ForkJoinPool.java:3959)
at java.base/java.util.concurrent.locks.AbstractQueuedSynchronizer$ConditionObject.await(AbstractQueuedSynchronizer.java:1707)
at org.eclipse.jetty.util.BlockingArrayQueue.take(BlockingArrayQueue.java:534)
at java.base/java.util.concurrent.ThreadPoolExecutor.getTask(ThreadPoolExecutor.java:1070)
at java.base/java.util.concurrent.ThreadPoolExecutor.runWorker(ThreadPoolExecutor.java:1130)
at java.base/java.util.concurrent.ThreadPoolExecutor$Worker.run(ThreadPoolExecutor.java:642)
at java.base/java.lang.Thread.run(Thread.java:1570)
3) Thread[id=2106, name=h2sc-961-thread-4, state=WAITING, group=TGRP-BasicDistributedZkTest]
at java.base/jdk.internal.misc.Unsafe.park(Native Method)
at java.base/java.util.concurrent.locks.LockSupport.park(LockSupport.java:371)
at java.base/java.util.concurrent.locks.AbstractQueuedSynchronizer$ConditionNode.block(AbstractQueuedSynchronizer.java:519)
at java.base/java.util.concurrent.ForkJoinPool.unmanagedBlock(ForkJoinPool.java:4011)
at java.base/java.util.concurrent.ForkJoinPool.managedBlock(ForkJoinPool.java:3959)
at java.base/java.util.concurrent.locks.AbstractQueuedSynchronizer$ConditionObject.await(AbstractQueuedSynchronizer.java:1707)
at org.eclipse.jetty.util.BlockingArrayQueue.take(BlockingArrayQueue.java:534)
at java.base/java.util.concurrent.ThreadPoolExecutor.getTask(ThreadPoolExecutor.java:1070)
at java.base/java.util.concurrent.ThreadPoolExecutor.runWorker(ThreadPoolExecutor.java:1130)
at java.base/java.util.concurrent.ThreadPoolExecutor$Worker.run(ThreadPoolExecutor.java:642)
at java.base/java.lang.Thread.run(Thread.java:1570)
4) Thread[id=2109, name=h2sc-961-thread-6, state=WAITING, group=TGRP-BasicDistributedZkTest]
at java.base/jdk.internal.misc.Unsafe.park(Native Method)
at java.base/java.util.concurrent.locks.LockSupport.park(LockSupport.java:371)
at java.base/java.util.concurrent.locks.AbstractQueuedSynchronizer$ConditionNode.block(AbstractQueuedSynchronizer.java:519)
at java.base/java.util.concurrent.ForkJoinPool.unmanagedBlock(ForkJoinPool.java:4011)
at java.base/java.util.concurrent.ForkJoinPool.managedBlock(ForkJoinPool.java:3959)
at java.base/java.util.concurrent.locks.AbstractQueuedSynchronizer$ConditionObject.await(AbstractQueuedSynchronizer.java:1707)
at org.eclipse.jetty.util.BlockingArrayQueue.take(BlockingArrayQueue.java:534)
at java.base/java.util.concurrent.ThreadPoolExecutor.getTask(ThreadPoolExecutor.java:1070)
at java.base/java.util.concurrent.ThreadPoolExecutor.runWorker(ThreadPoolExecutor.java:1130)
at java.base/java.util.concurrent.ThreadPoolExecutor$Worker.run(ThreadPoolExecutor.java:642)
at java.base/java.lang.Thread.run(Thread.java:1570)
5) Thread[id=2298, name=h2sc-961-thread-17, state=WAITING, group=TGRP-BasicDistributedZkTest]
at java.base/jdk.internal.misc.Unsafe.park(Native Method)
at java.base/java.util.concurrent.locks.LockSupport.park(LockSupport.java:371)
at java.base/java.util.concurrent.locks.AbstractQueuedSynchronizer$ConditionNode.block(AbstractQueuedSynchronizer.java:519)
at java.base/java.util.concurrent.ForkJoinPool.unmanagedBlock(ForkJoinPool.java:4011)
at java.base/java.util.concurrent.ForkJoinPool.managedBlock(ForkJoinPool.java:3959)
at java.base/java.util.concurrent.locks.AbstractQueuedSynchronizer$ConditionObject.await(AbstractQueuedSynchronizer.java:1707)
at org.eclipse.jetty.util.BlockingArrayQueue.take(BlockingArrayQueue.java:534)
at java.base/java.util.concurrent.ThreadPoolExecutor.getTask(ThreadPoolExecutor.java:1070)
at java.base/java.util.concurrent.ThreadPoolExecutor.runWorker(ThreadPoolExecutor.java:1130)
at java.base/java.util.concurrent.ThreadPoolExecutor$Worker.run(ThreadPoolExecutor.java:642)
at java.base/java.lang.Thread.run(Thread.java:1570)
6) Thread[id=2195, name=h2sc-961-thread-11, state=WAITING, group=TGRP-BasicDistributedZkTest]
at java.base/jdk.internal.misc.Unsafe.park(Native Method)
at java.base/java.util.concurrent.locks.LockSupport.park(LockSupport.java:371)
at java.base/java.util.concurrent.locks.AbstractQueuedSynchronizer$ConditionNode.block(AbstractQueuedSynchronizer.java:519)
at java.base/java.util.concurrent.ForkJoinPool.unmanagedBlock(ForkJoinPool.java:4011)
at java.base/java.util.concurrent.ForkJoinPool.managedBlock(ForkJoinPool.java:3959)
at java.base/java.util.concurrent.locks.AbstractQueuedSynchronizer$ConditionObject.await(AbstractQueuedSynchronizer.java:1707)
at org.eclipse.jetty.util.BlockingArrayQueue.take(BlockingArrayQueue.java:534)
at java.base/java.util.concurrent.ThreadPoolExecutor.getTask(ThreadPoolExecutor.java:1070)
at java.base/java.util.concurrent.ThreadPoolExecutor.runWorker(ThreadPoolExecutor.java:1130)
at java.base/java.util.concurrent.ThreadPoolExecutor$Worker.run(ThreadPoolExecutor.java:642)
at java.base/java.lang.Thread.run(Thread.java:1570)
7) Thread[id=2107, name=HttpClient@18cbc4cd-scheduler-1, state=TIMED_WAITING, group=TGRP-BasicDistributedZkTest]
at java.base/jdk.internal.misc.Unsafe.park(Native Method)
at java.base/java.util.concurrent.locks.LockSupport.parkNanos(LockSupport.java:269)
at java.base/java.util.concurrent.locks.AbstractQueuedSynchronizer$ConditionObject.awaitNanos(AbstractQueuedSynchronizer.java:1758)
at java.base/java.util.concurrent.ScheduledThreadPoolExecutor$DelayedWorkQueue.take(ScheduledThreadPoolExecutor.java:1182)
at java.base/java.util.concurrent.ScheduledThreadPoolExecutor$DelayedWorkQueue.take(ScheduledThreadPoolExecutor.java:899)
at java.base/java.util.concurrent.ThreadPoolExecutor.getTask(ThreadPoolExecutor.java:1070)
at java.base/java.util.concurrent.ThreadPoolExecutor.runWorker(ThreadPoolExecutor.java:1130)
at java.base/java.util.concurrent.ThreadPoolExecutor$Worker.run(ThreadPoolExecutor.java:642)
at java.base/java.lang.Thread.run(Thread.java:1570)
8) Thread[id=2205, name=h2sc-961-thread-15, state=WAITING, group=TGRP-BasicDistributedZkTest]
at java.base/jdk.internal.misc.Unsafe.park(Native Method)
at java.base/java.util.concurrent.locks.LockSupport.park(LockSupport.java:371)
at java.base/java.util.concurrent.locks.AbstractQueuedSynchronizer$ConditionNode.block(AbstractQueuedSynchronizer.java:519)
at java.base/java.util.concurrent.ForkJoinPool.unmanagedBlock(ForkJoinPool.java:4011)
at java.base/java.util.concurrent.ForkJoinPool.managedBlock(ForkJoinPool.java:3959)
at java.base/java.util.concurrent.locks.AbstractQueuedSynchronizer$ConditionObject.await(AbstractQueuedSynchronizer.java:1707)
at org.eclipse.jetty.util.BlockingArrayQueue.take(BlockingArrayQueue.java:534)
at java.base/java.util.concurrent.ThreadPoolExecutor.getTask(ThreadPoolExecutor.java:1070)
at java.base/java.util.concurrent.ThreadPoolExecutor.runWorker(ThreadPoolExecutor.java:1130)
at java.base/java.util.concurrent.ThreadPoolExecutor$Worker.run(ThreadPoolExecutor.java:642)
at java.base/java.lang.Thread.run(Thread.java:1570)
9) Thread[id=2040, name=h2sc-960-thread-2, state=RUNNABLE, group=TGRP-BasicDistributedZkTest]
at java.base/sun.nio.ch.KQueue.poll(Native Method)
at java.base/sun.nio.ch.KQueueSelectorImpl.doSelect(KQueueSelectorImpl.java:125)
at java.base/sun.nio.ch.SelectorImpl.lockAndDoSelect(SelectorImpl.java:130)
at java.base/sun.nio.ch.SelectorImpl.select(SelectorImpl.java:147)
at org.eclipse.jetty.io.ManagedSelector.nioSelect(ManagedSelector.java:182)
at org.eclipse.jetty.io.ManagedSelector.select(ManagedSelector.java:189)
at org.eclipse.jetty.io.ManagedSelector$SelectorProducer.select(ManagedSelector.java:616)
at org.eclipse.jetty.io.ManagedSelector$SelectorProducer.produce(ManagedSelector.java:550)
at org.eclipse.jetty.util.thread.strategy.AdaptiveExecutionStrategy.produceTask(AdaptiveExecutionStrategy.java:526)
at org.eclipse.jetty.util.thread.strategy.AdaptiveExecutionStrategy.tryProduce(AdaptiveExecutionStrategy.java:251)
at org.eclipse.jetty.util.thread.strategy.AdaptiveExecutionStrategy.produce(AdaptiveExecutionStrategy.java:196)
at org.apache.solr.common.util.ExecutorUtil$MDCAwareThreadPoolExecutor.lambda$execute$0(ExecutorUtil.java:408)
at java.base/java.util.concurrent.ThreadPoolExecutor.runWorker(ThreadPoolExecutor.java:1144)
at java.base/java.util.concurrent.ThreadPoolExecutor$Worker.run(ThreadPoolExecutor.java:642)
at java.base/java.lang.Thread.run(Thread.java:1570)
10) Thread[id=2201, name=h2sc-961-thread-13, state=WAITING, group=TGRP-BasicDistributedZkTest]
at java.base/jdk.internal.misc.Unsafe.park(Native Method)
at java.base/java.util.concurrent.locks.LockSupport.park(LockSupport.java:371)
at java.base/java.util.concurrent.locks.AbstractQueuedSynchronizer$ConditionNode.block(AbstractQueuedSynchronizer.java:519)
at java.base/java.util.concurrent.ForkJoinPool.unmanagedBlock(ForkJoinPool.java:4011)
at java.base/java.util.concurrent.ForkJoinPool.managedBlock(ForkJoinPool.java:3959)
at java.base/java.util.concurrent.locks.AbstractQueuedSynchronizer$ConditionObject.await(AbstractQueuedSynchronizer.java:1707)
at org.eclipse.jetty.util.BlockingArrayQueue.take(BlockingArrayQueue.java:534)
at java.base/java.util.concurrent.ThreadPoolExecutor.getTask(ThreadPoolExecutor.java:1070)
at java.base/java.util.concurrent.ThreadPoolExecutor.runWorker(ThreadPoolExecutor.java:1130)
at java.base/java.util.concurrent.ThreadPoolExecutor$Worker.run(ThreadPoolExecutor.java:642)
at java.base/java.lang.Thread.run(Thread.java:1570)
11) Thread[id=2110, name=h2sc-961-thread-7, state=WAITING, group=TGRP-BasicDistributedZkTest]
at java.base/jdk.internal.misc.Unsafe.park(Native Method)
at java.base/java.util.concurrent.locks.LockSupport.park(LockSupport.java:371)
at java.base/java.util.concurrent.locks.AbstractQueuedSynchronizer$ConditionNode.block(AbstractQueuedSynchronizer.java:519)
at java.base/java.util.concurrent.ForkJoinPool.unmanagedBlock(ForkJoinPool.java:4011)
at java.base/java.util.concurrent.ForkJoinPool.managedBlock(ForkJoinPool.java:3959)
at java.base/java.util.concurrent.locks.AbstractQueuedSynchronizer$ConditionObject.await(AbstractQueuedSynchronizer.java:1707)
at org.eclipse.jetty.util.BlockingArrayQueue.take(BlockingArrayQueue.java:534)
at java.base/java.util.concurrent.ThreadPoolExecutor.getTask(ThreadPoolExecutor.java:1070)
at java.base/java.util.concurrent.ThreadPoolExecutor.runWorker(ThreadPoolExecutor.java:1130)
at java.base/java.util.concurrent.ThreadPoolExecutor$Worker.run(ThreadPoolExecutor.java:642)
at java.base/java.lang.Thread.run(Thread.java:1570)
12) Thread[id=2042, name=h2sc-961-thread-2, state=RUNNABLE, group=TGRP-BasicDistributedZkTest]
at java.base/sun.nio.ch.KQueue.poll(Native Method)
at java.base/sun.nio.ch.KQueueSelectorImpl.doSelect(KQueueSelectorImpl.java:125)
at java.base/sun.nio.ch.SelectorImpl.lockAndDoSelect(SelectorImpl.java:130)
at java.base/sun.nio.ch.SelectorImpl.select(SelectorImpl.java:147)
at org.eclipse.jetty.io.ManagedSelector.nioSelect(ManagedSelector.java:182)
at org.eclipse.jetty.io.ManagedSelector.select(ManagedSelector.java:189)
at org.eclipse.jetty.io.ManagedSelector$SelectorProducer.select(ManagedSelector.java:616)
at org.eclipse.jetty.io.ManagedSelector$SelectorProducer.produce(ManagedSelector.java:550)
at org.eclipse.jetty.util.thread.strategy.AdaptiveExecutionStrategy.produceTask(AdaptiveExecutionStrategy.java:526)
at org.eclipse.jetty.util.thread.strategy.AdaptiveExecutionStrategy.tryProduce(AdaptiveExecutionStrategy.java:251)
at org.eclipse.jetty.util.thread.strategy.AdaptiveExecutionStrategy.produce(AdaptiveExecutionStrategy.java:196)
at org.apache.solr.common.util.ExecutorUtil$MDCAwareThreadPoolExecutor.lambda$execute$0(ExecutorUtil.java:408)
at java.base/java.util.concurrent.ThreadPoolExecutor.runWorker(ThreadPoolExecutor.java:1144)
at java.base/java.util.concurrent.ThreadPoolExecutor$Worker.run(ThreadPoolExecutor.java:642)
at java.base/java.lang.Thread.run(Thread.java:1570)
13) Thread[id=2108, name=h2sc-961-thread-5, state=WAITING, group=TGRP-BasicDistributedZkTest]
at java.base/jdk.internal.misc.Unsafe.park(Native Method)
at java.base/java.util.concurrent.locks.LockSupport.park(LockSupport.java:371)
at java.base/java.util.concurrent.locks.AbstractQueuedSynchronizer$ConditionNode.block(AbstractQueuedSynchronizer.java:519)
at java.base/java.util.concurrent.ForkJoinPool.unmanagedBlock(ForkJoinPool.java:4011)
at java.base/java.util.concurrent.ForkJoinPool.managedBlock(ForkJoinPool.java:3959)
at java.base/java.util.concurrent.locks.AbstractQueuedSynchronizer$ConditionObject.await(AbstractQueuedSynchronizer.java:1707)
at org.eclipse.jetty.util.BlockingArrayQueue.take(BlockingArrayQueue.java:534)
at java.base/java.util.concurrent.ThreadPoolExecutor.getTask(ThreadPoolExecutor.java:1070)
at java.base/java.util.concurrent.ThreadPoolExecutor.runWorker(ThreadPoolExecutor.java:1130)
at java.base/java.util.concurrent.ThreadPoolExecutor$Worker.run(ThreadPoolExecutor.java:642)
at java.base/java.lang.Thread.run(Thread.java:1570)
14) Thread[id=2202, name=h2sc-961-thread-14, state=WAITING, group=TGRP-BasicDistributedZkTest]
at java.base/jdk.internal.misc.Unsafe.park(Native Method)
at java.base/java.util.concurrent.locks.LockSupport.park(LockSupport.java:371)
at java.base/java.util.concurrent.locks.AbstractQueuedSynchronizer$ConditionNode.block(AbstractQueuedSynchronizer.java:519)
at java.base/java.util.concurrent.ForkJoinPool.unmanagedBlock(ForkJoinPool.java:4011)
at java.base/java.util.concurrent.ForkJoinPool.managedBlock(ForkJoinPool.java:3959)
at java.base/java.util.concurrent.locks.AbstractQueuedSynchronizer$ConditionObject.await(AbstractQueuedSynchronizer.java:1707)
at org.eclipse.jetty.util.BlockingArrayQueue.take(BlockingArrayQueue.java:534)
at java.base/java.util.concurrent.ThreadPoolExecutor.getTask(ThreadPoolExecutor.java:1070)
at java.base/java.util.concurrent.ThreadPoolExecutor.runWorker(ThreadPoolExecutor.java:1130)
at java.base/java.util.concurrent.ThreadPoolExecutor$Worker.run(ThreadPoolExecutor.java:642)
at java.base/java.lang.Thread.run(Thread.java:1570)
15) Thread[id=2115, name=h2sc-961-thread-10, state=WAITING, group=TGRP-BasicDistributedZkTest]
at java.base/jdk.internal.misc.Unsafe.park(Native Method)
at java.base/java.util.concurrent.locks.LockSupport.park(LockSupport.java:371)
at java.base/java.util.concurrent.locks.AbstractQueuedSynchronizer$ConditionNode.block(AbstractQueuedSynchronizer.java:519)
at java.base/java.util.concurrent.ForkJoinPool.unmanagedBlock(ForkJoinPool.java:4011)
at java.base/java.util.concurrent.ForkJoinPool.managedBlock(ForkJoinPool.java:3959)
at java.base/java.util.concurrent.locks.AbstractQueuedSynchronizer$ConditionObject.await(AbstractQueuedSynchronizer.java:1707)
at org.eclipse.jetty.util.BlockingArrayQueue.take(BlockingArrayQueue.java:534)
at java.base/java.util.concurrent.ThreadPoolExecutor.getTask(ThreadPoolExecutor.java:1070)
at java.base/java.util.concurrent.ThreadPoolExecutor.runWorker(ThreadPoolExecutor.java:1130)
at java.base/java.util.concurrent.ThreadPoolExecutor$Worker.run(ThreadPoolExecutor.java:642)
at java.base/java.lang.Thread.run(Thread.java:1570)
16) Thread[id=2196, name=h2sc-961-thread-12, state=WAITING, group=TGRP-BasicDistributedZkTest]
at java.base/jdk.internal.misc.Unsafe.park(Native Method)
at java.base/java.util.concurrent.locks.LockSupport.park(LockSupport.java:371)
at java.base/java.util.concurrent.locks.AbstractQueuedSynchronizer$ConditionNode.block(AbstractQueuedSynchronizer.java:519)
at java.base/java.util.concurrent.ForkJoinPool.unmanagedBlock(ForkJoinPool.java:4011)
at java.base/java.util.concurrent.ForkJoinPool.managedBlock(ForkJoinPool.java:3959)
at java.base/java.util.concurrent.locks.AbstractQueuedSynchronizer$ConditionObject.await(AbstractQueuedSynchronizer.java:1707)
at org.eclipse.jetty.util.BlockingArrayQueue.take(BlockingArrayQueue.java:534)
at java.base/java.util.concurrent.ThreadPoolExecutor.getTask(ThreadPoolExecutor.java:1070)
at java.base/java.util.concurrent.ThreadPoolExecutor.runWorker(ThreadPoolExecutor.java:1130)
at java.base/java.util.concurrent.ThreadPoolExecutor$Worker.run(ThreadPoolExecutor.java:642)
at java.base/java.lang.Thread.run(Thread.java:1570)
17) Thread[id=2207, name=h2sc-961-thread-16, state=WAITING, group=TGRP-BasicDistributedZkTest]
at java.base/jdk.internal.misc.Unsafe.park(Native Method)
at java.base/java.util.concurrent.locks.LockSupport.park(LockSupport.java:371)
at java.base/java.util.concurrent.locks.AbstractQueuedSynchronizer$ConditionNode.block(AbstractQueuedSynchronizer.java:519)
at java.base/java.util.concurrent.ForkJoinPool.unmanagedBlock(ForkJoinPool.java:4011)
at java.base/java.util.concurrent.ForkJoinPool.managedBlock(ForkJoinPool.java:3959)
at java.base/java.util.concurrent.locks.AbstractQueuedSynchronizer$ConditionObject.await(AbstractQueuedSynchronizer.java:1707)
at org.eclipse.jetty.util.BlockingArrayQueue.take(BlockingArrayQueue.java:534)
at java.base/java.util.concurrent.ThreadPoolExecutor.getTask(ThreadPoolExecutor.java:1070)
at java.base/java.util.concurrent.ThreadPoolExecutor.runWorker(ThreadPoolExecutor.java:1130)
at java.base/java.util.concurrent.ThreadPoolExecutor$Worker.run(ThreadPoolExecutor.java:642)
at java.base/java.lang.Thread.run(Thread.java:1570)
18) Thread[id=2299, name=h2sc-961-thread-18, state=WAITING, group=TGRP-BasicDistributedZkTest]
at java.base/jdk.internal.misc.Unsafe.park(Native Method)
at java.base/java.util.concurrent.locks.LockSupport.park(LockSupport.java:371)
at java.base/java.util.concurrent.locks.AbstractQueuedSynchronizer$ConditionNode.block(AbstractQueuedSynchronizer.java:519)
at java.base/java.util.concurrent.ForkJoinPool.unmanagedBlock(ForkJoinPool.java:4011)
at java.base/java.util.concurrent.ForkJoinPool.managedBlock(ForkJoinPool.java:3959)
at java.base/java.util.concurrent.locks.AbstractQueuedSynchronizer$ConditionObject.await(AbstractQueuedSynchronizer.java:1707)
at org.eclipse.jetty.util.BlockingArrayQueue.take(BlockingArrayQueue.java:534)
at java.base/java.util.concurrent.ThreadPoolExecutor.getTask(ThreadPoolExecutor.java:1070)
at java.base/java.util.concurrent.ThreadPoolExecutor.runWorker(ThreadPoolExecutor.java:1130)
at java.base/java.util.concurrent.ThreadPoolExecutor$Worker.run(ThreadPoolExecutor.java:642)
at java.base/java.lang.Thread.run(Thread.java:1570)
19) Thread[id=2114, name=h2sc-961-thread-9, state=WAITING, group=TGRP-BasicDistributedZkTest]
at java.base/jdk.internal.misc.Unsafe.park(Native Method)
at java.base/java.util.concurrent.locks.LockSupport.park(LockSupport.java:371)
at java.base/java.util.concurrent.locks.AbstractQueuedSynchronizer$ConditionNode.block(AbstractQueuedSynchronizer.java:519)
at java.base/java.util.concurrent.ForkJoinPool.unmanagedBlock(ForkJoinPool.java:4011)
at java.base/java.util.concurrent.ForkJoinPool.managedBlock(ForkJoinPool.java:3959)
at java.base/java.util.concurrent.locks.AbstractQueuedSynchronizer$ConditionObject.await(AbstractQueuedSynchronizer.java:1707)
at org.eclipse.jetty.util.BlockingArrayQueue.take(BlockingArrayQueue.java:534)
at java.base/java.util.concurrent.ThreadPoolExecutor.getTask(ThreadPoolExecutor.java:1070)
at java.base/java.util.concurrent.ThreadPoolExecutor.runWorker(ThreadPoolExecutor.java:1130)
at java.base/java.util.concurrent.ThreadPoolExecutor$Worker.run(ThreadPoolExecutor.java:642)
at java.base/java.lang.Thread.run(Thread.java:1570)
20) Thread[id=2105, name=h2sc-961-thread-3, state=WAITING, group=TGRP-BasicDistributedZkTest]
at java.base/jdk.internal.misc.Unsafe.park(Native Method)
at java.base/java.util.concurrent.locks.LockSupport.park(LockSupport.java:371)
at java.base/java.util.concurrent.locks.AbstractQueuedSynchronizer$ConditionNode.block(AbstractQueuedSynchronizer.java:519)
at java.base/java.util.concurrent.ForkJoinPool.unmanagedBlock(ForkJoinPool.java:4011)
at java.base/java.util.concurrent.ForkJoinPool.managedBlock(ForkJoinPool.java:3959)
at java.base/java.util.concurrent.locks.AbstractQueuedSynchronizer$ConditionObject.await(AbstractQueuedSynchronizer.java:1707)
at org.eclipse.jetty.util.BlockingArrayQueue.take(BlockingArrayQueue.java:534)
at java.base/java.util.concurrent.ThreadPoolExecutor.getTask(ThreadPoolExecutor.java:1070)
at java.base/java.util.concurrent.ThreadPoolExecutor.runWorker(ThreadPoolExecutor.java:1130)
at java.base/java.util.concurrent.ThreadPoolExecutor$Worker.run(ThreadPoolExecutor.java:642)
at java.base/java.lang.Thread.run(Thread.java:1570)
Stack Trace:
com.carrotsearch.randomizedtesting.ThreadLeakError: 20 threads leaked from SUITE scope at org.apache.solr.cloud.BasicDistributedZkTest:
1) Thread[id=2041, name=h2sc-961-thread-1, state=RUNNABLE, group=TGRP-BasicDistributedZkTest]
at java.base/sun.nio.ch.KQueue.poll(Native Method)
at java.base/sun.nio.ch.KQueueSelectorImpl.doSelect(KQueueSelectorImpl.java:125)
at java.base/sun.nio.ch.SelectorImpl.lockAndDoSelect(SelectorImpl.java:130)
at java.base/sun.nio.ch.SelectorImpl.select(SelectorImpl.java:147)
at org.eclipse.jetty.io.ManagedSelector.nioSelect(ManagedSelector.java:182)
at org.eclipse.jetty.io.ManagedSelector.select(ManagedSelector.java:189)
at org.eclipse.jetty.io.ManagedSelector$SelectorProducer.select(ManagedSelector.java:616)
at org.eclipse.jetty.io.ManagedSelector$SelectorProducer.produce(ManagedSelector.java:550)
at org.eclipse.jetty.util.thread.strategy.AdaptiveExecutionStrategy.produceTask(AdaptiveExecutionStrategy.java:526)
at org.eclipse.jetty.util.thread.strategy.AdaptiveExecutionStrategy.tryProduce(AdaptiveExecutionStrategy.java:251)
at org.eclipse.jetty.util.thread.strategy.AdaptiveExecutionStrategy.produce(AdaptiveExecutionStrategy.java:196)
at org.apache.solr.common.util.ExecutorUtil$MDCAwareThreadPoolExecutor.lambda$execute$0(ExecutorUtil.java:408)
at java.base/java.util.concurrent.ThreadPoolExecutor.runWorker(ThreadPoolExecutor.java:1144)
at java.base/java.util.concurrent.ThreadPoolExecutor$Worker.run(ThreadPoolExecutor.java:642)
at java.base/java.lang.Thread.run(Thread.java:1570)
2) Thread[id=2111, name=h2sc-961-thread-8, state=WAITING, group=TGRP-BasicDistributedZkTest]
at java.base/jdk.internal.misc.Unsafe.park(Native Method)
at java.base/java.util.concurrent.locks.LockSupport.park(LockSupport.java:371)
at java.base/java.util.concurrent.locks.AbstractQueuedSynchronizer$ConditionNode.block(AbstractQueuedSynchronizer.java:519)
at java.base/java.util.concurrent.ForkJoinPool.unmanagedBlock(ForkJoinPool.java:4011)
at java.base/java.util.concurrent.ForkJoinPool.managedBlock(ForkJoinPool.java:3959)
at java.base/java.util.concurrent.locks.AbstractQueuedSynchronizer$ConditionObject.await(AbstractQueuedSynchronizer.java:1707)
at org.eclipse.jetty.util.BlockingArrayQueue.take(BlockingArrayQueue.java:534)
at java.base/java.util.concurrent.ThreadPoolExecutor.getTask(ThreadPoolExecutor.java:1070)
at java.base/java.util.concurrent.ThreadPoolExecutor.runWorker(ThreadPoolExecutor.java:1130)
at java.base/java.util.concurrent.ThreadPoolExecutor$Worker.run(ThreadPoolExecutor.java:642)
at java.base/java.lang.Thread.run(Thread.java:1570)
3) Thread[id=2106, name=h2sc-961-thread-4, state=WAITING, group=TGRP-BasicDistributedZkTest]
at java.base/jdk.internal.misc.Unsafe.park(Native Method)
at java.base/java.util.concurrent.locks.LockSupport.park(LockSupport.java:371)
at java.base/java.util.concurrent.locks.AbstractQueuedSynchronizer$ConditionNode.block(AbstractQueuedSynchronizer.java:519)
at java.base/java.util.concurrent.ForkJoinPool.unmanagedBlock(ForkJoinPool.java:4011)
at java.base/java.util.concurrent.ForkJoinPool.managedBlock(ForkJoinPool.java:3959)
at java.base/java.util.concurrent.locks.AbstractQueuedSynchronizer$ConditionObject.await(AbstractQueuedSynchronizer.java:1707)
at org.eclipse.jetty.util.BlockingArrayQueue.take(BlockingArrayQueue.java:534)
at java.base/java.util.concurrent.ThreadPoolExecutor.getTask(ThreadPoolExecutor.java:1070)
at java.base/java.util.concurrent.ThreadPoolExecutor.runWorker(ThreadPoolExecutor.java:1130)
at java.base/java.util.concurrent.ThreadPoolExecutor$Worker.run(ThreadPoolExecutor.java:642)
at java.base/java.lang.Thread.run(Thread.java:1570)
4) Thread[id=2109, name=h2sc-961-thread-6, state=WAITING, group=TGRP-BasicDistributedZkTest]
at java.base/jdk.internal.misc.Unsafe.park(Native Method)
at java.base/java.util.concurrent.locks.LockSupport.park(LockSupport.java:371)
at java.base/java.util.concurrent.locks.AbstractQueuedSynchronizer$ConditionNode.block(AbstractQueuedSynchronizer.java:519)
at java.base/java.util.concurrent.ForkJoinPool.unmanagedBlock(ForkJoinPool.java:4011)
at java.base/java.util.concurrent.ForkJoinPool.managedBlock(ForkJoinPool.java:3959)
at java.base/java.util.concurrent.locks.AbstractQueuedSynchronizer$ConditionObject.await(AbstractQueuedSynchronizer.java:1707)
at org.eclipse.jetty.util.BlockingArrayQueue.take(BlockingArrayQueue.java:534)
at java.base/java.util.concurrent.ThreadPoolExecutor.getTask(ThreadPoolExecutor.java:1070)
at java.base/java.util.concurrent.ThreadPoolExecutor.runWorker(ThreadPoolExecutor.java:1130)
at java.base/java.util.concurrent.ThreadPoolExecutor$Worker.run(ThreadPoolExecutor.java:642)
at java.base/java.lang.Thread.run(Thread.java:1570)
5) Thread[id=2298, name=h2sc-961-thread-17, state=WAITING, group=TGRP-BasicDistributedZkTest]
at java.base/jdk.internal.misc.Unsafe.park(Native Method)
at java.base/java.util.concurrent.locks.LockSupport.park(LockSupport.java:371)
at java.base/java.util.concurrent.locks.AbstractQueuedSynchronizer$ConditionNode.block(AbstractQueuedSynchronizer.java:519)
at java.base/java.util.concurrent.ForkJoinPool.unmanagedBlock(ForkJoinPool.java:4011)
at java.base/java.util.concurrent.ForkJoinPool.managedBlock(ForkJoinPool.java:3959)
at java.base/java.util.concurrent.locks.AbstractQueuedSynchronizer$ConditionObject.await(AbstractQueuedSynchronizer.java:1707)
at org.eclipse.jetty.util.BlockingArrayQueue.take(BlockingArrayQueue.java:534)
at java.base/java.util.concurrent.ThreadPoolExecutor.getTask(ThreadPoolExecutor.java:1070)
at java.base/java.util.concurrent.ThreadPoolExecutor.runWorker(ThreadPoolExecutor.java:1130)
at java.base/java.util.concurrent.ThreadPoolExecutor$Worker.run(ThreadPoolExecutor.java:642)
at java.base/java.lang.Thread.run(Thread.java:1570)
6) Thread[id=2195, name=h2sc-961-thread-11, state=WAITING, group=TGRP-BasicDistributedZkTest]
at java.base/jdk.internal.misc.Unsafe.park(Native Method)
at java.base/java.util.concurrent.locks.LockSupport.park(LockSupport.java:371)
at java.base/java.util.concurrent.locks.AbstractQueuedSynchronizer$ConditionNode.block(AbstractQueuedSynchronizer.java:519)
at java.base/java.util.concurrent.ForkJoinPool.unmanagedBlock(ForkJoinPool.java:4011)
at java.base/java.util.concurrent.ForkJoinPool.managedBlock(ForkJoinPool.java:3959)
at java.base/java.util.concurrent.locks.AbstractQueuedSynchronizer$ConditionObject.await(AbstractQueuedSynchronizer.java:1707)
at org.eclipse.jetty.util.BlockingArrayQueue.take(BlockingArrayQueue.java:534)
at java.base/java.util.concurrent.ThreadPoolExecutor.getTask(ThreadPoolExecutor.java:1070)
at java.base/java.util.concurrent.ThreadPoolExecutor.runWorker(ThreadPoolExecutor.java:1130)
at java.base/java.util.concurrent.ThreadPoolExecutor$Worker.run(ThreadPoolExecutor.java:642)
at java.base/java.lang.Thread.run(Thread.java:1570)
7) Thread[id=2107, name=HttpClient@18cbc4cd-scheduler-1, state=TIMED_WAITING, group=TGRP-BasicDistributedZkTest]
at java.base/jdk.internal.misc.Unsafe.park(Native Method)
at java.base/java.util.concurrent.locks.LockSupport.parkNanos(LockSupport.java:269)
at java.base/java.util.concurrent.locks.AbstractQueuedSynchronizer$ConditionObject.awaitNanos(AbstractQueuedSynchronizer.java:1758)
at java.base/java.util.concurrent.ScheduledThreadPoolExecutor$DelayedWorkQueue.take(ScheduledThreadPoolExecutor.java:1182)
at java.base/java.util.concurrent.ScheduledThreadPoolExecutor$DelayedWorkQueue.take(ScheduledThreadPoolExecutor.java:899)
at java.base/java.util.concurrent.ThreadPoolExecutor.getTask(ThreadPoolExecutor.java:1070)
at java.base/java.util.concurrent.ThreadPoolExecutor.runWorker(ThreadPoolExecutor.java:1130)
at java.base/java.util.concurrent.ThreadPoolExecutor$Worker.run(ThreadPoolExecutor.java:642)
at java.base/java.lang.Thread.run(Thread.java:1570)
8) Thread[id=2205, name=h2sc-961-thread-15, state=WAITING, group=TGRP-BasicDistributedZkTest]
at java.base/jdk.internal.misc.Unsafe.park(Native Method)
at java.base/java.util.concurrent.locks.LockSupport.park(LockSupport.java:371)
at java.base/java.util.concurrent.locks.AbstractQueuedSynchronizer$ConditionNode.block(AbstractQueuedSynchronizer.java:519)
at java.base/java.util.concurrent.ForkJoinPool.unmanagedBlock(ForkJoinPool.java:4011)
at java.base/java.util.concurrent.ForkJoinPool.managedBlock(ForkJoinPool.java:3959)
at java.base/java.util.concurrent.locks.AbstractQueuedSynchronizer$ConditionObject.await(AbstractQueuedSynchronizer.java:1707)
at org.eclipse.jetty.util.BlockingArrayQueue.take(BlockingArrayQueue.java:534)
at java.base/java.util.concurrent.ThreadPoolExecutor.getTask(ThreadPoolExecutor.java:1070)
at java.base/java.util.concurrent.ThreadPoolExecutor.runWorker(ThreadPoolExecutor.java:1130)
at java.base/java.util.concurrent.ThreadPoolExecutor$Worker.run(ThreadPoolExecutor.java:642)
at java.base/java.lang.Thread.run(Thread.java:1570)
9) Thread[id=2040, name=h2sc-960-thread-2, state=RUNNABLE, group=TGRP-BasicDistributedZkTest]
at java.base/sun.nio.ch.KQueue.poll(Native Method)
at java.base/sun.nio.ch.KQueueSelectorImpl.doSelect(KQueueSelectorImpl.java:125)
at java.base/sun.nio.ch.SelectorImpl.lockAndDoSelect(SelectorImpl.java:130)
at java.base/sun.nio.ch.SelectorImpl.select(SelectorImpl.java:147)
at org.eclipse.jetty.io.ManagedSelector.nioSelect(ManagedSelector.java:182)
at org.eclipse.jetty.io.ManagedSelector.select(ManagedSelector.java:189)
at org.eclipse.jetty.io.ManagedSelector$SelectorProducer.select(ManagedSelector.java:616)
at org.eclipse.jetty.io.ManagedSelector$SelectorProducer.produce(ManagedSelector.java:550)
at org.eclipse.jetty.util.thread.strategy.AdaptiveExecutionStrategy.produceTask(AdaptiveExecutionStrategy.java:526)
at org.eclipse.jetty.util.thread.strategy.AdaptiveExecutionStrategy.tryProduce(AdaptiveExecutionStrategy.java:251)
at org.eclipse.jetty.util.thread.strategy.AdaptiveExecutionStrategy.produce(AdaptiveExecutionStrategy.java:196)
at org.apache.solr.common.util.ExecutorUtil$MDCAwareThreadPoolExecutor.lambda$execute$0(ExecutorUtil.java:408)
at java.base/java.util.concurrent.ThreadPoolExecutor.runWorker(ThreadPoolExecutor.java:1144)
at java.base/java.util.concurrent.ThreadPoolExecutor$Worker.run(ThreadPoolExecutor.java:642)
at java.base/java.lang.Thread.run(Thread.java:1570)
10) Thread[id=2201, name=h2sc-961-thread-13, state=WAITING, group=TGRP-BasicDistributedZkTest]
at java.base/jdk.internal.misc.Unsafe.park(Native Method)
at java.base/java.util.concurrent.locks.LockSupport.park(LockSupport.java:371)
at java.base/java.util.concurrent.locks.AbstractQueuedSynchronizer$ConditionNode.block(AbstractQueuedSynchronizer.java:519)
at java.base/java.util.concurrent.ForkJoinPool.unmanagedBlock(ForkJoinPool.java:4011)
at java.base/java.util.concurrent.ForkJoinPool.managedBlock(ForkJoinPool.java:3959)
at java.base/java.util.concurrent.locks.AbstractQueuedSynchronizer$ConditionObject.await(AbstractQueuedSynchronizer.java:1707)
at org.eclipse.jetty.util.BlockingArrayQueue.take(BlockingArrayQueue.java:534)
at java.base/java.util.concurrent.ThreadPoolExecutor.getTask(ThreadPoolExecutor.java:1070)
at java.base/java.util.concurrent.ThreadPoolExecutor.runWorker(ThreadPoolExecutor.java:1130)
at java.base/java.util.concurrent.ThreadPoolExecutor$Worker.run(ThreadPoolExecutor.java:642)
at java.base/java.lang.Thread.run(Thread.java:1570)
11) Thread[id=2110, name=h2sc-961-thread-7, state=WAITING, group=TGRP-BasicDistributedZkTest]
at java.base/jdk.internal.misc.Unsafe.park(Native Method)
at java.base/java.util.concurrent.locks.LockSupport.park(LockSupport.java:371)
at java.base/java.util.concurrent.locks.AbstractQueuedSynchronizer$ConditionNode.block(AbstractQueuedSynchronizer.java:519)
at java.base/java.util.concurrent.ForkJoinPool.unmanagedBlock(ForkJoinPool.java:4011)
at java.base/java.util.concurrent.ForkJoinPool.managedBlock(ForkJoinPool.java:3959)
at java.base/java.util.concurrent.locks.AbstractQueuedSynchronizer$ConditionObject.await(AbstractQueuedSynchronizer.java:1707)
at org.eclipse.jetty.util.BlockingArrayQueue.take(BlockingArrayQueue.java:534)
at java.base/java.util.concurrent.ThreadPoolExecutor.getTask(ThreadPoolExecutor.java:1070)
at java.base/java.util.concurrent.ThreadPoolExecutor.runWorker(ThreadPoolExecutor.java:1130)
at java.base/java.util.concurrent.ThreadPoolExecutor$Worker.run(ThreadPoolExecutor.java:642)
at java.base/java.lang.Thread.run(Thread.java:1570)
12) Thread[id=2042, name=h2sc-961-thread-2, state=RUNNABLE, group=TGRP-BasicDistributedZkTest]
at java.base/sun.nio.ch.KQueue.poll(Native Method)
at java.base/sun.nio.ch.KQueueSelectorImpl.doSelect(KQueueSelectorImpl.java:125)
at java.base/sun.nio.ch.SelectorImpl.lockAndDoSelect(SelectorImpl.java:130)
at java.base/sun.nio.ch.SelectorImpl.select(SelectorImpl.java:147)
at org.eclipse.jetty.io.ManagedSelector.nioSelect(ManagedSelector.java:182)
at org.eclipse.jetty.io.ManagedSelector.select(ManagedSelector.java:189)
at org.eclipse.jetty.io.ManagedSelector$SelectorProducer.select(ManagedSelector.java:616)
at org.eclipse.jetty.io.ManagedSelector$SelectorProducer.produce(ManagedSelector.java:550)
at org.eclipse.jetty.util.thread.strategy.AdaptiveExecutionStrategy.produceTask(AdaptiveExecutionStrategy.java:526)
at org.eclipse.jetty.util.thread.strategy.AdaptiveExecutionStrategy.tryProduce(AdaptiveExecutionStrategy.java:251)
at org.eclipse.jetty.util.thread.strategy.AdaptiveExecutionStrategy.produce(AdaptiveExecutionStrategy.java:196)
at org.apache.solr.common.util.ExecutorUtil$MDCAwareThreadPoolExecutor.lambda$execute$0(ExecutorUtil.java:408)
at java.base/java.util.concurrent.ThreadPoolExecutor.runWorker(ThreadPoolExecutor.java:1144)
at java.base/java.util.concurrent.ThreadPoolExecutor$Worker.run(ThreadPoolExecutor.java:642)
at java.base/java.lang.Thread.run(Thread.java:1570)
13) Thread[id=2108, name=h2sc-961-thread-5, state=WAITING, group=TGRP-BasicDistributedZkTest]
at java.base/jdk.internal.misc.Unsafe.park(Native Method)
at java.base/java.util.concurrent.locks.LockSupport.park(LockSupport.java:371)
at java.base/java.util.concurrent.locks.AbstractQueuedSynchronizer$ConditionNode.block(AbstractQueuedSynchronizer.java:519)
at java.base/java.util.concurrent.ForkJoinPool.unmanagedBlock(ForkJoinPool.java:4011)
at java.base/java.util.concurrent.ForkJoinPool.managedBlock(ForkJoinPool.java:3959)
at java.base/java.util.concurrent.locks.AbstractQueuedSynchronizer$ConditionObject.await(AbstractQueuedSynchronizer.java:1707)
at org.eclipse.jetty.util.BlockingArrayQueue.take(BlockingArrayQueue.java:534)
at java.base/java.util.concurrent.ThreadPoolExecutor.getTask(ThreadPoolExecutor.java:1070)
at java.base/java.util.concurrent.ThreadPoolExecutor.runWorker(ThreadPoolExecutor.java:1130)
at java.base/java.util.concurrent.ThreadPoolExecutor$Worker.run(ThreadPoolExecutor.java:642)
at java.base/java.lang.Thread.run(Thread.java:1570)
14) Thread[id=2202, name=h2sc-961-thread-14, state=WAITING, group=TGRP-BasicDistributedZkTest]
at java.base/jdk.internal.misc.Unsafe.park(Native Method)
at java.base/java.util.concurrent.locks.LockSupport.park(LockSupport.java:371)
at java.base/java.util.concurrent.locks.AbstractQueuedSynchronizer$ConditionNode.block(AbstractQueuedSynchronizer.java:519)
at java.base/java.util.concurrent.ForkJoinPool.unmanagedBlock(ForkJoinPool.java:4011)
at java.base/java.util.concurrent.ForkJoinPool.managedBlock(ForkJoinPool.java:3959)
at java.base/java.util.concurrent.locks.AbstractQueuedSynchronizer$ConditionObject.await(AbstractQueuedSynchronizer.java:1707)
at org.eclipse.jetty.util.BlockingArrayQueue.take(BlockingArrayQueue.java:534)
at java.base/java.util.concurrent.ThreadPoolExecutor.getTask(ThreadPoolExecutor.java:1070)
at java.base/java.util.concurrent.ThreadPoolExecutor.runWorker(ThreadPoolExecutor.java:1130)
at java.base/java.util.concurrent.ThreadPoolExecutor$Worker.run(ThreadPoolExecutor.java:642)
at java.base/java.lang.Thread.run(Thread.java:1570)
15) Thread[id=2115, name=h2sc-961-thread-10, state=WAITING, group=TGRP-BasicDistributedZkTest]
at java.base/jdk.internal.misc.Unsafe.park(Native Method)
at java.base/java.util.concurrent.locks.LockSupport.park(LockSupport.java:371)
at java.base/java.util.concurrent.locks.AbstractQueuedSynchronizer$ConditionNode.block(AbstractQueuedSynchronizer.java:519)
at java.base/java.util.concurrent.ForkJoinPool.unmanagedBlock(ForkJoinPool.java:4011)
at java.base/java.util.concurrent.ForkJoinPool.managedBlock(ForkJoinPool.java:3959)
at java.base/java.util.concurrent.locks.AbstractQueuedSynchronizer$ConditionObject.await(AbstractQueuedSynchronizer.java:1707)
at org.eclipse.jetty.util.BlockingArrayQueue.take(BlockingArrayQueue.java:534)
at java.base/java.util.concurrent.ThreadPoolExecutor.getTask(ThreadPoolExecutor.java:1070)
at java.base/java.util.concurrent.ThreadPoolExecutor.runWorker(ThreadPoolExecutor.java:1130)
at java.base/java.util.concurrent.ThreadPoolExecutor$Worker.run(ThreadPoolExecutor.java:642)
at java.base/java.lang.Thread.run(Thread.java:1570)
16) Thread[id=2196, name=h2sc-961-thread-12, state=WAITING, group=TGRP-BasicDistributedZkTest]
at java.base/jdk.internal.misc.Unsafe.park(Native Method)
at java.base/java.util.concurrent.locks.LockSupport.park(LockSupport.java:371)
at java.base/java.util.concurrent.locks.AbstractQueuedSynchronizer$ConditionNode.block(AbstractQueuedSynchronizer.java:519)
at java.base/java.util.concurrent.ForkJoinPool.unmanagedBlock(ForkJoinPool.java:4011)
at java.base/java.util.concurrent.ForkJoinPool.managedBlock(ForkJoinPool.java:3959)
at java.base/java.util.concurrent.locks.AbstractQueuedSynchronizer$ConditionObject.await(AbstractQueuedSynchronizer.java:1707)
at org.eclipse.jetty.util.BlockingArrayQueue.take(BlockingArrayQueue.java:534)
at java.base/java.util.concurrent.ThreadPoolExecutor.getTask(ThreadPoolExecutor.java:1070)
at java.base/java.util.concurrent.ThreadPoolExecutor.runWorker(ThreadPoolExecutor.java:1130)
at java.base/java.util.concurrent.ThreadPoolExecutor$Worker.run(ThreadPoolExecutor.java:642)
at java.base/java.lang.Thread.run(Thread.java:1570)
17) Thread[id=2207, name=h2sc-961-thread-16, state=WAITING, group=TGRP-BasicDistributedZkTest]
at java.base/jdk.internal.misc.Unsafe.park(Native Method)
at java.base/java.util.concurrent.locks.LockSupport.park(LockSupport.java:371)
at java.base/java.util.concurrent.locks.AbstractQueuedSynchronizer$ConditionNode.block(AbstractQueuedSynchronizer.java:519)
at java.base/java.util.concurrent.ForkJoinPool.unmanagedBlock(ForkJoinPool.java:4011)
at java.base/java.util.concurrent.ForkJoinPool.managedBlock(ForkJoinPool.java:3959)
at java.base/java.util.concurrent.locks.AbstractQueuedSynchronizer$ConditionObject.await(AbstractQueuedSynchronizer.java:1707)
at org.eclipse.jetty.util.BlockingArrayQueue.take(BlockingArrayQueue.java:534)
at java.base/java.util.concurrent.ThreadPoolExecutor.getTask(ThreadPoolExecutor.java:1070)
at java.base/java.util.concurrent.ThreadPoolExecutor.runWorker(ThreadPoolExecutor.java:1130)
at java.base/java.util.concurrent.ThreadPoolExecutor$Worker.run(ThreadPoolExecutor.java:642)
at java.base/java.lang.Thread.run(Thread.java:1570)
18) Thread[id=2299, name=h2sc-961-thread-18, state=WAITING, group=TGRP-BasicDistributedZkTest]
at java.base/jdk.internal.misc.Unsafe.park(Native Method)
at java.base/java.util.concurrent.locks.LockSupport.park(LockSupport.java:371)
at java.base/java.util.concurrent.locks.AbstractQueuedSynchronizer$ConditionNode.block(AbstractQueuedSynchronizer.java:519)
at java.base/java.util.concurrent.ForkJoinPool.unmanagedBlock(ForkJoinPool.java:4011)
at java.base/java.util.concurrent.ForkJoinPool.managedBlock(ForkJoinPool.java:3959)
at java.base/java.util.concurrent.locks.AbstractQueuedSynchronizer$ConditionObject.await(AbstractQueuedSynchronizer.java:1707)
at org.eclipse.jetty.util.BlockingArrayQueue.take(BlockingArrayQueue.java:534)
at java.base/java.util.concurrent.ThreadPoolExecutor.getTask(ThreadPoolExecutor.java:1070)
at java.base/java.util.concurrent.ThreadPoolExecutor.runWorker(ThreadPoolExecutor.java:1130)
at java.base/java.util.concurrent.ThreadPoolExecutor$Worker.run(ThreadPoolExecutor.java:642)
at java.base/java.lang.Thread.run(Thread.java:1570)
19) Thread[id=2114, name=h2sc-961-thread-9, state=WAITING, group=TGRP-BasicDistributedZkTest]
at java.base/jdk.internal.misc.Unsafe.park(Native Method)
at java.base/java.util.concurrent.locks.LockSupport.park(LockSupport.java:371)
at java.base/java.util.concurrent.locks.AbstractQueuedSynchronizer$ConditionNode.block(AbstractQueuedSynchronizer.java:519)
at java.base/java.util.concurrent.ForkJoinPool.unmanagedBlock(ForkJoinPool.java:4011)
at java.base/java.util.concurrent.ForkJoinPool.managedBlock(ForkJoinPool.java:3959)
at java.base/java.util.concurrent.locks.AbstractQueuedSynchronizer$ConditionObject.await(AbstractQueuedSynchronizer.java:1707)
at org.eclipse.jetty.util.BlockingArrayQueue.take(BlockingArrayQueue.java:534)
at java.base/java.util.concurrent.ThreadPoolExecutor.getTask(ThreadPoolExecutor.java:1070)
at java.base/java.util.concurrent.ThreadPoolExecutor.runWorker(ThreadPoolExecutor.java:1130)
at java.base/java.util.concurrent.ThreadPoolExecutor$Worker.run(ThreadPoolExecutor.java:642)
at java.base/java.lang.Thread.run(Thread.java:1570)
20) Thread[id=2105, name=h2sc-961-thread-3, state=WAITING, group=TGRP-BasicDistributedZkTest]
at java.base/jdk.internal.misc.Unsafe.park(Native Method)
at java.base/java.util.concurrent.locks.LockSupport.park(LockSupport.java:371)
at java.base/java.util.concurrent.locks.AbstractQueuedSynchronizer$ConditionNode.block(AbstractQueuedSynchronizer.java:519)
at java.base/java.util.concurrent.ForkJoinPool.unmanagedBlock(ForkJoinPool.java:4011)
at java.base/java.util.concurrent.ForkJoinPool.managedBlock(ForkJoinPool.java:3959)
at java.base/java.util.concurrent.locks.AbstractQueuedSynchronizer$ConditionObject.await(AbstractQueuedSynchronizer.java:1707)
at org.eclipse.jetty.util.BlockingArrayQueue.take(BlockingArrayQueue.java:534)
at java.base/java.util.concurrent.ThreadPoolExecutor.getTask(ThreadPoolExecutor.java:1070)
at java.base/java.util.concurrent.ThreadPoolExecutor.runWorker(ThreadPoolExecutor.java:1130)
at java.base/java.util.concurrent.ThreadPoolExecutor$Worker.run(ThreadPoolExecutor.java:642)
at java.base/java.lang.Thread.run(Thread.java:1570)
at __randomizedtesting.SeedInfo.seed([8D0B196182C3C1A2]:0)
FAILED: org.apache.solr.opentelemetry.TestDistributedTracing.testV2Api
Error Message:
org.junit.ComparisonFailure: expected:<[post:/collections/{collection}/reloa]d> but was:<[ReloadCollectionCm]d>
Stack Trace:
org.junit.ComparisonFailure: expected:<[post:/collections/{collection}/reloa]d> but was:<[ReloadCollectionCm]d>
at __randomizedtesting.SeedInfo.seed([8D0B196182C3C1A2:CDED90B812F3FA4B]:0)
at org.junit.Assert.assertEquals(Assert.java:117)
at org.junit.Assert.assertEquals(Assert.java:146)
at org.apache.solr.opentelemetry.TestDistributedTracing.testV2Api(TestDistributedTracing.java:161)
at java.base/jdk.internal.reflect.DirectMethodHandleAccessor.invoke(DirectMethodHandleAccessor.java:103)
at java.base/java.lang.reflect.Method.invoke(Method.java:580)
at com.carrotsearch.randomizedtesting.RandomizedRunner.invoke(RandomizedRunner.java:1763)
at com.carrotsearch.randomizedtesting.RandomizedRunner$8.evaluate(RandomizedRunner.java:946)
at com.carrotsearch.randomizedtesting.RandomizedRunner$9.evaluate(RandomizedRunner.java:982)
at com.carrotsearch.randomizedtesting.RandomizedRunner$10.evaluate(RandomizedRunner.java:996)
at com.carrotsearch.randomizedtesting.rules.SystemPropertiesRestoreRule$1.evaluate(SystemPropertiesRestoreRule.java:80)
at org.junit.rules.RunRules.evaluate(RunRules.java:20)
at org.apache.lucene.tests.util.TestRuleSetupTeardownChained$1.evaluate(TestRuleSetupTeardownChained.java:48)
at org.apache.lucene.tests.util.AbstractBeforeAfterRule$1.evaluate(AbstractBeforeAfterRule.java:43)
at org.apache.lucene.tests.util.TestRuleThreadAndTestName$1.evaluate(TestRuleThreadAndTestName.java:45)
at org.apache.lucene.tests.util.TestRuleIgnoreAfterMaxFailures$1.evaluate(TestRuleIgnoreAfterMaxFailures.java:60)
at org.apache.lucene.tests.util.TestRuleMarkFailure$1.evaluate(TestRuleMarkFailure.java:44)
at org.junit.rules.RunRules.evaluate(RunRules.java:20)
at com.carrotsearch.randomizedtesting.rules.StatementAdapter.evaluate(StatementAdapter.java:36)
at com.carrotsearch.randomizedtesting.ThreadLeakControl$StatementRunner.run(ThreadLeakControl.java:390)
at com.carrotsearch.randomizedtesting.ThreadLeakControl.forkTimeoutingTask(ThreadLeakControl.java:843)
at com.carrotsearch.randomizedtesting.ThreadLeakControl$3.evaluate(ThreadLeakControl.java:490)
at com.carrotsearch.randomizedtesting.RandomizedRunner.runSingleTest(RandomizedRunner.java:955)
at com.carrotsearch.randomizedtesting.RandomizedRunner$5.evaluate(RandomizedRunner.java:840)
at com.carrotsearch.randomizedtesting.RandomizedRunner$6.evaluate(RandomizedRunner.java:891)
at com.carrotsearch.randomizedtesting.RandomizedRunner$7.evaluate(RandomizedRunner.java:902)
at com.carrotsearch.randomizedtesting.rules.StatementAdapter.evaluate(StatementAdapter.java:36)
at com.carrotsearch.randomizedtesting.rules.StatementAdapter.evaluate(StatementAdapter.java:36)
at org.apache.lucene.tests.util.AbstractBeforeAfterRule$1.evaluate(AbstractBeforeAfterRule.java:43)
at com.carrotsearch.randomizedtesting.rules.SystemPropertiesRestoreRule$1.evaluate(SystemPropertiesRestoreRule.java:80)
at org.junit.rules.RunRules.evaluate(RunRules.java:20)
at org.apache.lucene.tests.util.AbstractBeforeAfterRule$1.evaluate(AbstractBeforeAfterRule.java:43)
at com.carrotsearch.randomizedtesting.rules.StatementAdapter.evaluate(StatementAdapter.java:36)
at org.apache.lucene.tests.util.TestRuleStoreClassName$1.evaluate(TestRuleStoreClassName.java:38)
at com.carrotsearch.randomizedtesting.rules.NoShadowingOrOverridesOnMethodsRule$1.evaluate(NoShadowingOrOverridesOnMethodsRule.java:40)
at com.carrotsearch.randomizedtesting.rules.NoShadowingOrOverridesOnMethodsRule$1.evaluate(NoShadowingOrOverridesOnMethodsRule.java:40)
at com.carrotsearch.randomizedtesting.rules.StatementAdapter.evaluate(StatementAdapter.java:36)
at com.carrotsearch.randomizedtesting.rules.StatementAdapter.evaluate(StatementAdapter.java:36)
at org.apache.lucene.tests.util.TestRuleAssertionsRequired$1.evaluate(TestRuleAssertionsRequired.java:53)
at org.apache.lucene.tests.util.AbstractBeforeAfterRule$1.evaluate(AbstractBeforeAfterRule.java:43)
at org.apache.lucene.tests.util.TestRuleMarkFailure$1.evaluate(TestRuleMarkFailure.java:44)
at org.apache.lucene.tests.util.TestRuleIgnoreAfterMaxFailures$1.evaluate(TestRuleIgnoreAfterMaxFailures.java:60)
at org.apache.lucene.tests.util.TestRuleIgnoreTestSuites$1.evaluate(TestRuleIgnoreTestSuites.java:47)
at org.junit.rules.RunRules.evaluate(RunRules.java:20)
at com.carrotsearch.randomizedtesting.rules.StatementAdapter.evaluate(StatementAdapter.java:36)
at com.carrotsearch.randomizedtesting.ThreadLeakControl$StatementRunner.run(ThreadLeakControl.java:390)
at com.carrotsearch.randomizedtesting.ThreadLeakControl.lambda$forkTimeoutingTask$0(ThreadLeakControl.java:850)
at java.base/java.lang.Thread.run(Thread.java:1570)
FAILED: org.apache.solr.client.solrj.impl.LB2SolrClientTest.testTimeoutExceptionMarksServerAsZombieAsyncRequest
Error Message:
java.lang.Exception: Test abandoned because suite timeout was reached.
Stack Trace:
java.lang.Exception: Test abandoned because suite timeout was reached.
at __randomizedtesting.SeedInfo.seed([8D0B196182C3C1A2]:0)
FAILED: org.apache.solr.client.solrj.impl.LB2SolrClientTest.classMethod
Error Message:
java.lang.Exception: Suite timeout exceeded (>= 7200000 msec).
Stack Trace:
java.lang.Exception: Suite timeout exceeded (>= 7200000 msec).
at __randomizedtesting.SeedInfo.seed([8D0B196182C3C1A2]:0)
[JENKINS] Solr-main-macOS (64bit/hotspot/jdk-23.0.2) - Build # 9451 - Still Unstable!
Posted by Policeman Jenkins Server via builds <bu...@solr.apache.org>.
Build: https://jenkins.thetaphi.de/job/Solr-main-macOS/9451/
Java: 64bit/hotspot/jdk-23.0.2 -XX:-UseCompressedOops -XX:+UseParallelGC
2 tests failed.
FAILED: org.apache.solr.cloud.ReplicationFactorTest.test
Error Message:
org.apache.solr.client.solrj.SolrServerException: java.nio.channels.ClosedChannelException
Stack Trace:
org.apache.solr.client.solrj.SolrServerException: java.nio.channels.ClosedChannelException
at __randomizedtesting.SeedInfo.seed([6548C039C6A62587:ED1CFFE3685A487F]:0)
at app//org.apache.solr.client.solrj.impl.LBSolrClient.doRequest(LBSolrClient.java:680)
at app//org.apache.solr.client.solrj.impl.LBSolrClient.request(LBSolrClient.java:582)
at app//org.apache.solr.client.solrj.impl.CloudSolrClient.sendRequest(CloudSolrClient.java:1085)
at app//org.apache.solr.client.solrj.impl.CloudSolrClient.requestWithRetryOnStaleState(CloudSolrClient.java:720)
at app//org.apache.solr.client.solrj.impl.CloudSolrClient.request(CloudSolrClient.java:642)
at app//org.apache.solr.cloud.ReplicationFactorTest.runAndGetAchievedRf(ReplicationFactorTest.java:495)
at app//org.apache.solr.cloud.ReplicationFactorTest.sendDoc(ReplicationFactorTest.java:490)
at app//org.apache.solr.cloud.ReplicationFactorTest.testRf3(ReplicationFactorTest.java:313)
at app//org.apache.solr.cloud.ReplicationFactorTest.test(ReplicationFactorTest.java:88)
at java.base@23.0.2/jdk.internal.reflect.DirectMethodHandleAccessor.invoke(DirectMethodHandleAccessor.java:103)
at java.base@23.0.2/java.lang.reflect.Method.invoke(Method.java:580)
at app//com.carrotsearch.randomizedtesting.RandomizedRunner.invoke(RandomizedRunner.java:1763)
at app//com.carrotsearch.randomizedtesting.RandomizedRunner$8.evaluate(RandomizedRunner.java:946)
at app//com.carrotsearch.randomizedtesting.RandomizedRunner$9.evaluate(RandomizedRunner.java:982)
at app//com.carrotsearch.randomizedtesting.RandomizedRunner$10.evaluate(RandomizedRunner.java:996)
at app//org.apache.solr.BaseDistributedSearchTestCase$ShardsRepeatRule$ShardsFixedStatement.callStatement(BaseDistributedSearchTestCase.java:1071)
at app//org.apache.solr.BaseDistributedSearchTestCase$ShardsRepeatRule$ShardsStatement.evaluate(BaseDistributedSearchTestCase.java:1042)
at app//com.carrotsearch.randomizedtesting.rules.SystemPropertiesRestoreRule$1.evaluate(SystemPropertiesRestoreRule.java:80)
at app//org.junit.rules.RunRules.evaluate(RunRules.java:20)
at app//org.apache.lucene.tests.util.TestRuleSetupTeardownChained$1.evaluate(TestRuleSetupTeardownChained.java:48)
at app//org.apache.lucene.tests.util.AbstractBeforeAfterRule$1.evaluate(AbstractBeforeAfterRule.java:43)
at app//org.apache.lucene.tests.util.TestRuleThreadAndTestName$1.evaluate(TestRuleThreadAndTestName.java:45)
at app//org.apache.lucene.tests.util.TestRuleIgnoreAfterMaxFailures$1.evaluate(TestRuleIgnoreAfterMaxFailures.java:60)
at app//org.apache.lucene.tests.util.TestRuleMarkFailure$1.evaluate(TestRuleMarkFailure.java:44)
at app//org.junit.rules.RunRules.evaluate(RunRules.java:20)
at app//com.carrotsearch.randomizedtesting.rules.StatementAdapter.evaluate(StatementAdapter.java:36)
at app//com.carrotsearch.randomizedtesting.ThreadLeakControl$StatementRunner.run(ThreadLeakControl.java:390)
at app//com.carrotsearch.randomizedtesting.ThreadLeakControl.forkTimeoutingTask(ThreadLeakControl.java:843)
at app//com.carrotsearch.randomizedtesting.ThreadLeakControl$3.evaluate(ThreadLeakControl.java:490)
at app//com.carrotsearch.randomizedtesting.RandomizedRunner.runSingleTest(RandomizedRunner.java:955)
at app//com.carrotsearch.randomizedtesting.RandomizedRunner$5.evaluate(RandomizedRunner.java:840)
at app//com.carrotsearch.randomizedtesting.RandomizedRunner$6.evaluate(RandomizedRunner.java:891)
at app//com.carrotsearch.randomizedtesting.RandomizedRunner$7.evaluate(RandomizedRunner.java:902)
at app//com.carrotsearch.randomizedtesting.rules.StatementAdapter.evaluate(StatementAdapter.java:36)
at app//com.carrotsearch.randomizedtesting.rules.StatementAdapter.evaluate(StatementAdapter.java:36)
at app//org.apache.lucene.tests.util.AbstractBeforeAfterRule$1.evaluate(AbstractBeforeAfterRule.java:43)
at app//com.carrotsearch.randomizedtesting.rules.SystemPropertiesRestoreRule$1.evaluate(SystemPropertiesRestoreRule.java:80)
at app//org.junit.rules.RunRules.evaluate(RunRules.java:20)
at app//org.apache.lucene.tests.util.AbstractBeforeAfterRule$1.evaluate(AbstractBeforeAfterRule.java:43)
at app//com.carrotsearch.randomizedtesting.rules.StatementAdapter.evaluate(StatementAdapter.java:36)
at app//org.apache.lucene.tests.util.TestRuleStoreClassName$1.evaluate(TestRuleStoreClassName.java:38)
at app//com.carrotsearch.randomizedtesting.rules.NoShadowingOrOverridesOnMethodsRule$1.evaluate(NoShadowingOrOverridesOnMethodsRule.java:40)
at app//com.carrotsearch.randomizedtesting.rules.NoShadowingOrOverridesOnMethodsRule$1.evaluate(NoShadowingOrOverridesOnMethodsRule.java:40)
at app//com.carrotsearch.randomizedtesting.rules.StatementAdapter.evaluate(StatementAdapter.java:36)
at app//com.carrotsearch.randomizedtesting.rules.StatementAdapter.evaluate(StatementAdapter.java:36)
at app//org.apache.lucene.tests.util.TestRuleAssertionsRequired$1.evaluate(TestRuleAssertionsRequired.java:53)
at app//org.apache.lucene.tests.util.AbstractBeforeAfterRule$1.evaluate(AbstractBeforeAfterRule.java:43)
at app//org.apache.lucene.tests.util.TestRuleMarkFailure$1.evaluate(TestRuleMarkFailure.java:44)
at app//org.apache.lucene.tests.util.TestRuleIgnoreAfterMaxFailures$1.evaluate(TestRuleIgnoreAfterMaxFailures.java:60)
at app//org.apache.lucene.tests.util.TestRuleIgnoreTestSuites$1.evaluate(TestRuleIgnoreTestSuites.java:47)
at app//org.junit.rules.RunRules.evaluate(RunRules.java:20)
at app//com.carrotsearch.randomizedtesting.rules.StatementAdapter.evaluate(StatementAdapter.java:36)
at app//com.carrotsearch.randomizedtesting.ThreadLeakControl$StatementRunner.run(ThreadLeakControl.java:390)
at app//com.carrotsearch.randomizedtesting.ThreadLeakControl.lambda$forkTimeoutingTask$0(ThreadLeakControl.java:850)
at java.base@23.0.2/java.lang.Thread.run(Thread.java:1575)
Caused by: java.nio.channels.ClosedChannelException
at org.eclipse.jetty.http2.HTTP2Session$StreamsState.onShutdown(HTTP2Session.java:2141)
at org.eclipse.jetty.http2.HTTP2Session.onShutdown(HTTP2Session.java:1179)
at org.eclipse.jetty.http2.HTTP2Connection$HTTP2Producer.produce(HTTP2Connection.java:389)
at org.eclipse.jetty.util.thread.strategy.AdaptiveExecutionStrategy.produceTask(AdaptiveExecutionStrategy.java:526)
at org.eclipse.jetty.util.thread.strategy.AdaptiveExecutionStrategy.tryProduce(AdaptiveExecutionStrategy.java:251)
at org.eclipse.jetty.util.thread.strategy.AdaptiveExecutionStrategy.produce(AdaptiveExecutionStrategy.java:196)
at org.eclipse.jetty.http2.HTTP2Connection.produce(HTTP2Connection.java:216)
at org.eclipse.jetty.http2.HTTP2Connection.onFillable(HTTP2Connection.java:157)
at org.eclipse.jetty.http2.HTTP2Connection$FillableCallback.succeeded(HTTP2Connection.java:468)
at org.eclipse.jetty.io.FillInterest.fillable(FillInterest.java:105)
at org.eclipse.jetty.io.SelectableChannelEndPoint$1.run(SelectableChannelEndPoint.java:53)
at org.eclipse.jetty.util.thread.Invocable.invokeNonBlocking(Invocable.java:224)
at org.eclipse.jetty.util.thread.strategy.AdaptiveExecutionStrategy.picRunTask(AdaptiveExecutionStrategy.java:473)
at org.eclipse.jetty.util.thread.strategy.AdaptiveExecutionStrategy.consumeTask(AdaptiveExecutionStrategy.java:399)
at org.eclipse.jetty.util.thread.strategy.AdaptiveExecutionStrategy.tryProduce(AdaptiveExecutionStrategy.java:255)
at org.eclipse.jetty.util.thread.strategy.AdaptiveExecutionStrategy.produce(AdaptiveExecutionStrategy.java:196)
at org.apache.solr.common.util.ExecutorUtil$MDCAwareThreadPoolExecutor.lambda$execute$0(ExecutorUtil.java:408)
at java.base/java.util.concurrent.ThreadPoolExecutor.runWorker(ThreadPoolExecutor.java:1144)
at java.base/java.util.concurrent.ThreadPoolExecutor$Worker.run(ThreadPoolExecutor.java:642)
... 1 more
FAILED: org.apache.solr.core.DirectoryFactoryTest.testGetDataHomeByteBuffersDirectory
Error Message:
java.lang.AssertionError: Missing object ID 1 in pool jdk.types.ClassLoader. All IDs should reference an object
Stack Trace:
java.lang.AssertionError: Missing object ID 1 in pool jdk.types.ClassLoader. All IDs should reference an object
at __randomizedtesting.SeedInfo.seed([6548C039C6A62587]:0)
at jdk.jfr/jdk.jfr.internal.consumer.ConstantMap.get(ConstantMap.java:80)
at jdk.jfr/jdk.jfr.internal.consumer.Reference.resolve(Reference.java:38)
at jdk.jfr/jdk.jfr.internal.consumer.ConstantMap.resolve(ConstantMap.java:119)
at jdk.jfr/jdk.jfr.internal.consumer.ConstantMap.resolve(ConstantMap.java:125)
at jdk.jfr/jdk.jfr.internal.consumer.ConstantMap.get(ConstantMap.java:100)
at jdk.jfr/jdk.jfr.internal.consumer.ConstantMap.lambda$resolve$0(ConstantMap.java:133)
at jdk.jfr/jdk.jfr.internal.LongMap.forEachKey(LongMap.java:237)
at jdk.jfr/jdk.jfr.internal.consumer.ConstantMap.resolve(ConstantMap.java:133)
at jdk.jfr/jdk.jfr.internal.consumer.ChunkParser.lambda$new$2(ChunkParser.java:143)
at jdk.jfr/jdk.jfr.internal.LongMap.forEach(LongMap.java:246)
at jdk.jfr/jdk.jfr.internal.consumer.ChunkParser.<init>(ChunkParser.java:143)
at jdk.jfr/jdk.jfr.internal.consumer.ChunkParser.<init>(ChunkParser.java:109)
at jdk.jfr/jdk.jfr.internal.consumer.EventDirectoryStream.processRecursionSafe(EventDirectoryStream.java:158)
at jdk.jfr/jdk.jfr.internal.consumer.EventDirectoryStream.process(EventDirectoryStream.java:131)
at jdk.jfr/jdk.jfr.internal.consumer.AbstractEventStream.execute(AbstractEventStream.java:261)
at jdk.jfr/jdk.jfr.internal.consumer.AbstractEventStream$1.run(AbstractEventStream.java:284)
at jdk.jfr/jdk.jfr.internal.consumer.AbstractEventStream$1.run(AbstractEventStream.java:281)
at java.base/java.security.AccessController.doPrivileged(AccessController.java:400)
at jdk.jfr/jdk.jfr.internal.consumer.AbstractEventStream.run(AbstractEventStream.java:281)
at jdk.jfr/jdk.jfr.internal.consumer.AbstractEventStream.start(AbstractEventStream.java:232)
at jdk.jfr/jdk.jfr.consumer.RecordingStream.start(RecordingStream.java:358)
at io.opentelemetry.instrumentation.runtimemetrics.java17.RuntimeMetrics$JfrRuntimeMetrics.startRecordingStream(RuntimeMetrics.java:118)
at java.base/java.lang.Thread.run(Thread.java:1575)