You are viewing a plain text version of this content. The canonical link for it is here.
Posted to builds@hbase.apache.org by Apache Jenkins Server <je...@builds.apache.org> on 2015/04/22 08:47:25 UTC
Build failed in Jenkins: HBase-TRUNK #6400
See <https://builds.apache.org/job/HBase-TRUNK/6400/changes>
Changes:
[ramkrishna] HBASE-13502 - Deprecate/remove getRowComparator() in TableName (Ram)
------------------------------------------
[...truncated 3992 lines...]
Running org.apache.hadoop.hbase.snapshot.TestFlushSnapshotFromClient
Running org.apache.hadoop.hbase.snapshot.TestSecureExportSnapshot
Tests run: 11, Failures: 0, Errors: 0, Skipped: 0, Time elapsed: 57.169 sec - in org.apache.hadoop.hbase.TestHBaseTestingUtility
Running org.apache.hadoop.hbase.snapshot.TestExportSnapshot
Tests run: 9, Failures: 0, Errors: 0, Skipped: 0, Time elapsed: 83.713 sec - in org.apache.hadoop.hbase.snapshot.TestFlushSnapshotFromClient
Running org.apache.hadoop.hbase.snapshot.TestSnapshotClientRetries
Tests run: 2, Failures: 0, Errors: 0, Skipped: 0, Time elapsed: 20.998 sec - in org.apache.hadoop.hbase.snapshot.TestSnapshotClientRetries
Running org.apache.hadoop.hbase.snapshot.TestRestoreFlushSnapshotFromClient
Killed
Killed
Killed
Killed
Killed
Running org.apache.hadoop.hbase.procedure.TestZKProcedureControllers
Tests run: 4, Failures: 0, Errors: 0, Skipped: 0, Time elapsed: 2.55 sec - in org.apache.hadoop.hbase.procedure.TestZKProcedureControllers
Running org.apache.hadoop.hbase.TestInfoServers
Running org.apache.hadoop.hbase.procedure.TestZKProcedure
Running org.apache.hadoop.hbase.quotas.TestQuotaAdmin
Running org.apache.hadoop.hbase.quotas.TestQuotaTableUtil
Tests run: 4, Failures: 0, Errors: 0, Skipped: 0, Time elapsed: 2.659 sec - in org.apache.hadoop.hbase.procedure.TestZKProcedure
Tests run: 3, Failures: 0, Errors: 0, Skipped: 0, Time elapsed: 4.392 sec - in org.apache.hadoop.hbase.TestInfoServers
Tests run: 3, Failures: 0, Errors: 0, Skipped: 0, Time elapsed: 2.183 sec - in org.apache.hadoop.hbase.quotas.TestQuotaTableUtil
Tests run: 2, Failures: 0, Errors: 0, Skipped: 0, Time elapsed: 4.079 sec - in org.apache.hadoop.hbase.quotas.TestQuotaAdmin
Running org.apache.hadoop.hbase.quotas.TestQuotaThrottle
Running org.apache.hadoop.hbase.io.hfile.TestForceCacheImportantBlocks
Running org.apache.hadoop.hbase.io.hfile.TestHFileBlock
Running org.apache.hadoop.hbase.io.hfile.TestCacheOnWrite
Running org.apache.hadoop.hbase.io.hfile.TestHFileBlockIndex
Tests run: 7, Failures: 0, Errors: 0, Skipped: 0, Time elapsed: 12.698 sec - in org.apache.hadoop.hbase.quotas.TestQuotaThrottle
Tests run: 10, Failures: 0, Errors: 0, Skipped: 0, Time elapsed: 17.058 sec - in org.apache.hadoop.hbase.io.hfile.TestHFileBlockIndex
Running org.apache.hadoop.hbase.io.hfile.TestHFileSeek
Tests run: 1, Failures: 0, Errors: 0, Skipped: 0, Time elapsed: 3.377 sec - in org.apache.hadoop.hbase.io.hfile.TestHFileSeek
Running org.apache.hadoop.hbase.io.hfile.TestScannerSelectionUsingTTL
Running org.apache.hadoop.hbase.io.hfile.TestCacheConfig
Tests run: 6, Failures: 0, Errors: 0, Skipped: 0, Time elapsed: 3.281 sec - in org.apache.hadoop.hbase.io.hfile.TestCacheConfig
Running org.apache.hadoop.hbase.io.encoding.TestDataBlockEncoders
Tests run: 2, Failures: 0, Errors: 0, Skipped: 0, Time elapsed: 49.773 sec - in org.apache.hadoop.hbase.io.hfile.TestForceCacheImportantBlocks
Running org.apache.hadoop.hbase.io.encoding.TestEncodedSeekers
Tests run: 28, Failures: 0, Errors: 0, Skipped: 0, Time elapsed: 93.177 sec - in org.apache.hadoop.hbase.io.hfile.TestHFileBlock
Running org.apache.hadoop.hbase.io.encoding.TestBufferedDataBlockEncoder
Tests run: 6, Failures: 0, Errors: 0, Skipped: 0, Time elapsed: 65.576 sec - in org.apache.hadoop.hbase.io.hfile.TestScannerSelectionUsingTTL
Running org.apache.hadoop.hbase.io.encoding.TestChangingEncoding
Tests run: 1, Failures: 0, Errors: 0, Skipped: 0, Time elapsed: 41.084 sec - in org.apache.hadoop.hbase.io.encoding.TestBufferedDataBlockEncoder
Running org.apache.hadoop.hbase.io.encoding.TestLoadAndSwitchEncodeOnDisk
Tests run: 1, Failures: 0, Errors: 0, Skipped: 0, Time elapsed: 33.808 sec - in org.apache.hadoop.hbase.io.encoding.TestLoadAndSwitchEncodeOnDisk
Running org.apache.hadoop.hbase.io.TestFileLink
Tests run: 5, Failures: 0, Errors: 0, Skipped: 0, Time elapsed: 21.39 sec - in org.apache.hadoop.hbase.io.TestFileLink
Running org.apache.hadoop.hbase.wal.TestWALFactory
Tests run: 9, Failures: 0, Errors: 0, Skipped: 0, Time elapsed: 12.489 sec - in org.apache.hadoop.hbase.wal.TestWALFactory
Running org.apache.hadoop.hbase.wal.TestWALFiltering
Tests run: 1, Failures: 0, Errors: 0, Skipped: 0, Time elapsed: 29.912 sec - in org.apache.hadoop.hbase.wal.TestWALFiltering
Running org.apache.hadoop.hbase.wal.TestWALReaderOnSecureWAL
Tests run: 2, Failures: 0, Errors: 0, Skipped: 0, Time elapsed: 2.169 sec - in org.apache.hadoop.hbase.wal.TestWALReaderOnSecureWAL
Tests run: 3, Failures: 0, Errors: 0, Skipped: 0, Time elapsed: 156.232 sec - in org.apache.hadoop.hbase.io.encoding.TestChangingEncoding
Running org.apache.hadoop.hbase.wal.TestDefaultWALProvider
Tests run: 20, Failures: 0, Errors: 0, Skipped: 0, Time elapsed: 225.329 sec - in org.apache.hadoop.hbase.io.encoding.TestEncodedSeekers
Tests run: 5, Failures: 0, Errors: 0, Skipped: 0, Time elapsed: 8.433 sec - in org.apache.hadoop.hbase.wal.TestDefaultWALProvider
Running org.apache.hadoop.hbase.wal.TestWALSplit
Running org.apache.hadoop.hbase.wal.TestSecureWAL
Tests run: 1, Failures: 0, Errors: 0, Skipped: 0, Time elapsed: 2.044 sec - in org.apache.hadoop.hbase.wal.TestSecureWAL
Running org.apache.hadoop.hbase.wal.TestDefaultWALProviderWithHLogKey
Running org.apache.hadoop.hbase.wal.TestBoundedRegionGroupingProvider
Tests run: 5, Failures: 0, Errors: 0, Skipped: 0, Time elapsed: 8.924 sec - in org.apache.hadoop.hbase.wal.TestDefaultWALProviderWithHLogKey
Running org.apache.hadoop.hbase.wal.TestWALSplitCompressed
Tests run: 5, Failures: 0, Errors: 0, Skipped: 0, Time elapsed: 23.999 sec - in org.apache.hadoop.hbase.wal.TestBoundedRegionGroupingProvider
Running org.apache.hadoop.hbase.zookeeper.TestZooKeeperACL
Tests run: 6, Failures: 0, Errors: 0, Skipped: 0, Time elapsed: 0.289 sec - in org.apache.hadoop.hbase.zookeeper.TestZooKeeperACL
Running org.apache.hadoop.hbase.zookeeper.TestZKLeaderManager
Tests run: 1, Failures: 0, Errors: 0, Skipped: 0, Time elapsed: 0.124 sec - in org.apache.hadoop.hbase.zookeeper.TestZKLeaderManager
Running org.apache.hadoop.hbase.zookeeper.TestZooKeeperNodeTracker
Tests run: 3, Failures: 0, Errors: 0, Skipped: 0, Time elapsed: 1.284 sec - in org.apache.hadoop.hbase.zookeeper.TestZooKeeperNodeTracker
Running org.apache.hadoop.hbase.zookeeper.TestRecoverableZooKeeper
Tests run: 1, Failures: 0, Errors: 0, Skipped: 0, Time elapsed: 1.303 sec - in org.apache.hadoop.hbase.zookeeper.TestRecoverableZooKeeper
Running org.apache.hadoop.hbase.zookeeper.TestZKMulti
Tests run: 8, Failures: 0, Errors: 0, Skipped: 0, Time elapsed: 0.57 sec - in org.apache.hadoop.hbase.zookeeper.TestZKMulti
Running org.apache.hadoop.hbase.zookeeper.lock.TestZKInterProcessReadWriteLock
Tests run: 6, Failures: 0, Errors: 0, Skipped: 0, Time elapsed: 24.459 sec - in org.apache.hadoop.hbase.zookeeper.lock.TestZKInterProcessReadWriteLock
Running org.apache.hadoop.hbase.zookeeper.TestHQuorumPeer
Tests run: 4, Failures: 0, Errors: 0, Skipped: 0, Time elapsed: 1.807 sec - in org.apache.hadoop.hbase.zookeeper.TestHQuorumPeer
Running org.apache.hadoop.hbase.TestIOFencing
Tests run: 28, Failures: 0, Errors: 0, Skipped: 0, Time elapsed: 393.131 sec - in org.apache.hadoop.hbase.io.encoding.TestDataBlockEncoders
Running org.apache.hadoop.hbase.constraint.TestConstraint
Tests run: 5, Failures: 0, Errors: 0, Skipped: 0, Time elapsed: 23.196 sec - in org.apache.hadoop.hbase.constraint.TestConstraint
Tests run: 31, Failures: 0, Errors: 0, Skipped: 0, Time elapsed: 200.292 sec - in org.apache.hadoop.hbase.wal.TestWALSplit
Running org.apache.hadoop.hbase.TestMovedRegionsCleaner
Running org.apache.hadoop.hbase.backup.TestHFileArchiving
Tests run: 1, Failures: 0, Errors: 0, Skipped: 0, Time elapsed: 12.279 sec - in org.apache.hadoop.hbase.TestMovedRegionsCleaner
Running org.apache.hadoop.hbase.backup.example.TestZooKeeperTableArchiveClient
Tests run: 3, Failures: 0, Errors: 0, Skipped: 0, Time elapsed: 4.863 sec - in org.apache.hadoop.hbase.backup.example.TestZooKeeperTableArchiveClient
Tests run: 31, Failures: 0, Errors: 0, Skipped: 0, Time elapsed: 203.713 sec - in org.apache.hadoop.hbase.wal.TestWALSplitCompressed
Running org.apache.hadoop.hbase.ipc.TestProtoBufRpc
Tests run: 1, Failures: 0, Errors: 0, Skipped: 0, Time elapsed: 3.73 sec - in org.apache.hadoop.hbase.ipc.TestProtoBufRpc
Running org.apache.hadoop.hbase.ipc.TestDelayedRpc
Running org.apache.hadoop.hbase.TestHColumnDescriptorDefaultVersions
Tests run: 4, Failures: 0, Errors: 0, Skipped: 0, Time elapsed: 4.877 sec - in org.apache.hadoop.hbase.ipc.TestDelayedRpc
Running org.apache.hadoop.hbase.ipc.TestHBaseClient
Tests run: 1, Failures: 0, Errors: 0, Skipped: 0, Time elapsed: 0.603 sec - in org.apache.hadoop.hbase.ipc.TestHBaseClient
Tests run: 3, Failures: 0, Errors: 0, Skipped: 0, Time elapsed: 25.442 sec - in org.apache.hadoop.hbase.TestHColumnDescriptorDefaultVersions
Running org.apache.hadoop.hbase.TestNamespace
Tests run: 9, Failures: 0, Errors: 0, Skipped: 1, Time elapsed: 26.807 sec - in org.apache.hadoop.hbase.TestNamespace
Tests run: 5, Failures: 0, Errors: 0, Skipped: 0, Time elapsed: 82.979 sec - in org.apache.hadoop.hbase.backup.TestHFileArchiving
Tests run: 2, Failures: 0, Errors: 0, Skipped: 0, Time elapsed: 202.958 sec - in org.apache.hadoop.hbase.TestIOFencing
Tests run: 216, Failures: 0, Errors: 0, Skipped: 0, Time elapsed: 587.471 sec - in org.apache.hadoop.hbase.io.hfile.TestCacheOnWrite
Results :
Failed tests:
TestSplitTransactionOnCluster.testSSHCleanupDaugtherRegionsOfAbortedSplit:997 {ccf2672fcbedc7886fe67d798064af53={ccf2672fcbedc7886fe67d798064af53 state=SPLITTING_NEW, ts=1429683124879, server=asf910.gq1.ygridcore.net,54202,1429683114028}, 34e7a063f77a60d1ae58d318c109f63a={34e7a063f77a60d1ae58d318c109f63a state=SPLITTING_NEW, ts=1429683124879, server=asf910.gq1.ygridcore.net,54202,1429683114028}, 9ce0dc5f4f0ec11b064701191152a0b2={9ce0dc5f4f0ec11b064701191152a0b2 state=SPLITTING, ts=1429683124875, server=asf910.gq1.ygridcore.net,54202,1429683114028}} expected:<0> but was:<3>
Tests run: 2347, Failures: 1, Errors: 0, Skipped: 17
[INFO] ------------------------------------------------------------------------
[INFO] Reactor Summary:
[INFO]
[INFO] HBase ............................................. SUCCESS [ 2.887 s]
[INFO] HBase - Checkstyle ................................ SUCCESS [ 0.686 s]
[INFO] HBase - Annotations ............................... SUCCESS [ 0.247 s]
[INFO] HBase - Protocol .................................. SUCCESS [ 2.651 s]
[INFO] HBase - Common .................................... SUCCESS [03:11 min]
[INFO] HBase - Procedure ................................. SUCCESS [01:57 min]
[INFO] HBase - Client .................................... SUCCESS [01:50 min]
[INFO] HBase - Hadoop Compatibility ...................... SUCCESS [ 11.218 s]
[INFO] HBase - Hadoop Two Compatibility .................. SUCCESS [ 14.965 s]
[INFO] HBase - Prefix Tree ............................... SUCCESS [ 17.931 s]
[INFO] HBase - Server .................................... FAILURE [ 01:58 h]
[INFO] HBase - Testing Util .............................. SKIPPED
[INFO] HBase - Thrift .................................... SKIPPED
[INFO] HBase - Shell ..................................... SKIPPED
[INFO] HBase - Integration Tests ......................... SKIPPED
[INFO] HBase - Examples .................................. SKIPPED
[INFO] HBase - Rest ...................................... SKIPPED
[INFO] HBase - Assembly .................................. SKIPPED
[INFO] ------------------------------------------------------------------------
[INFO] BUILD FAILURE
[INFO] ------------------------------------------------------------------------
[INFO] Total time: 02:06 h
[INFO] Finished at: 2015-04-22T06:43:31+00:00
[INFO] Final Memory: 60M/569M
[INFO] ------------------------------------------------------------------------
[ERROR] Failed to execute goal org.apache.maven.plugins:maven-surefire-plugin:2.18:test (secondPartTestsExecution) on project hbase-server: ExecutionException: java.lang.RuntimeException: The forked VM terminated without properly saying goodbye. VM crash or System.exit called?
[ERROR] Command was /bin/sh -c cd <https://builds.apache.org/job/HBase-TRUNK/ws/hbase-server> && /home/jenkins/jenkins-slave/tools/hudson.model.JDK/jdk-1.7u51/jre/bin/java -enableassertions -XX:MaxDirectMemorySize=1G -Xmx2800m -XX:MaxPermSize=256m -Djava.security.egd=file:/dev/./urandom -Djava.net.preferIPv4Stack=true -Djava.awt.headless=true '-javaagent:/home/jenkins/.m2/repository/org/jacoco/org.jacoco.agent/0.6.2.201302030002/org.jacoco.agent-0.6.2.201302030002-runtime.jar=destfile=<https://builds.apache.org/job/HBase-TRUNK/ws/hbase-server/target/jacoco.exec,excludes=**/generated/**/*.class'> -jar <https://builds.apache.org/job/HBase-TRUNK/ws/hbase-server/target/surefire/surefirebooter3047066042368452038.jar> <https://builds.apache.org/job/HBase-TRUNK/ws/hbase-server/target/surefire/surefire3697086184677768876tmp> <https://builds.apache.org/job/HBase-TRUNK/ws/hbase-server/target/surefire/surefire_11005195298918358573756tmp>
[ERROR] -> [Help 1]
[ERROR]
[ERROR] To see the full stack trace of the errors, re-run Maven with the -e switch.
[ERROR] Re-run Maven using the -X switch to enable full debug logging.
[ERROR]
[ERROR] For more information about the errors and possible solutions, please read the following articles:
[ERROR] [Help 1] http://cwiki.apache.org/confluence/display/MAVEN/MojoFailureException
[ERROR]
[ERROR] After correcting the problems, you can resume the build with the command
[ERROR] mvn <goals> -rf :hbase-server
Build step 'Invoke top-level Maven targets' marked build as failure
Performing Post build task...
Match found for :.* : True
Logical operation result is TRUE
Running script : ZOMBIE_TESTS_COUNT=`jps | grep surefirebooter | wc -l`
if [[ $ZOMBIE_TESTS_COUNT != 0 ]] ; then
#It seems sometimes the tests are not dying immediately. Let's give them 10s
echo "Suspicious java process found - waiting 10s to see if there are just slow to stop"
sleep 10
ZOMBIE_TESTS_COUNT=`jps | grep surefirebooter | wc -l`
if [[ $ZOMBIE_TESTS_COUNT != 0 ]] ; then
echo "There are $ZOMBIE_TESTS_COUNT zombie tests, they should have been killed by surefire but survived"
echo "************ BEGIN zombies jstack extract"
ZB_STACK=`jps | grep surefirebooter | cut -d ' ' -f 1 | xargs -n 1 jstack | grep ".test" | grep "\.java"`
jps | grep surefirebooter | cut -d ' ' -f 1 | xargs -n 1 jstack
echo "************ END zombies jstack extract"
JIRA_COMMENT="$JIRA_COMMENT
{color:red}-1 core zombie tests{color}. There are ${ZOMBIE_TESTS_COUNT} zombie test(s): ${ZB_STACK}"
BAD=1
jps | grep surefirebooter | cut -d ' ' -f 1 | xargs kill -9
else
echo "We're ok: there is no zombie test, but some tests took some time to stop"
fi
else
echo "We're ok: there is no zombie test"
fi
[HBase-TRUNK] $ /bin/bash -xe /tmp/hudson811371282099404923.sh
++ jps
++ grep surefirebooter
++ wc -l
+ ZOMBIE_TESTS_COUNT=0
+ [[ 0 != 0 ]]
+ echo 'We'\''re ok: there is no zombie test'
We're ok: there is no zombie test
POST BUILD TASK : SUCCESS
END OF POST BUILD TASK : 0
Archiving artifacts
Sending artifact delta relative to HBase-TRUNK #6399
Archived 2126 artifacts
Archive block size is 32768
Received 91 blocks and 414184525 bytes
Compression is 0.7%
Took 3 min 15 sec
Recording test results
[FINDBUGS] Collecting findbugs analysis files...
[FINDBUGS] Finding all files that match the pattern **/findbugs.xml,**/findbugsXml.xml
[FINDBUGS] Parsing 24 files in <https://builds.apache.org/job/HBase-TRUNK/ws/>
[FINDBUGS] Successfully parsed file <https://builds.apache.org/job/HBase-TRUNK/6400/artifact/hbase-annotations/target/findbugs.xml> of module with 0 warnings.
[FINDBUGS] Successfully parsed file <https://builds.apache.org/job/HBase-TRUNK/6400/artifact/hbase-annotations/target/findbugsXml.xml> of module with 0 warnings.
[FINDBUGS] Successfully parsed file <https://builds.apache.org/job/HBase-TRUNK/6400/artifact/hbase-client/target/findbugs.xml> of module with 0 warnings.
[FINDBUGS] Successfully parsed file <https://builds.apache.org/job/HBase-TRUNK/6400/artifact/hbase-client/target/findbugsXml.xml> of module with 8 warnings.
[FINDBUGS] Successfully parsed file <https://builds.apache.org/job/HBase-TRUNK/6400/artifact/hbase-common/target/findbugs.xml> of module with 0 warnings.
[FINDBUGS] Successfully parsed file <https://builds.apache.org/job/HBase-TRUNK/6400/artifact/hbase-common/target/findbugsXml.xml> of module with 1 warnings.
[FINDBUGS] Successfully parsed file <https://builds.apache.org/job/HBase-TRUNK/6400/artifact/hbase-examples/target/findbugs.xml> of module with 0 warnings.
[FINDBUGS] Successfully parsed file <https://builds.apache.org/job/HBase-TRUNK/6400/artifact/hbase-examples/target/findbugsXml.xml> of module with 0 warnings.
[FINDBUGS] Successfully parsed file <https://builds.apache.org/job/HBase-TRUNK/6400/artifact/hbase-hadoop-compat/target/findbugs.xml> of module with 0 warnings.
[FINDBUGS] Successfully parsed file <https://builds.apache.org/job/HBase-TRUNK/6400/artifact/hbase-hadoop-compat/target/findbugsXml.xml> of module with 0 warnings.
[FINDBUGS] Successfully parsed file <https://builds.apache.org/job/HBase-TRUNK/6400/artifact/hbase-hadoop2-compat/target/findbugs.xml> of module with 0 warnings.
[FINDBUGS] Successfully parsed file <https://builds.apache.org/job/HBase-TRUNK/6400/artifact/hbase-hadoop2-compat/target/findbugsXml.xml> of module with 0 warnings.
[FINDBUGS] Successfully parsed file <https://builds.apache.org/job/HBase-TRUNK/6400/artifact/hbase-prefix-tree/target/findbugs.xml> of module with 0 warnings.
[FINDBUGS] Successfully parsed file <https://builds.apache.org/job/HBase-TRUNK/6400/artifact/hbase-prefix-tree/target/findbugsXml.xml> of module with 0 warnings.
[FINDBUGS] Successfully parsed file <https://builds.apache.org/job/HBase-TRUNK/6400/artifact/hbase-procedure/target/findbugs.xml> of module with 0 warnings.
[FINDBUGS] Successfully parsed file <https://builds.apache.org/job/HBase-TRUNK/6400/artifact/hbase-procedure/target/findbugsXml.xml> of module with 0 warnings.
[FINDBUGS] Successfully parsed file <https://builds.apache.org/job/HBase-TRUNK/6400/artifact/hbase-protocol/target/findbugs.xml> of module with 0 warnings.
[FINDBUGS] Successfully parsed file <https://builds.apache.org/job/HBase-TRUNK/6400/artifact/hbase-protocol/target/findbugsXml.xml> of module with 0 warnings.
[FINDBUGS] Successfully parsed file <https://builds.apache.org/job/HBase-TRUNK/6400/artifact/hbase-rest/target/findbugs.xml> of module with 0 warnings.
[FINDBUGS] Successfully parsed file <https://builds.apache.org/job/HBase-TRUNK/6400/artifact/hbase-rest/target/findbugsXml.xml> of module with 2 warnings.
[FINDBUGS] Successfully parsed file <https://builds.apache.org/job/HBase-TRUNK/6400/artifact/hbase-server/target/findbugs.xml> of module with 0 warnings.
[FINDBUGS] Successfully parsed file <https://builds.apache.org/job/HBase-TRUNK/6400/artifact/hbase-server/target/findbugsXml.xml> of module with 60 warnings.
[FINDBUGS] Successfully parsed file <https://builds.apache.org/job/HBase-TRUNK/6400/artifact/hbase-thrift/target/findbugs.xml> of module with 0 warnings.
[FINDBUGS] Successfully parsed file <https://builds.apache.org/job/HBase-TRUNK/6400/artifact/hbase-thrift/target/findbugsXml.xml> of module with 0 warnings.
[FINDBUGS] Computing warning deltas based on reference build #6399
[CHECKSTYLE] Collecting checkstyle analysis files...
[CHECKSTYLE] Finding all files that match the pattern **/checkstyle-result.xml
[CHECKSTYLE] Parsing 18 files in <https://builds.apache.org/job/HBase-TRUNK/ws/>
[CHECKSTYLE] Successfully parsed file <https://builds.apache.org/job/HBase-TRUNK/6400/artifact/hbase-annotations/target/checkstyle-result.xml> of module with 0 warnings.
[CHECKSTYLE] Successfully parsed file <https://builds.apache.org/job/HBase-TRUNK/6400/artifact/hbase-assembly/target/checkstyle-result.xml> of module with 0 warnings.
[CHECKSTYLE] Successfully parsed file <https://builds.apache.org/job/HBase-TRUNK/6400/artifact/hbase-checkstyle/target/checkstyle-result.xml> of module with 0 warnings.
[CHECKSTYLE] Successfully parsed file <https://builds.apache.org/job/HBase-TRUNK/6400/artifact/hbase-client/target/checkstyle-result.xml> of module with 214 warnings.
[CHECKSTYLE] Successfully parsed file <https://builds.apache.org/job/HBase-TRUNK/6400/artifact/hbase-common/target/checkstyle-result.xml> of module with 125 warnings.
[CHECKSTYLE] Successfully parsed file <https://builds.apache.org/job/HBase-TRUNK/6400/artifact/hbase-examples/target/checkstyle-result.xml> of module with 30 warnings.
[CHECKSTYLE] Successfully parsed file <https://builds.apache.org/job/HBase-TRUNK/6400/artifact/hbase-hadoop-compat/target/checkstyle-result.xml> of module with 2 warnings.
[CHECKSTYLE] Successfully parsed file <https://builds.apache.org/job/HBase-TRUNK/6400/artifact/hbase-hadoop2-compat/target/checkstyle-result.xml> of module with 47 warnings.
[CHECKSTYLE] Successfully parsed file <https://builds.apache.org/job/HBase-TRUNK/6400/artifact/hbase-it/target/checkstyle-result.xml> of module with 0 warnings.
[CHECKSTYLE] Successfully parsed file <https://builds.apache.org/job/HBase-TRUNK/6400/artifact/hbase-prefix-tree/target/checkstyle-result.xml> of module with 25 warnings.
[CHECKSTYLE] Successfully parsed file <https://builds.apache.org/job/HBase-TRUNK/6400/artifact/hbase-procedure/target/checkstyle-result.xml> of module with 0 warnings.
[CHECKSTYLE] Successfully parsed file <https://builds.apache.org/job/HBase-TRUNK/6400/artifact/hbase-protocol/target/checkstyle-result.xml> of module with 3 warnings.
[CHECKSTYLE] Successfully parsed file <https://builds.apache.org/job/HBase-TRUNK/6400/artifact/hbase-rest/target/checkstyle-result.xml> of module with 42 warnings.
[CHECKSTYLE] Successfully parsed file <https://builds.apache.org/job/HBase-TRUNK/6400/artifact/hbase-server/target/checkstyle-result.xml> of module with 1377 warnings.
[CHECKSTYLE] Successfully parsed file <https://builds.apache.org/job/HBase-TRUNK/6400/artifact/hbase-shell/target/checkstyle-result.xml> of module with 0 warnings.
[CHECKSTYLE] Successfully parsed file <https://builds.apache.org/job/HBase-TRUNK/6400/artifact/hbase-testing-util/target/checkstyle-result.xml> of module with 0 warnings.
[CHECKSTYLE] Successfully parsed file <https://builds.apache.org/job/HBase-TRUNK/6400/artifact/hbase-thrift/target/checkstyle-result.xml> of module with 32 warnings.
[CHECKSTYLE] Successfully parsed file <https://builds.apache.org/job/HBase-TRUNK/6400/artifact/target/checkstyle-result.xml> of module with 0 warnings.
[CHECKSTYLE] Computing warning deltas based on reference build #6399
Updating HBASE-13502
Jenkins build is back to normal : HBase-TRUNK #6406
Posted by Apache Jenkins Server <je...@builds.apache.org>.
See <https://builds.apache.org/job/HBase-TRUNK/6406/changes>
Build failed in Jenkins: HBase-TRUNK #6405
Posted by Apache Jenkins Server <je...@builds.apache.org>.
See <https://builds.apache.org/job/HBase-TRUNK/6405/changes>
Changes:
[eclark] HBASE-13534 Changed Master UI to promptly display if it is a backup master. (Apekshit)
------------------------------------------
[...truncated 5558 lines...]
at org.apache.activemq.core.client.impl.ClientSessionFactoryImpl.handleConnectionFailure(ClientSessionFactoryImpl.java:567)
at org.apache.activemq.core.client.impl.ClientSessionFactoryImpl.access$400(ClientSessionFactoryImpl.java:68)
at org.apache.activemq.core.client.impl.ClientSessionFactoryImpl$DelegatingFailureListener.connectionFailed(ClientSessionFactoryImpl.java:1401)
at org.apache.activemq.spi.core.protocol.AbstractRemotingConnection.callFailureListeners(AbstractRemotingConnection.java:62)
at org.apache.activemq.core.protocol.core.impl.RemotingConnectionImpl.fail(RemotingConnectionImpl.java:224)
at org.apache.activemq.spi.core.protocol.AbstractRemotingConnection.fail(AbstractRemotingConnection.java:210)
at org.apache.activemq.core.client.impl.ClientSessionFactoryImpl$CloseRunnable.run(ClientSessionFactoryImpl.java:1183)
at org.apache.activemq.utils.OrderedExecutorFactory$OrderedExecutor$1.run(OrderedExecutorFactory.java:105)
at java.util.concurrent.ThreadPoolExecutor.runWorker(ThreadPoolExecutor.java:1142)
at java.util.concurrent.ThreadPoolExecutor$Worker.run(ThreadPoolExecutor.java:617)
at java.lang.Thread.run(Thread.java:745)
"Thread-0 (ActiveMQ-server-ActiveMQServerImpl::SymmetricClusterWithBackupTest/Live(1)-25547551)" #170054 prio=5 os_prio=0 tid=0x00007fa7aaad2800 nid=0x4056 waiting on condition [0x00007fa768959000]
java.lang.Thread.State: WAITING (parking)
at sun.misc.Unsafe.park(Native Method)
- parking to wait for <0x00000007bf59a380> (a java.util.concurrent.locks.AbstractQueuedSynchronizer$ConditionObject)
at java.util.concurrent.locks.LockSupport.park(LockSupport.java:175)
at java.util.concurrent.locks.AbstractQueuedSynchronizer$ConditionObject.await(AbstractQueuedSynchronizer.java:2039)
at java.util.concurrent.LinkedBlockingQueue.take(LinkedBlockingQueue.java:442)
at java.util.concurrent.ThreadPoolExecutor.getTask(ThreadPoolExecutor.java:1067)
at java.util.concurrent.ThreadPoolExecutor.runWorker(ThreadPoolExecutor.java:1127)
at java.util.concurrent.ThreadPoolExecutor$Worker.run(ThreadPoolExecutor.java:617)
at java.lang.Thread.run(Thread.java:745)
"threadDeathWatcher-2-1" #1305 daemon prio=1 os_prio=0 tid=0x00007fa7a9b77000 nid=0x6f8f waiting on condition [0x00007fa76af7d000]
java.lang.Thread.State: TIMED_WAITING (sleeping)
at java.lang.Thread.sleep(Native Method)
at io.netty.util.ThreadDeathWatcher$Watcher.run(ThreadDeathWatcher.java:113)
at java.lang.Thread.run(Thread.java:745)
"Service Thread" #17 daemon prio=9 os_prio=0 tid=0x00007fa7a8375000 nid=0x4135 runnable [0x0000000000000000]
java.lang.Thread.State: RUNNABLE
"C1 CompilerThread11" #16 daemon prio=9 os_prio=0 tid=0x00007fa7a8370000 nid=0x4132 waiting on condition [0x0000000000000000]
java.lang.Thread.State: RUNNABLE
"C1 CompilerThread10" #15 daemon prio=9 os_prio=0 tid=0x00007fa7a836e000 nid=0x4131 waiting on condition [0x0000000000000000]
java.lang.Thread.State: RUNNABLE
"C1 CompilerThread9" #14 daemon prio=9 os_prio=0 tid=0x00007fa7a836c800 nid=0x4130 waiting on condition [0x0000000000000000]
java.lang.Thread.State: RUNNABLE
"C1 CompilerThread8" #13 daemon prio=9 os_prio=0 tid=0x00007fa7a836a800 nid=0x412f waiting on condition [0x0000000000000000]
java.lang.Thread.State: RUNNABLE
"C2 CompilerThread7" #12 daemon prio=9 os_prio=0 tid=0x00007fa7a8368800 nid=0x412e waiting on condition [0x0000000000000000]
java.lang.Thread.State: RUNNABLE
"C2 CompilerThread6" #11 daemon prio=9 os_prio=0 tid=0x00007fa7a8366000 nid=0x412d waiting on condition [0x0000000000000000]
java.lang.Thread.State: RUNNABLE
"C2 CompilerThread5" #10 daemon prio=9 os_prio=0 tid=0x00007fa7a8364000 nid=0x412c waiting on condition [0x0000000000000000]
java.lang.Thread.State: RUNNABLE
"C2 CompilerThread4" #9 daemon prio=9 os_prio=0 tid=0x00007fa7a835a000 nid=0x412b waiting on condition [0x0000000000000000]
java.lang.Thread.State: RUNNABLE
"C2 CompilerThread3" #8 daemon prio=9 os_prio=0 tid=0x00007fa7a8357800 nid=0x412a waiting on condition [0x0000000000000000]
java.lang.Thread.State: RUNNABLE
"C2 CompilerThread2" #7 daemon prio=9 os_prio=0 tid=0x00007fa7a8353800 nid=0x4128 waiting on condition [0x0000000000000000]
java.lang.Thread.State: RUNNABLE
"C2 CompilerThread1" #6 daemon prio=9 os_prio=0 tid=0x00007fa7a8351800 nid=0x4127 waiting on condition [0x0000000000000000]
java.lang.Thread.State: RUNNABLE
"C2 CompilerThread0" #5 daemon prio=9 os_prio=0 tid=0x00007fa7a834e800 nid=0x4126 waiting on condition [0x0000000000000000]
java.lang.Thread.State: RUNNABLE
"Signal Dispatcher" #4 daemon prio=9 os_prio=0 tid=0x00007fa7a834c800 nid=0x4125 runnable [0x0000000000000000]
java.lang.Thread.State: RUNNABLE
"Finalizer" #3 daemon prio=8 os_prio=0 tid=0x00007fa7a8320800 nid=0x410f in Object.wait() [0x00007fa7718d7000]
java.lang.Thread.State: WAITING (on object monitor)
at java.lang.Object.wait(Native Method)
at java.lang.ref.ReferenceQueue.remove(ReferenceQueue.java:142)
- locked <0x0000000647619fc0> (a java.lang.ref.ReferenceQueue$Lock)
at java.lang.ref.ReferenceQueue.remove(ReferenceQueue.java:158)
at java.lang.ref.Finalizer$FinalizerThread.run(Finalizer.java:209)
"Reference Handler" #2 daemon prio=10 os_prio=0 tid=0x00007fa7a831e800 nid=0x410e in Object.wait() [0x00007fa7719d8000]
java.lang.Thread.State: WAITING (on object monitor)
at java.lang.Object.wait(Native Method)
at java.lang.Object.wait(Object.java:502)
at java.lang.ref.Reference$ReferenceHandler.run(Reference.java:157)
- locked <0x00000006476123c0> (a java.lang.ref.Reference$Lock)
"main" #1 prio=5 os_prio=0 tid=0x00007fa7a800a800 nid=0x40e4 waiting on condition [0x00007fa7af4bb000]
java.lang.Thread.State: TIMED_WAITING (parking)
at sun.misc.Unsafe.park(Native Method)
- parking to wait for <0x00000007bf5f5808> (a java.util.concurrent.locks.AbstractQueuedSynchronizer$ConditionObject)
at java.util.concurrent.locks.LockSupport.parkNanos(LockSupport.java:215)
at java.util.concurrent.locks.AbstractQueuedSynchronizer$ConditionObject.awaitNanos(AbstractQueuedSynchronizer.java:2078)
at java.util.concurrent.ThreadPoolExecutor.awaitTermination(ThreadPoolExecutor.java:1465)
at org.apache.activemq.core.server.impl.ActiveMQServerImpl.stop(ActiveMQServerImpl.java:716)
at org.apache.activemq.core.server.impl.ActiveMQServerImpl.stop(ActiveMQServerImpl.java:599)
at org.apache.activemq.core.server.impl.ActiveMQServerImpl.stop(ActiveMQServerImpl.java:556)
at org.apache.activemq.tests.integration.cluster.distribution.ClusterTestBase.stopServers(ClusterTestBase.java:2231)
at org.apache.activemq.tests.integration.cluster.distribution.SymmetricClusterWithBackupTest.stopServers(SymmetricClusterWithBackupTest.java:571)
at org.apache.activemq.tests.integration.cluster.distribution.SymmetricClusterTest.tearDown(SymmetricClusterTest.java:49)
at sun.reflect.GeneratedMethodAccessor27.invoke(Unknown Source)
at sun.reflect.DelegatingMethodAccessorImpl.invoke(DelegatingMethodAccessorImpl.java:43)
at java.lang.reflect.Method.invoke(Method.java:483)
at org.junit.runners.model.FrameworkMethod$1.runReflectiveCall(FrameworkMethod.java:47)
at org.junit.internal.runners.model.ReflectiveCallable.run(ReflectiveCallable.java:12)
at org.junit.runners.model.FrameworkMethod.invokeExplosively(FrameworkMethod.java:44)
at org.junit.internal.runners.statements.RunAfters.evaluate(RunAfters.java:33)
at org.junit.rules.TestWatcher$1.evaluate(TestWatcher.java:55)
at org.junit.rules.ExternalResource$1.evaluate(ExternalResource.java:48)
at org.junit.rules.ExternalResource$1.evaluate(ExternalResource.java:48)
at org.junit.rules.TestWatcher$1.evaluate(TestWatcher.java:55)
at org.junit.rules.RunRules.evaluate(RunRules.java:20)
at org.junit.runners.ParentRunner.runLeaf(ParentRunner.java:271)
at org.junit.runners.BlockJUnit4ClassRunner.runChild(BlockJUnit4ClassRunner.java:70)
at org.junit.runners.BlockJUnit4ClassRunner.runChild(BlockJUnit4ClassRunner.java:50)
at org.junit.runners.ParentRunner$3.run(ParentRunner.java:238)
at org.junit.runners.ParentRunner$1.schedule(ParentRunner.java:63)
at org.junit.runners.ParentRunner.runChildren(ParentRunner.java:236)
at org.junit.runners.ParentRunner.access$000(ParentRunner.java:53)
at org.junit.runners.ParentRunner$2.evaluate(ParentRunner.java:229)
at org.junit.runners.ParentRunner.run(ParentRunner.java:309)
at org.apache.maven.surefire.junit4.JUnit4Provider.execute(JUnit4Provider.java:264)
at org.apache.maven.surefire.junit4.JUnit4Provider.executeTestSet(JUnit4Provider.java:153)
at org.apache.maven.surefire.junit4.JUnit4Provider.invoke(JUnit4Provider.java:124)
at sun.reflect.NativeMethodAccessorImpl.invoke0(Native Method)
at sun.reflect.NativeMethodAccessorImpl.invoke(NativeMethodAccessorImpl.java:62)
at sun.reflect.DelegatingMethodAccessorImpl.invoke(DelegatingMethodAccessorImpl.java:43)
at java.lang.reflect.Method.invoke(Method.java:483)
at org.apache.maven.surefire.util.ReflectionUtils.invokeMethodWithArray2(ReflectionUtils.java:208)
at org.apache.maven.surefire.booter.ProviderFactory$ProviderProxy.invoke(ProviderFactory.java:159)
at org.apache.maven.surefire.booter.ProviderFactory.invokeProvider(ProviderFactory.java:87)
at org.apache.maven.surefire.booter.ForkedBooter.runSuitesInProcess(ForkedBooter.java:153)
at org.apache.maven.surefire.booter.ForkedBooter.main(ForkedBooter.java:95)
"VM Thread" os_prio=0 tid=0x00007fa7a8317800 nid=0x410c runnable
"GC task thread#0 (ParallelGC)" os_prio=0 tid=0x00007fa7a8020000 nid=0x40ea runnable
"GC task thread#1 (ParallelGC)" os_prio=0 tid=0x00007fa7a8022000 nid=0x40eb runnable
"GC task thread#2 (ParallelGC)" os_prio=0 tid=0x00007fa7a8023800 nid=0x40ec runnable
"GC task thread#3 (ParallelGC)" os_prio=0 tid=0x00007fa7a8025800 nid=0x40ed runnable
"GC task thread#4 (ParallelGC)" os_prio=0 tid=0x00007fa7a8027000 nid=0x40ee runnable
"GC task thread#5 (ParallelGC)" os_prio=0 tid=0x00007fa7a8029000 nid=0x40ef runnable
"GC task thread#6 (ParallelGC)" os_prio=0 tid=0x00007fa7a802a800 nid=0x40f0 runnable
"GC task thread#7 (ParallelGC)" os_prio=0 tid=0x00007fa7a802c000 nid=0x40f1 runnable
"GC task thread#8 (ParallelGC)" os_prio=0 tid=0x00007fa7a802e000 nid=0x40f2 runnable
"GC task thread#9 (ParallelGC)" os_prio=0 tid=0x00007fa7a802f800 nid=0x40f3 runnable
"GC task thread#10 (ParallelGC)" os_prio=0 tid=0x00007fa7a8031800 nid=0x40f4 runnable
"GC task thread#11 (ParallelGC)" os_prio=0 tid=0x00007fa7a8033000 nid=0x40f5 runnable
"GC task thread#12 (ParallelGC)" os_prio=0 tid=0x00007fa7a8035000 nid=0x40f6 runnable
"GC task thread#13 (ParallelGC)" os_prio=0 tid=0x00007fa7a8036800 nid=0x40f8 runnable
"GC task thread#14 (ParallelGC)" os_prio=0 tid=0x00007fa7a8038800 nid=0x40f9 runnable
"GC task thread#15 (ParallelGC)" os_prio=0 tid=0x00007fa7a803a000 nid=0x40fa runnable
"GC task thread#16 (ParallelGC)" os_prio=0 tid=0x00007fa7a803c000 nid=0x40fb runnable
"GC task thread#17 (ParallelGC)" os_prio=0 tid=0x00007fa7a803d800 nid=0x40fc runnable
"VM Periodic Task Thread" os_prio=0 tid=0x00007fa7a8377800 nid=0x4137 waiting on condition
JNI global references: 265
+ echo '************ END zombies jstack extract'
************ END zombies jstack extract
+ JIRA_COMMENT='
{color:red}-1 core zombie tests{color}. There are 1 zombie test(s): at org.apache.activemq.tests.integration.cluster.distribution.ClusterTestBase.stopServers(ClusterTestBase.java:2231)
at org.apache.activemq.tests.integration.cluster.distribution.SymmetricClusterWithBackupTest.stopServers(SymmetricClusterWithBackupTest.java:571)
at org.apache.activemq.tests.integration.cluster.distribution.SymmetricClusterTest.tearDown(SymmetricClusterTest.java:49)'
+ BAD=1
+ jps
+ cut -d ' ' -f 1
+ grep surefirebooter
+ xargs kill -9
POST BUILD TASK : SUCCESS
END OF POST BUILD TASK : 0
Archiving artifacts
Sending artifact delta relative to HBase-TRUNK #6399
Archived 2139 artifacts
Archive block size is 32768
Received 61 blocks and 434193993 bytes
Compression is 0.5%
Took 2 min 3 sec
Recording test results
[FINDBUGS] Collecting findbugs analysis files...
[FINDBUGS] Finding all files that match the pattern **/findbugs.xml,**/findbugsXml.xml
[FINDBUGS] Parsing 24 files in <https://builds.apache.org/job/HBase-TRUNK/ws/>
[FINDBUGS] Successfully parsed file <https://builds.apache.org/job/HBase-TRUNK/6405/artifact/hbase-annotations/target/findbugs.xml> of module with 0 warnings.
[FINDBUGS] Successfully parsed file <https://builds.apache.org/job/HBase-TRUNK/6405/artifact/hbase-annotations/target/findbugsXml.xml> of module with 0 warnings.
[FINDBUGS] Successfully parsed file <https://builds.apache.org/job/HBase-TRUNK/6405/artifact/hbase-client/target/findbugs.xml> of module with 0 warnings.
[FINDBUGS] Successfully parsed file <https://builds.apache.org/job/HBase-TRUNK/6405/artifact/hbase-client/target/findbugsXml.xml> of module with 8 warnings.
[FINDBUGS] Successfully parsed file <https://builds.apache.org/job/HBase-TRUNK/6405/artifact/hbase-common/target/findbugs.xml> of module with 0 warnings.
[FINDBUGS] Successfully parsed file <https://builds.apache.org/job/HBase-TRUNK/6405/artifact/hbase-common/target/findbugsXml.xml> of module with 1 warnings.
[FINDBUGS] Successfully parsed file <https://builds.apache.org/job/HBase-TRUNK/6405/artifact/hbase-examples/target/findbugs.xml> of module with 0 warnings.
[FINDBUGS] Successfully parsed file <https://builds.apache.org/job/HBase-TRUNK/6405/artifact/hbase-examples/target/findbugsXml.xml> of module with 0 warnings.
[FINDBUGS] Successfully parsed file <https://builds.apache.org/job/HBase-TRUNK/6405/artifact/hbase-hadoop-compat/target/findbugs.xml> of module with 0 warnings.
[FINDBUGS] Successfully parsed file <https://builds.apache.org/job/HBase-TRUNK/6405/artifact/hbase-hadoop-compat/target/findbugsXml.xml> of module with 0 warnings.
[FINDBUGS] Successfully parsed file <https://builds.apache.org/job/HBase-TRUNK/6405/artifact/hbase-hadoop2-compat/target/findbugs.xml> of module with 0 warnings.
[FINDBUGS] Successfully parsed file <https://builds.apache.org/job/HBase-TRUNK/6405/artifact/hbase-hadoop2-compat/target/findbugsXml.xml> of module with 0 warnings.
[FINDBUGS] Successfully parsed file <https://builds.apache.org/job/HBase-TRUNK/6405/artifact/hbase-prefix-tree/target/findbugs.xml> of module with 0 warnings.
[FINDBUGS] Successfully parsed file <https://builds.apache.org/job/HBase-TRUNK/6405/artifact/hbase-prefix-tree/target/findbugsXml.xml> of module with 0 warnings.
[FINDBUGS] Successfully parsed file <https://builds.apache.org/job/HBase-TRUNK/6405/artifact/hbase-procedure/target/findbugs.xml> of module with 0 warnings.
[FINDBUGS] Successfully parsed file <https://builds.apache.org/job/HBase-TRUNK/6405/artifact/hbase-procedure/target/findbugsXml.xml> of module with 0 warnings.
[FINDBUGS] Successfully parsed file <https://builds.apache.org/job/HBase-TRUNK/6405/artifact/hbase-protocol/target/findbugs.xml> of module with 0 warnings.
[FINDBUGS] Successfully parsed file <https://builds.apache.org/job/HBase-TRUNK/6405/artifact/hbase-protocol/target/findbugsXml.xml> of module with 0 warnings.
[FINDBUGS] Successfully parsed file <https://builds.apache.org/job/HBase-TRUNK/6405/artifact/hbase-rest/target/findbugs.xml> of module with 0 warnings.
[FINDBUGS] Successfully parsed file <https://builds.apache.org/job/HBase-TRUNK/6405/artifact/hbase-rest/target/findbugsXml.xml> of module with 2 warnings.
[FINDBUGS] Successfully parsed file <https://builds.apache.org/job/HBase-TRUNK/6405/artifact/hbase-server/target/findbugs.xml> of module with 0 warnings.
[FINDBUGS] Successfully parsed file <https://builds.apache.org/job/HBase-TRUNK/6405/artifact/hbase-server/target/findbugsXml.xml> of module with 61 warnings.
[FINDBUGS] Successfully parsed file <https://builds.apache.org/job/HBase-TRUNK/6405/artifact/hbase-thrift/target/findbugs.xml> of module with 0 warnings.
[FINDBUGS] Successfully parsed file <https://builds.apache.org/job/HBase-TRUNK/6405/artifact/hbase-thrift/target/findbugsXml.xml> of module with 0 warnings.
[FINDBUGS] Computing warning deltas based on reference build #6399
[CHECKSTYLE] Collecting checkstyle analysis files...
[CHECKSTYLE] Finding all files that match the pattern **/checkstyle-result.xml
[CHECKSTYLE] Parsing 18 files in <https://builds.apache.org/job/HBase-TRUNK/ws/>
[CHECKSTYLE] Successfully parsed file <https://builds.apache.org/job/HBase-TRUNK/6405/artifact/hbase-annotations/target/checkstyle-result.xml> of module with 0 warnings.
[CHECKSTYLE] Successfully parsed file <https://builds.apache.org/job/HBase-TRUNK/6405/artifact/hbase-assembly/target/checkstyle-result.xml> of module with 0 warnings.
[CHECKSTYLE] Successfully parsed file <https://builds.apache.org/job/HBase-TRUNK/6405/artifact/hbase-checkstyle/target/checkstyle-result.xml> of module with 0 warnings.
[CHECKSTYLE] Successfully parsed file <https://builds.apache.org/job/HBase-TRUNK/6405/artifact/hbase-client/target/checkstyle-result.xml> of module with 214 warnings.
[CHECKSTYLE] Successfully parsed file <https://builds.apache.org/job/HBase-TRUNK/6405/artifact/hbase-common/target/checkstyle-result.xml> of module with 125 warnings.
[CHECKSTYLE] Successfully parsed file <https://builds.apache.org/job/HBase-TRUNK/6405/artifact/hbase-examples/target/checkstyle-result.xml> of module with 30 warnings.
[CHECKSTYLE] Successfully parsed file <https://builds.apache.org/job/HBase-TRUNK/6405/artifact/hbase-hadoop-compat/target/checkstyle-result.xml> of module with 2 warnings.
[CHECKSTYLE] Successfully parsed file <https://builds.apache.org/job/HBase-TRUNK/6405/artifact/hbase-hadoop2-compat/target/checkstyle-result.xml> of module with 47 warnings.
[CHECKSTYLE] Successfully parsed file <https://builds.apache.org/job/HBase-TRUNK/6405/artifact/hbase-it/target/checkstyle-result.xml> of module with 0 warnings.
[CHECKSTYLE] Successfully parsed file <https://builds.apache.org/job/HBase-TRUNK/6405/artifact/hbase-prefix-tree/target/checkstyle-result.xml> of module with 25 warnings.
[CHECKSTYLE] Successfully parsed file <https://builds.apache.org/job/HBase-TRUNK/6405/artifact/hbase-procedure/target/checkstyle-result.xml> of module with 0 warnings.
[CHECKSTYLE] Successfully parsed file <https://builds.apache.org/job/HBase-TRUNK/6405/artifact/hbase-protocol/target/checkstyle-result.xml> of module with 3 warnings.
[CHECKSTYLE] Successfully parsed file <https://builds.apache.org/job/HBase-TRUNK/6405/artifact/hbase-rest/target/checkstyle-result.xml> of module with 42 warnings.
[CHECKSTYLE] Successfully parsed file <https://builds.apache.org/job/HBase-TRUNK/6405/artifact/hbase-server/target/checkstyle-result.xml> of module with 1379 warnings.
[CHECKSTYLE] Successfully parsed file <https://builds.apache.org/job/HBase-TRUNK/6405/artifact/hbase-shell/target/checkstyle-result.xml> of module with 0 warnings.
[CHECKSTYLE] Successfully parsed file <https://builds.apache.org/job/HBase-TRUNK/6405/artifact/hbase-testing-util/target/checkstyle-result.xml> of module with 0 warnings.
[CHECKSTYLE] Successfully parsed file <https://builds.apache.org/job/HBase-TRUNK/6405/artifact/hbase-thrift/target/checkstyle-result.xml> of module with 32 warnings.
[CHECKSTYLE] Successfully parsed file <https://builds.apache.org/job/HBase-TRUNK/6405/artifact/target/checkstyle-result.xml> of module with 0 warnings.
[CHECKSTYLE] Computing warning deltas based on reference build #6399
Updating HBASE-13534
Build failed in Jenkins: HBase-TRUNK #6404
Posted by Apache Jenkins Server <je...@builds.apache.org>.
See <https://builds.apache.org/job/HBase-TRUNK/6404/changes>
Changes:
[anoopsamjohn] HBASE-13496 Make Bytes::compareTo inlineable.
[ramkrishna] HBASE-13501 - Deprecate/Remove getComparator() in HRegionInfo. (Ram)
------------------------------------------
[...truncated 4002 lines...]
Running org.apache.hadoop.hbase.client.TestHTableMultiplexerFlushCache
Tests run: 1, Failures: 0, Errors: 0, Skipped: 0, Time elapsed: 5.244 sec - in org.apache.hadoop.hbase.client.TestHTableMultiplexerFlushCache
Running org.apache.hadoop.hbase.TestMultiVersions
Tests run: 3, Failures: 0, Errors: 0, Skipped: 0, Time elapsed: 9.325 sec - in org.apache.hadoop.hbase.TestMultiVersions
Running org.apache.hadoop.hbase.TestHColumnDescriptorDefaultVersions
Running org.apache.hadoop.hbase.procedure.TestZKProcedure
Tests run: 12, Failures: 0, Errors: 0, Skipped: 0, Time elapsed: 120.327 sec - in org.apache.hadoop.hbase.client.TestMetaWithReplicas
Tests run: 4, Failures: 0, Errors: 0, Skipped: 0, Time elapsed: 2.69 sec - in org.apache.hadoop.hbase.procedure.TestZKProcedure
Running org.apache.hadoop.hbase.procedure.TestZKProcedureControllers
Tests run: 4, Failures: 0, Errors: 0, Skipped: 0, Time elapsed: 2.358 sec - in org.apache.hadoop.hbase.procedure.TestZKProcedureControllers
Running org.apache.hadoop.hbase.TestNamespace
Tests run: 3, Failures: 0, Errors: 0, Skipped: 0, Time elapsed: 24.978 sec - in org.apache.hadoop.hbase.TestHColumnDescriptorDefaultVersions
Running org.apache.hadoop.hbase.constraint.TestConstraint
Running org.apache.hadoop.hbase.TestZooKeeper
Tests run: 9, Failures: 0, Errors: 0, Skipped: 1, Time elapsed: 25.815 sec - in org.apache.hadoop.hbase.TestNamespace
Tests run: 5, Failures: 0, Errors: 0, Skipped: 0, Time elapsed: 22.952 sec - in org.apache.hadoop.hbase.constraint.TestConstraint
Running org.apache.hadoop.hbase.snapshot.TestFlushSnapshotFromClient
Tests run: 5, Failures: 0, Errors: 0, Skipped: 0, Time elapsed: 142.912 sec - in org.apache.hadoop.hbase.client.TestRestoreSnapshotFromClient
Running org.apache.hadoop.hbase.snapshot.TestExportSnapshot
Running org.apache.hadoop.hbase.snapshot.TestSecureExportSnapshot
Tests run: 14, Failures: 0, Errors: 0, Skipped: 0, Time elapsed: 277.155 sec - in org.apache.hadoop.hbase.client.TestReplicasClient
Running org.apache.hadoop.hbase.snapshot.TestRestoreFlushSnapshotFromClient
Tests run: 9, Failures: 0, Errors: 0, Skipped: 0, Time elapsed: 85.346 sec - in org.apache.hadoop.hbase.snapshot.TestFlushSnapshotFromClient
Running org.apache.hadoop.hbase.snapshot.TestSnapshotClientRetries
Tests run: 2, Failures: 0, Errors: 0, Skipped: 0, Time elapsed: 21.946 sec - in org.apache.hadoop.hbase.snapshot.TestSnapshotClientRetries
Running org.apache.hadoop.hbase.snapshot.TestSnapshotDescriptionUtils
Tests run: 2, Failures: 0, Errors: 0, Skipped: 0, Time elapsed: 0.18 sec - in org.apache.hadoop.hbase.snapshot.TestSnapshotDescriptionUtils
Running org.apache.hadoop.hbase.TestIOFencing
Tests run: 5, Failures: 0, Errors: 0, Skipped: 0, Time elapsed: 72.221 sec - in org.apache.hadoop.hbase.snapshot.TestRestoreFlushSnapshotFromClient
Running org.apache.hadoop.hbase.coprocessor.TestRegionObserverScannerOpenHook
Tests run: 3, Failures: 0, Errors: 0, Skipped: 0, Time elapsed: 16.018 sec - in org.apache.hadoop.hbase.coprocessor.TestRegionObserverScannerOpenHook
Running org.apache.hadoop.hbase.coprocessor.TestOpenTableInCoprocessor
Tests run: 2, Failures: 0, Errors: 0, Skipped: 0, Time elapsed: 19.597 sec - in org.apache.hadoop.hbase.coprocessor.TestOpenTableInCoprocessor
Running org.apache.hadoop.hbase.coprocessor.TestMasterCoprocessorExceptionWithAbort
Tests run: 12, Failures: 0, Errors: 0, Skipped: 0, Time elapsed: 216.497 sec - in org.apache.hadoop.hbase.TestZooKeeper
Running org.apache.hadoop.hbase.coprocessor.TestCoprocessorTableEndpoint
Tests run: 1, Failures: 0, Errors: 0, Skipped: 0, Time elapsed: 18.901 sec - in org.apache.hadoop.hbase.coprocessor.TestMasterCoprocessorExceptionWithAbort
Tests run: 2, Failures: 0, Errors: 0, Skipped: 0, Time elapsed: 10.718 sec - in org.apache.hadoop.hbase.coprocessor.TestCoprocessorTableEndpoint
Running org.apache.hadoop.hbase.coprocessor.TestRegionServerCoprocessorEndpoint
Tests run: 1, Failures: 0, Errors: 0, Skipped: 0, Time elapsed: 2.113 sec - in org.apache.hadoop.hbase.coprocessor.TestRegionServerCoprocessorEndpoint
Running org.apache.hadoop.hbase.coprocessor.TestRegionObserverInterface
Running org.apache.hadoop.hbase.coprocessor.TestMasterCoprocessorExceptionWithRemove
Tests run: 1, Failures: 0, Errors: 0, Skipped: 0, Time elapsed: 7.9 sec - in org.apache.hadoop.hbase.coprocessor.TestMasterCoprocessorExceptionWithRemove
Running org.apache.hadoop.hbase.coprocessor.TestAggregateProtocol
Tests run: 44, Failures: 0, Errors: 0, Skipped: 0, Time elapsed: 5.896 sec - in org.apache.hadoop.hbase.coprocessor.TestAggregateProtocol
Running org.apache.hadoop.hbase.coprocessor.TestBatchCoprocessorEndpoint
Tests run: 4, Failures: 0, Errors: 0, Skipped: 0, Time elapsed: 2.014 sec - in org.apache.hadoop.hbase.coprocessor.TestBatchCoprocessorEndpoint
Running org.apache.hadoop.hbase.coprocessor.TestHTableWrapper
Tests run: 1, Failures: 0, Errors: 0, Skipped: 0, Time elapsed: 6.317 sec - in org.apache.hadoop.hbase.coprocessor.TestHTableWrapper
Running org.apache.hadoop.hbase.coprocessor.TestRegionServerObserver
Tests run: 13, Failures: 0, Errors: 0, Skipped: 0, Time elapsed: 87.557 sec - in org.apache.hadoop.hbase.coprocessor.TestRegionObserverInterface
Tests run: 2, Failures: 0, Errors: 0, Skipped: 0, Time elapsed: 205.626 sec - in org.apache.hadoop.hbase.TestIOFencing
Running org.apache.hadoop.hbase.coprocessor.TestRegionServerCoprocessorExceptionWithAbort
Running org.apache.hadoop.hbase.coprocessor.TestClassLoading
Tests run: 1, Failures: 0, Errors: 0, Skipped: 0, Time elapsed: 21.05 sec - in org.apache.hadoop.hbase.coprocessor.TestRegionServerObserver
Tests run: 2, Failures: 0, Errors: 0, Skipped: 0, Time elapsed: 21.539 sec - in org.apache.hadoop.hbase.coprocessor.TestRegionServerCoprocessorExceptionWithAbort
Running org.apache.hadoop.hbase.coprocessor.TestDoubleColumnInterpreter
Tests run: 9, Failures: 0, Errors: 0, Skipped: 0, Time elapsed: 333.263 sec - in org.apache.hadoop.hbase.snapshot.TestExportSnapshot
Tests run: 38, Failures: 0, Errors: 0, Skipped: 0, Time elapsed: 4.962 sec - in org.apache.hadoop.hbase.coprocessor.TestDoubleColumnInterpreter
Tests run: 9, Failures: 0, Errors: 0, Skipped: 0, Time elapsed: 324.077 sec - in org.apache.hadoop.hbase.snapshot.TestSecureExportSnapshot
Running org.apache.hadoop.hbase.coprocessor.TestRegionObserverBypass
Tests run: 9, Failures: 0, Errors: 0, Skipped: 0, Time elapsed: 32.137 sec - in org.apache.hadoop.hbase.coprocessor.TestClassLoading
Running org.apache.hadoop.hbase.coprocessor.TestRowProcessorEndpoint
Running org.apache.hadoop.hbase.coprocessor.TestCoprocessorStop
Tests run: 2, Failures: 0, Errors: 0, Skipped: 0, Time elapsed: 9.304 sec - in org.apache.hadoop.hbase.coprocessor.TestRegionObserverBypass
Running org.apache.hadoop.hbase.coprocessor.TestRegionServerCoprocessorExceptionWithRemove
Running org.apache.hadoop.hbase.coprocessor.TestBigDecimalColumnInterpreter
Running org.apache.hadoop.hbase.coprocessor.TestMasterObserver
Tests run: 1, Failures: 0, Errors: 0, Skipped: 0, Time elapsed: 16.296 sec - in org.apache.hadoop.hbase.coprocessor.TestCoprocessorStop
Tests run: 38, Failures: 0, Errors: 0, Skipped: 0, Time elapsed: 5.407 sec - in org.apache.hadoop.hbase.coprocessor.TestBigDecimalColumnInterpreter
Tests run: 4, Failures: 0, Errors: 0, Skipped: 0, Time elapsed: 21.98 sec - in org.apache.hadoop.hbase.coprocessor.TestRowProcessorEndpoint
Tests run: 1, Failures: 0, Errors: 0, Skipped: 0, Time elapsed: 16.167 sec - in org.apache.hadoop.hbase.coprocessor.TestRegionServerCoprocessorExceptionWithRemove
Running org.apache.hadoop.hbase.TestGlobalMemStoreSize
Running org.apache.hadoop.hbase.coprocessor.TestWALObserver
Running org.apache.hadoop.hbase.coprocessor.TestCoprocessorEndpoint
Running org.apache.hadoop.hbase.TestJMXListener
Tests run: 1, Failures: 0, Errors: 0, Skipped: 0, Time elapsed: 17.225 sec - in org.apache.hadoop.hbase.TestGlobalMemStoreSize
Tests run: 6, Failures: 0, Errors: 0, Skipped: 0, Time elapsed: 9.467 sec - in org.apache.hadoop.hbase.coprocessor.TestWALObserver
Running org.apache.hadoop.hbase.TestMetaTableLocator
Tests run: 7, Failures: 0, Errors: 0, Skipped: 0, Time elapsed: 4.015 sec - in org.apache.hadoop.hbase.TestMetaTableLocator
Running org.apache.hadoop.hbase.zookeeper.TestZKMulti
Tests run: 8, Failures: 0, Errors: 0, Skipped: 0, Time elapsed: 0.669 sec - in org.apache.hadoop.hbase.zookeeper.TestZKMulti
Tests run: 2, Failures: 0, Errors: 0, Skipped: 0, Time elapsed: 17.984 sec - in org.apache.hadoop.hbase.TestJMXListener
Tests run: 7, Failures: 0, Errors: 0, Skipped: 0, Time elapsed: 38.279 sec - in org.apache.hadoop.hbase.coprocessor.TestMasterObserver
Running org.apache.hadoop.hbase.zookeeper.lock.TestZKInterProcessReadWriteLock
Running org.apache.hadoop.hbase.zookeeper.TestZooKeeperACL
Tests run: 6, Failures: 0, Errors: 0, Skipped: 0, Time elapsed: 0.271 sec - in org.apache.hadoop.hbase.zookeeper.TestZooKeeperACL
Running org.apache.hadoop.hbase.zookeeper.TestZKLeaderManager
Tests run: 1, Failures: 0, Errors: 0, Skipped: 0, Time elapsed: 0.102 sec - in org.apache.hadoop.hbase.zookeeper.TestZKLeaderManager
Running org.apache.hadoop.hbase.zookeeper.TestRecoverableZooKeeper
Tests run: 1, Failures: 0, Errors: 0, Skipped: 0, Time elapsed: 1.249 sec - in org.apache.hadoop.hbase.zookeeper.TestRecoverableZooKeeper
Running org.apache.hadoop.hbase.zookeeper.TestZooKeeperNodeTracker
Running org.apache.hadoop.hbase.zookeeper.TestHQuorumPeer
Tests run: 3, Failures: 0, Errors: 0, Skipped: 0, Time elapsed: 1.497 sec - in org.apache.hadoop.hbase.zookeeper.TestZooKeeperNodeTracker
Tests run: 4, Failures: 0, Errors: 0, Skipped: 0, Time elapsed: 2.12 sec - in org.apache.hadoop.hbase.zookeeper.TestHQuorumPeer
Running org.apache.hadoop.hbase.TestClusterBootOrder
Running org.apache.hadoop.hbase.TestPartialResultsFromClientSide
Tests run: 6, Failures: 0, Errors: 0, Skipped: 0, Time elapsed: 24.514 sec - in org.apache.hadoop.hbase.zookeeper.lock.TestZKInterProcessReadWriteLock
Tests run: 2, Failures: 0, Errors: 0, Skipped: 0, Time elapsed: 31.389 sec - in org.apache.hadoop.hbase.TestClusterBootOrder
Tests run: 13, Failures: 0, Errors: 0, Skipped: 0, Time elapsed: 76.273 sec - in org.apache.hadoop.hbase.TestPartialResultsFromClientSide
Tests run: 6, Failures: 0, Errors: 0, Skipped: 0, Time elapsed: 553.327 sec - in org.apache.hadoop.hbase.coprocessor.TestCoprocessorEndpoint
Results :
Failed tests:
TestDistributedLogSplitting.testLogReplayTwoSequentialRSDown:650 expected:<1000> but was:<908>
Tests run: 2440, Failures: 1, Errors: 0, Skipped: 17
[INFO] ------------------------------------------------------------------------
[INFO] Reactor Summary:
[INFO]
[INFO] HBase ............................................. SUCCESS [ 2.883 s]
[INFO] HBase - Checkstyle ................................ SUCCESS [ 0.666 s]
[INFO] HBase - Annotations ............................... SUCCESS [ 0.201 s]
[INFO] HBase - Protocol .................................. SUCCESS [ 2.614 s]
[INFO] HBase - Common .................................... SUCCESS [03:16 min]
[INFO] HBase - Procedure ................................. SUCCESS [01:57 min]
[INFO] HBase - Client .................................... SUCCESS [01:47 min]
[INFO] HBase - Hadoop Compatibility ...................... SUCCESS [ 11.168 s]
[INFO] HBase - Hadoop Two Compatibility .................. SUCCESS [ 14.363 s]
[INFO] HBase - Prefix Tree ............................... SUCCESS [ 17.625 s]
[INFO] HBase - Server .................................... FAILURE [ 01:49 h]
[INFO] HBase - Testing Util .............................. SKIPPED
[INFO] HBase - Thrift .................................... SKIPPED
[INFO] HBase - Shell ..................................... SKIPPED
[INFO] HBase - Integration Tests ......................... SKIPPED
[INFO] HBase - Examples .................................. SKIPPED
[INFO] HBase - Rest ...................................... SKIPPED
[INFO] HBase - Assembly .................................. SKIPPED
[INFO] ------------------------------------------------------------------------
[INFO] BUILD FAILURE
[INFO] ------------------------------------------------------------------------
[INFO] Total time: 01:57 h
[INFO] Finished at: 2015-04-23T09:57:25+00:00
[INFO] Final Memory: 60M/564M
[INFO] ------------------------------------------------------------------------
[ERROR] Failed to execute goal org.apache.maven.plugins:maven-surefire-plugin:2.18:test (secondPartTestsExecution) on project hbase-server: There are test failures.
[ERROR]
[ERROR] Please refer to <https://builds.apache.org/job/HBase-TRUNK/ws/hbase-server/target/surefire-reports> for the individual test results.
[ERROR] -> [Help 1]
[ERROR]
[ERROR] To see the full stack trace of the errors, re-run Maven with the -e switch.
[ERROR] Re-run Maven using the -X switch to enable full debug logging.
[ERROR]
[ERROR] For more information about the errors and possible solutions, please read the following articles:
[ERROR] [Help 1] http://cwiki.apache.org/confluence/display/MAVEN/MojoFailureException
[ERROR]
[ERROR] After correcting the problems, you can resume the build with the command
[ERROR] mvn <goals> -rf :hbase-server
Build step 'Invoke top-level Maven targets' marked build as failure
Performing Post build task...
Match found for :.* : True
Logical operation result is TRUE
Running script : ZOMBIE_TESTS_COUNT=`jps | grep surefirebooter | wc -l`
if [[ $ZOMBIE_TESTS_COUNT != 0 ]] ; then
#It seems sometimes the tests are not dying immediately. Let's give them 10s
echo "Suspicious java process found - waiting 10s to see if there are just slow to stop"
sleep 10
ZOMBIE_TESTS_COUNT=`jps | grep surefirebooter | wc -l`
if [[ $ZOMBIE_TESTS_COUNT != 0 ]] ; then
echo "There are $ZOMBIE_TESTS_COUNT zombie tests, they should have been killed by surefire but survived"
echo "************ BEGIN zombies jstack extract"
ZB_STACK=`jps | grep surefirebooter | cut -d ' ' -f 1 | xargs -n 1 jstack | grep ".test" | grep "\.java"`
jps | grep surefirebooter | cut -d ' ' -f 1 | xargs -n 1 jstack
echo "************ END zombies jstack extract"
JIRA_COMMENT="$JIRA_COMMENT
{color:red}-1 core zombie tests{color}. There are ${ZOMBIE_TESTS_COUNT} zombie test(s): ${ZB_STACK}"
BAD=1
jps | grep surefirebooter | cut -d ' ' -f 1 | xargs kill -9
else
echo "We're ok: there is no zombie test, but some tests took some time to stop"
fi
else
echo "We're ok: there is no zombie test"
fi
[HBase-TRUNK] $ /bin/bash -xe /tmp/hudson5294262483334425032.sh
++ jps
++ grep surefirebooter
++ wc -l
+ ZOMBIE_TESTS_COUNT=0
+ [[ 0 != 0 ]]
+ echo 'We'\''re ok: there is no zombie test'
We're ok: there is no zombie test
POST BUILD TASK : SUCCESS
END OF POST BUILD TASK : 0
Archiving artifacts
Sending artifact delta relative to HBase-TRUNK #6399
Archived 2139 artifacts
Archive block size is 32768
Received 80 blocks and 435838970 bytes
Compression is 0.6%
Took 2 min 29 sec
Recording test results
[FINDBUGS] Collecting findbugs analysis files...
[FINDBUGS] Finding all files that match the pattern **/findbugs.xml,**/findbugsXml.xml
[FINDBUGS] Parsing 24 files in <https://builds.apache.org/job/HBase-TRUNK/ws/>
[FINDBUGS] Successfully parsed file <https://builds.apache.org/job/HBase-TRUNK/6404/artifact/hbase-annotations/target/findbugs.xml> of module with 0 warnings.
[FINDBUGS] Successfully parsed file <https://builds.apache.org/job/HBase-TRUNK/6404/artifact/hbase-annotations/target/findbugsXml.xml> of module with 0 warnings.
[FINDBUGS] Successfully parsed file <https://builds.apache.org/job/HBase-TRUNK/6404/artifact/hbase-client/target/findbugs.xml> of module with 0 warnings.
[FINDBUGS] Successfully parsed file <https://builds.apache.org/job/HBase-TRUNK/6404/artifact/hbase-client/target/findbugsXml.xml> of module with 8 warnings.
[FINDBUGS] Successfully parsed file <https://builds.apache.org/job/HBase-TRUNK/6404/artifact/hbase-common/target/findbugs.xml> of module with 0 warnings.
[FINDBUGS] Successfully parsed file <https://builds.apache.org/job/HBase-TRUNK/6404/artifact/hbase-common/target/findbugsXml.xml> of module with 1 warnings.
[FINDBUGS] Successfully parsed file <https://builds.apache.org/job/HBase-TRUNK/6404/artifact/hbase-examples/target/findbugs.xml> of module with 0 warnings.
[FINDBUGS] Successfully parsed file <https://builds.apache.org/job/HBase-TRUNK/6404/artifact/hbase-examples/target/findbugsXml.xml> of module with 0 warnings.
[FINDBUGS] Successfully parsed file <https://builds.apache.org/job/HBase-TRUNK/6404/artifact/hbase-hadoop-compat/target/findbugs.xml> of module with 0 warnings.
[FINDBUGS] Successfully parsed file <https://builds.apache.org/job/HBase-TRUNK/6404/artifact/hbase-hadoop-compat/target/findbugsXml.xml> of module with 0 warnings.
[FINDBUGS] Successfully parsed file <https://builds.apache.org/job/HBase-TRUNK/6404/artifact/hbase-hadoop2-compat/target/findbugs.xml> of module with 0 warnings.
[FINDBUGS] Successfully parsed file <https://builds.apache.org/job/HBase-TRUNK/6404/artifact/hbase-hadoop2-compat/target/findbugsXml.xml> of module with 0 warnings.
[FINDBUGS] Successfully parsed file <https://builds.apache.org/job/HBase-TRUNK/6404/artifact/hbase-prefix-tree/target/findbugs.xml> of module with 0 warnings.
[FINDBUGS] Successfully parsed file <https://builds.apache.org/job/HBase-TRUNK/6404/artifact/hbase-prefix-tree/target/findbugsXml.xml> of module with 0 warnings.
[FINDBUGS] Successfully parsed file <https://builds.apache.org/job/HBase-TRUNK/6404/artifact/hbase-procedure/target/findbugs.xml> of module with 0 warnings.
[FINDBUGS] Successfully parsed file <https://builds.apache.org/job/HBase-TRUNK/6404/artifact/hbase-procedure/target/findbugsXml.xml> of module with 0 warnings.
[FINDBUGS] Successfully parsed file <https://builds.apache.org/job/HBase-TRUNK/6404/artifact/hbase-protocol/target/findbugs.xml> of module with 0 warnings.
[FINDBUGS] Successfully parsed file <https://builds.apache.org/job/HBase-TRUNK/6404/artifact/hbase-protocol/target/findbugsXml.xml> of module with 0 warnings.
[FINDBUGS] Successfully parsed file <https://builds.apache.org/job/HBase-TRUNK/6404/artifact/hbase-rest/target/findbugs.xml> of module with 0 warnings.
[FINDBUGS] Successfully parsed file <https://builds.apache.org/job/HBase-TRUNK/6404/artifact/hbase-rest/target/findbugsXml.xml> of module with 2 warnings.
[FINDBUGS] Successfully parsed file <https://builds.apache.org/job/HBase-TRUNK/6404/artifact/hbase-server/target/findbugs.xml> of module with 0 warnings.
[FINDBUGS] Successfully parsed file <https://builds.apache.org/job/HBase-TRUNK/6404/artifact/hbase-server/target/findbugsXml.xml> of module with 61 warnings.
[FINDBUGS] Successfully parsed file <https://builds.apache.org/job/HBase-TRUNK/6404/artifact/hbase-thrift/target/findbugs.xml> of module with 0 warnings.
[FINDBUGS] Successfully parsed file <https://builds.apache.org/job/HBase-TRUNK/6404/artifact/hbase-thrift/target/findbugsXml.xml> of module with 0 warnings.
[FINDBUGS] Computing warning deltas based on reference build #6399
[CHECKSTYLE] Collecting checkstyle analysis files...
[CHECKSTYLE] Finding all files that match the pattern **/checkstyle-result.xml
[CHECKSTYLE] Parsing 18 files in <https://builds.apache.org/job/HBase-TRUNK/ws/>
[CHECKSTYLE] Successfully parsed file <https://builds.apache.org/job/HBase-TRUNK/6404/artifact/hbase-annotations/target/checkstyle-result.xml> of module with 0 warnings.
[CHECKSTYLE] Successfully parsed file <https://builds.apache.org/job/HBase-TRUNK/6404/artifact/hbase-assembly/target/checkstyle-result.xml> of module with 0 warnings.
[CHECKSTYLE] Successfully parsed file <https://builds.apache.org/job/HBase-TRUNK/6404/artifact/hbase-checkstyle/target/checkstyle-result.xml> of module with 0 warnings.
[CHECKSTYLE] Successfully parsed file <https://builds.apache.org/job/HBase-TRUNK/6404/artifact/hbase-client/target/checkstyle-result.xml> of module with 214 warnings.
[CHECKSTYLE] Successfully parsed file <https://builds.apache.org/job/HBase-TRUNK/6404/artifact/hbase-common/target/checkstyle-result.xml> of module with 125 warnings.
[CHECKSTYLE] Successfully parsed file <https://builds.apache.org/job/HBase-TRUNK/6404/artifact/hbase-examples/target/checkstyle-result.xml> of module with 30 warnings.
[CHECKSTYLE] Successfully parsed file <https://builds.apache.org/job/HBase-TRUNK/6404/artifact/hbase-hadoop-compat/target/checkstyle-result.xml> of module with 2 warnings.
[CHECKSTYLE] Successfully parsed file <https://builds.apache.org/job/HBase-TRUNK/6404/artifact/hbase-hadoop2-compat/target/checkstyle-result.xml> of module with 47 warnings.
[CHECKSTYLE] Successfully parsed file <https://builds.apache.org/job/HBase-TRUNK/6404/artifact/hbase-it/target/checkstyle-result.xml> of module with 0 warnings.
[CHECKSTYLE] Successfully parsed file <https://builds.apache.org/job/HBase-TRUNK/6404/artifact/hbase-prefix-tree/target/checkstyle-result.xml> of module with 25 warnings.
[CHECKSTYLE] Successfully parsed file <https://builds.apache.org/job/HBase-TRUNK/6404/artifact/hbase-procedure/target/checkstyle-result.xml> of module with 0 warnings.
[CHECKSTYLE] Successfully parsed file <https://builds.apache.org/job/HBase-TRUNK/6404/artifact/hbase-protocol/target/checkstyle-result.xml> of module with 3 warnings.
[CHECKSTYLE] Successfully parsed file <https://builds.apache.org/job/HBase-TRUNK/6404/artifact/hbase-rest/target/checkstyle-result.xml> of module with 42 warnings.
[CHECKSTYLE] Successfully parsed file <https://builds.apache.org/job/HBase-TRUNK/6404/artifact/hbase-server/target/checkstyle-result.xml> of module with 1377 warnings.
[CHECKSTYLE] Successfully parsed file <https://builds.apache.org/job/HBase-TRUNK/6404/artifact/hbase-shell/target/checkstyle-result.xml> of module with 0 warnings.
[CHECKSTYLE] Successfully parsed file <https://builds.apache.org/job/HBase-TRUNK/6404/artifact/hbase-testing-util/target/checkstyle-result.xml> of module with 0 warnings.
[CHECKSTYLE] Successfully parsed file <https://builds.apache.org/job/HBase-TRUNK/6404/artifact/hbase-thrift/target/checkstyle-result.xml> of module with 32 warnings.
[CHECKSTYLE] Successfully parsed file <https://builds.apache.org/job/HBase-TRUNK/6404/artifact/target/checkstyle-result.xml> of module with 0 warnings.
[CHECKSTYLE] Computing warning deltas based on reference build #6399
Updating HBASE-13496
Updating HBASE-13501
Build failed in Jenkins: HBase-TRUNK #6403
Posted by Apache Jenkins Server <je...@builds.apache.org>.
See <https://builds.apache.org/job/HBase-TRUNK/6403/changes>
Changes:
[jerryjch] HBASE-13526 TestRegionServerReportForDuty can be flaky: hang or timeout
------------------------------------------
[...truncated 4258 lines...]
at sun.misc.Unsafe.park(Native Method)
- parking to wait for <0xbab1ee88> (a java.util.concurrent.locks.AbstractQueuedSynchronizer$ConditionObject)
at java.util.concurrent.locks.LockSupport.park(LockSupport.java:186)
at java.util.concurrent.locks.AbstractQueuedSynchronizer$ConditionObject.await(AbstractQueuedSynchronizer.java:2043)
at java.util.concurrent.LinkedBlockingQueue.take(LinkedBlockingQueue.java:442)
at org.apache.hadoop.hbase.regionserver.wal.FSHLog$SyncRunner.run(FSHLog.java:1315)
at java.lang.Thread.run(Thread.java:724)
"sync.1" prio=10 tid=0x25801800 nid=0x6ff8 waiting on condition [0x28e7d000]
java.lang.Thread.State: WAITING (parking)
at sun.misc.Unsafe.park(Native Method)
- parking to wait for <0xbab1ec40> (a java.util.concurrent.locks.AbstractQueuedSynchronizer$ConditionObject)
at java.util.concurrent.locks.LockSupport.park(LockSupport.java:186)
at java.util.concurrent.locks.AbstractQueuedSynchronizer$ConditionObject.await(AbstractQueuedSynchronizer.java:2043)
at java.util.concurrent.LinkedBlockingQueue.take(LinkedBlockingQueue.java:442)
at org.apache.hadoop.hbase.regionserver.wal.FSHLog$SyncRunner.run(FSHLog.java:1315)
at java.lang.Thread.run(Thread.java:724)
"sync.0" prio=10 tid=0x25800800 nid=0x6ff7 waiting on condition [0x3197d000]
java.lang.Thread.State: WAITING (parking)
at sun.misc.Unsafe.park(Native Method)
- parking to wait for <0xbab1e9f8> (a java.util.concurrent.locks.AbstractQueuedSynchronizer$ConditionObject)
at java.util.concurrent.locks.LockSupport.park(LockSupport.java:186)
at java.util.concurrent.locks.AbstractQueuedSynchronizer$ConditionObject.await(AbstractQueuedSynchronizer.java:2043)
at java.util.concurrent.LinkedBlockingQueue.take(LinkedBlockingQueue.java:442)
at org.apache.hadoop.hbase.regionserver.wal.FSHLog$SyncRunner.run(FSHLog.java:1315)
at java.lang.Thread.run(Thread.java:724)
"main.append-pool1-t1" prio=10 tid=0x25745c00 nid=0x6ff6 waiting on condition [0x31b7d000]
java.lang.Thread.State: WAITING (parking)
at sun.misc.Unsafe.park(Native Method)
- parking to wait for <0xba9b4d00> (a java.util.concurrent.locks.AbstractQueuedSynchronizer$ConditionObject)
at java.util.concurrent.locks.LockSupport.park(LockSupport.java:186)
at java.util.concurrent.locks.AbstractQueuedSynchronizer$ConditionObject.await(AbstractQueuedSynchronizer.java:2043)
at com.lmax.disruptor.BlockingWaitStrategy.waitFor(BlockingWaitStrategy.java:45)
at com.lmax.disruptor.ProcessingSequenceBarrier.waitFor(ProcessingSequenceBarrier.java:55)
at com.lmax.disruptor.BatchEventProcessor.run(BatchEventProcessor.java:123)
at java.util.concurrent.ThreadPoolExecutor.runWorker(ThreadPoolExecutor.java:1145)
at java.util.concurrent.ThreadPoolExecutor$Worker.run(ThreadPoolExecutor.java:615)
at java.lang.Thread.run(Thread.java:724)
"Timer for 'HBase' metrics system" daemon prio=10 tid=0x24df7c00 nid=0x6fd1 in Object.wait() [0x31d7d000]
java.lang.Thread.State: TIMED_WAITING (on object monitor)
at java.lang.Object.wait(Native Method)
- waiting on <0xba4f1d10> (a java.util.TaskQueue)
at java.util.TimerThread.mainLoop(Timer.java:552)
- locked <0xba4f1d10> (a java.util.TaskQueue)
at java.util.TimerThread.run(Timer.java:505)
"process reaper" daemon prio=10 tid=0x26713000 nid=0x6fad waiting on condition [0x31f2a000]
java.lang.Thread.State: TIMED_WAITING (parking)
at sun.misc.Unsafe.park(Native Method)
- parking to wait for <0xbd3c0068> (a java.util.concurrent.SynchronousQueue$TransferStack)
at java.util.concurrent.locks.LockSupport.parkNanos(LockSupport.java:226)
at java.util.concurrent.SynchronousQueue$TransferStack.awaitFulfill(SynchronousQueue.java:460)
at java.util.concurrent.SynchronousQueue$TransferStack.transfer(SynchronousQueue.java:359)
at java.util.concurrent.SynchronousQueue.poll(SynchronousQueue.java:942)
at java.util.concurrent.ThreadPoolExecutor.getTask(ThreadPoolExecutor.java:1068)
at java.util.concurrent.ThreadPoolExecutor.runWorker(ThreadPoolExecutor.java:1130)
at java.util.concurrent.ThreadPoolExecutor$Worker.run(ThreadPoolExecutor.java:615)
at java.lang.Thread.run(Thread.java:724)
"Service Thread" daemon prio=10 tid=0x28f27000 nid=0x6faa runnable [0x00000000]
java.lang.Thread.State: RUNNABLE
"C2 CompilerThread1" daemon prio=10 tid=0x28f25400 nid=0x6fa9 runnable [0x00000000]
java.lang.Thread.State: RUNNABLE
"C2 CompilerThread0" daemon prio=10 tid=0x28f23400 nid=0x6fa8 runnable [0x00000000]
java.lang.Thread.State: RUNNABLE
"Signal Dispatcher" daemon prio=10 tid=0x28f21800 nid=0x6fa7 runnable [0x00000000]
java.lang.Thread.State: RUNNABLE
"Finalizer" daemon prio=10 tid=0x293e7000 nid=0x6fa6 in Object.wait() [0x3377d000]
java.lang.Thread.State: WAITING (on object monitor)
at java.lang.Object.wait(Native Method)
- waiting on <0xbd3a4f40> (a java.lang.ref.ReferenceQueue$Lock)
at java.lang.ref.ReferenceQueue.remove(ReferenceQueue.java:135)
- locked <0xbd3a4f40> (a java.lang.ref.ReferenceQueue$Lock)
at java.lang.ref.ReferenceQueue.remove(ReferenceQueue.java:151)
at java.lang.ref.Finalizer$FinalizerThread.run(Finalizer.java:189)
"Reference Handler" daemon prio=10 tid=0x293e5000 nid=0x6fa5 in Object.wait() [0x3397d000]
java.lang.Thread.State: WAITING (on object monitor)
at java.lang.Object.wait(Native Method)
- waiting on <0xbd3b83a0> (a java.lang.ref.Reference$Lock)
at java.lang.Object.wait(Object.java:503)
at java.lang.ref.Reference$ReferenceHandler.run(Reference.java:133)
- locked <0xbd3b83a0> (a java.lang.ref.Reference$Lock)
"main" prio=10 tid=0xf6706800 nid=0x6f91 runnable [0xf689b000]
java.lang.Thread.State: RUNNABLE
at org.apache.hadoop.hbase.regionserver.HRegion.doMiniBatchMutation(HRegion.java:2835)
at org.apache.hadoop.hbase.regionserver.HRegion.batchMutate(HRegion.java:2761)
at org.apache.hadoop.hbase.regionserver.HRegion.batchMutate(HRegion.java:2703)
at org.apache.hadoop.hbase.regionserver.HRegion.batchMutate(HRegion.java:2707)
at org.apache.hadoop.hbase.regionserver.HRegion.doBatchMutate(HRegion.java:3401)
at org.apache.hadoop.hbase.regionserver.HRegion.put(HRegion.java:2580)
at org.apache.hadoop.hbase.HBaseTestCase$HRegionIncommon.put(HBaseTestCase.java:447)
at org.apache.hadoop.hbase.HBaseTestCase.addContent(HBaseTestCase.java:356)
at org.apache.hadoop.hbase.HBaseTestCase.addContent(HBaseTestCase.java:242)
at org.apache.hadoop.hbase.regionserver.TestBlocksScanned._testBlocksScanned(TestBlocksScanned.java:91)
at org.apache.hadoop.hbase.regionserver.TestBlocksScanned.testBlocksScannedWithEncoding(TestBlocksScanned.java:86)
at sun.reflect.NativeMethodAccessorImpl.invoke0(Native Method)
at sun.reflect.NativeMethodAccessorImpl.invoke(NativeMethodAccessorImpl.java:57)
at sun.reflect.DelegatingMethodAccessorImpl.invoke(DelegatingMethodAccessorImpl.java:43)
at java.lang.reflect.Method.invoke(Method.java:606)
at junit.framework.TestCase.runTest(TestCase.java:176)
at junit.framework.TestCase.runBare(TestCase.java:141)
at junit.framework.TestResult$1.protect(TestResult.java:122)
at junit.framework.TestResult.runProtected(TestResult.java:142)
at junit.framework.TestResult.run(TestResult.java:125)
at junit.framework.TestCase.run(TestCase.java:129)
at junit.framework.TestSuite.runTest(TestSuite.java:255)
at junit.framework.TestSuite.run(TestSuite.java:250)
at org.junit.internal.runners.JUnit38ClassRunner.run(JUnit38ClassRunner.java:84)
at org.junit.runners.Suite.runChild(Suite.java:127)
at org.junit.runners.Suite.runChild(Suite.java:26)
at org.junit.runners.ParentRunner$3.run(ParentRunner.java:238)
at org.junit.runners.ParentRunner$1.schedule(ParentRunner.java:63)
at org.junit.runners.ParentRunner.runChildren(ParentRunner.java:236)
at org.junit.runners.ParentRunner.access$000(ParentRunner.java:53)
at org.junit.runners.ParentRunner$2.evaluate(ParentRunner.java:229)
at org.junit.runners.ParentRunner.run(ParentRunner.java:309)
at org.junit.runner.JUnitCore.run(JUnitCore.java:160)
at org.junit.runner.JUnitCore.run(JUnitCore.java:138)
at org.apache.maven.surefire.junitcore.JUnitCoreWrapper.createRequestAndRun(JUnitCoreWrapper.java:107)
at org.apache.maven.surefire.junitcore.JUnitCoreWrapper.executeEager(JUnitCoreWrapper.java:77)
at org.apache.maven.surefire.junitcore.JUnitCoreWrapper.execute(JUnitCoreWrapper.java:53)
at org.apache.maven.surefire.junitcore.JUnitCoreProvider.invoke(JUnitCoreProvider.java:144)
at org.apache.maven.surefire.booter.ForkedBooter.invokeProviderInSameClassLoader(ForkedBooter.java:203)
at org.apache.maven.surefire.booter.ForkedBooter.runSuitesInProcess(ForkedBooter.java:155)
at org.apache.maven.surefire.booter.ForkedBooter.main(ForkedBooter.java:103)
"VM Thread" prio=10 tid=0x296f8800 nid=0x6fa4 runnable
"GC task thread#0 (ParallelGC)" prio=10 tid=0xf6710c00 nid=0x6f92 runnable
"GC task thread#1 (ParallelGC)" prio=10 tid=0xf6712000 nid=0x6f93 runnable
"GC task thread#2 (ParallelGC)" prio=10 tid=0xf6713800 nid=0x6f94 runnable
"GC task thread#3 (ParallelGC)" prio=10 tid=0xf6715000 nid=0x6f95 runnable
"GC task thread#4 (ParallelGC)" prio=10 tid=0xf6716400 nid=0x6f96 runnable
"GC task thread#5 (ParallelGC)" prio=10 tid=0xf6717c00 nid=0x6f97 runnable
"GC task thread#6 (ParallelGC)" prio=10 tid=0xf6719400 nid=0x6f98 runnable
"GC task thread#7 (ParallelGC)" prio=10 tid=0xf671a800 nid=0x6f99 runnable
"GC task thread#8 (ParallelGC)" prio=10 tid=0xf671c000 nid=0x6f9a runnable
"GC task thread#9 (ParallelGC)" prio=10 tid=0xf671d800 nid=0x6f9b runnable
"GC task thread#10 (ParallelGC)" prio=10 tid=0xf671f000 nid=0x6f9c runnable
"GC task thread#11 (ParallelGC)" prio=10 tid=0xf6720400 nid=0x6f9d runnable
"GC task thread#12 (ParallelGC)" prio=10 tid=0xf6721c00 nid=0x6f9e runnable
"GC task thread#13 (ParallelGC)" prio=10 tid=0xf6723400 nid=0x6f9f runnable
"GC task thread#14 (ParallelGC)" prio=10 tid=0xf6724800 nid=0x6fa0 runnable
"GC task thread#15 (ParallelGC)" prio=10 tid=0xf6726000 nid=0x6fa1 runnable
"GC task thread#16 (ParallelGC)" prio=10 tid=0xf6727800 nid=0x6fa2 runnable
"GC task thread#17 (ParallelGC)" prio=10 tid=0xf6728c00 nid=0x6fa3 runnable
"VM Periodic Task Thread" prio=10 tid=0x28f29000 nid=0x6fab waiting on condition
JNI global references: 333
+ echo '************ END zombies jstack extract'
************ END zombies jstack extract
+ JIRA_COMMENT='
{color:red}-1 core zombie tests{color}. There are 1 zombie test(s): at org.apache.hadoop.hbase.regionserver.TestBlocksScanned._testBlocksScanned(TestBlocksScanned.java:91)
at org.apache.hadoop.hbase.regionserver.TestBlocksScanned.testBlocksScannedWithEncoding(TestBlocksScanned.java:86)'
+ BAD=1
+ jps
+ grep surefirebooter
+ cut -d ' ' -f 1
+ xargs kill -9
POST BUILD TASK : SUCCESS
END OF POST BUILD TASK : 0
Archiving artifacts
Sending artifact delta relative to HBase-TRUNK #6399
Archived 2129 artifacts
Archive block size is 32768
Received 70 blocks and 415312897 bytes
Compression is 0.5%
Took 2 min 35 sec
Recording test results
[FINDBUGS] Collecting findbugs analysis files...
[FINDBUGS] Finding all files that match the pattern **/findbugs.xml,**/findbugsXml.xml
[FINDBUGS] Parsing 24 files in <https://builds.apache.org/job/HBase-TRUNK/ws/>
[FINDBUGS] Successfully parsed file <https://builds.apache.org/job/HBase-TRUNK/6403/artifact/hbase-annotations/target/findbugs.xml> of module with 0 warnings.
[FINDBUGS] Successfully parsed file <https://builds.apache.org/job/HBase-TRUNK/6403/artifact/hbase-annotations/target/findbugsXml.xml> of module with 0 warnings.
[FINDBUGS] Successfully parsed file <https://builds.apache.org/job/HBase-TRUNK/6403/artifact/hbase-client/target/findbugs.xml> of module with 0 warnings.
[FINDBUGS] Successfully parsed file <https://builds.apache.org/job/HBase-TRUNK/6403/artifact/hbase-client/target/findbugsXml.xml> of module with 8 warnings.
[FINDBUGS] Successfully parsed file <https://builds.apache.org/job/HBase-TRUNK/6403/artifact/hbase-common/target/findbugs.xml> of module with 0 warnings.
[FINDBUGS] Successfully parsed file <https://builds.apache.org/job/HBase-TRUNK/6403/artifact/hbase-common/target/findbugsXml.xml> of module with 1 warnings.
[FINDBUGS] Successfully parsed file <https://builds.apache.org/job/HBase-TRUNK/6403/artifact/hbase-examples/target/findbugs.xml> of module with 0 warnings.
[FINDBUGS] Successfully parsed file <https://builds.apache.org/job/HBase-TRUNK/6403/artifact/hbase-examples/target/findbugsXml.xml> of module with 0 warnings.
[FINDBUGS] Successfully parsed file <https://builds.apache.org/job/HBase-TRUNK/6403/artifact/hbase-hadoop-compat/target/findbugs.xml> of module with 0 warnings.
[FINDBUGS] Successfully parsed file <https://builds.apache.org/job/HBase-TRUNK/6403/artifact/hbase-hadoop-compat/target/findbugsXml.xml> of module with 0 warnings.
[FINDBUGS] Successfully parsed file <https://builds.apache.org/job/HBase-TRUNK/6403/artifact/hbase-hadoop2-compat/target/findbugs.xml> of module with 0 warnings.
[FINDBUGS] Successfully parsed file <https://builds.apache.org/job/HBase-TRUNK/6403/artifact/hbase-hadoop2-compat/target/findbugsXml.xml> of module with 0 warnings.
[FINDBUGS] Successfully parsed file <https://builds.apache.org/job/HBase-TRUNK/6403/artifact/hbase-prefix-tree/target/findbugs.xml> of module with 0 warnings.
[FINDBUGS] Successfully parsed file <https://builds.apache.org/job/HBase-TRUNK/6403/artifact/hbase-prefix-tree/target/findbugsXml.xml> of module with 0 warnings.
[FINDBUGS] Successfully parsed file <https://builds.apache.org/job/HBase-TRUNK/6403/artifact/hbase-procedure/target/findbugs.xml> of module with 0 warnings.
[FINDBUGS] Successfully parsed file <https://builds.apache.org/job/HBase-TRUNK/6403/artifact/hbase-procedure/target/findbugsXml.xml> of module with 0 warnings.
[FINDBUGS] Successfully parsed file <https://builds.apache.org/job/HBase-TRUNK/6403/artifact/hbase-protocol/target/findbugs.xml> of module with 0 warnings.
[FINDBUGS] Successfully parsed file <https://builds.apache.org/job/HBase-TRUNK/6403/artifact/hbase-protocol/target/findbugsXml.xml> of module with 0 warnings.
[FINDBUGS] Successfully parsed file <https://builds.apache.org/job/HBase-TRUNK/6403/artifact/hbase-rest/target/findbugs.xml> of module with 0 warnings.
[FINDBUGS] Successfully parsed file <https://builds.apache.org/job/HBase-TRUNK/6403/artifact/hbase-rest/target/findbugsXml.xml> of module with 2 warnings.
[FINDBUGS] Successfully parsed file <https://builds.apache.org/job/HBase-TRUNK/6403/artifact/hbase-server/target/findbugs.xml> of module with 0 warnings.
[FINDBUGS] Successfully parsed file <https://builds.apache.org/job/HBase-TRUNK/6403/artifact/hbase-server/target/findbugsXml.xml> of module with 60 warnings.
[FINDBUGS] Successfully parsed file <https://builds.apache.org/job/HBase-TRUNK/6403/artifact/hbase-thrift/target/findbugs.xml> of module with 0 warnings.
[FINDBUGS] Successfully parsed file <https://builds.apache.org/job/HBase-TRUNK/6403/artifact/hbase-thrift/target/findbugsXml.xml> of module with 0 warnings.
[FINDBUGS] Computing warning deltas based on reference build #6399
[CHECKSTYLE] Collecting checkstyle analysis files...
[CHECKSTYLE] Finding all files that match the pattern **/checkstyle-result.xml
[CHECKSTYLE] Parsing 18 files in <https://builds.apache.org/job/HBase-TRUNK/ws/>
[CHECKSTYLE] Successfully parsed file <https://builds.apache.org/job/HBase-TRUNK/6403/artifact/hbase-annotations/target/checkstyle-result.xml> of module with 0 warnings.
[CHECKSTYLE] Successfully parsed file <https://builds.apache.org/job/HBase-TRUNK/6403/artifact/hbase-assembly/target/checkstyle-result.xml> of module with 0 warnings.
[CHECKSTYLE] Successfully parsed file <https://builds.apache.org/job/HBase-TRUNK/6403/artifact/hbase-checkstyle/target/checkstyle-result.xml> of module with 0 warnings.
[CHECKSTYLE] Successfully parsed file <https://builds.apache.org/job/HBase-TRUNK/6403/artifact/hbase-client/target/checkstyle-result.xml> of module with 214 warnings.
[CHECKSTYLE] Successfully parsed file <https://builds.apache.org/job/HBase-TRUNK/6403/artifact/hbase-common/target/checkstyle-result.xml> of module with 125 warnings.
[CHECKSTYLE] Successfully parsed file <https://builds.apache.org/job/HBase-TRUNK/6403/artifact/hbase-examples/target/checkstyle-result.xml> of module with 30 warnings.
[CHECKSTYLE] Successfully parsed file <https://builds.apache.org/job/HBase-TRUNK/6403/artifact/hbase-hadoop-compat/target/checkstyle-result.xml> of module with 2 warnings.
[CHECKSTYLE] Successfully parsed file <https://builds.apache.org/job/HBase-TRUNK/6403/artifact/hbase-hadoop2-compat/target/checkstyle-result.xml> of module with 47 warnings.
[CHECKSTYLE] Successfully parsed file <https://builds.apache.org/job/HBase-TRUNK/6403/artifact/hbase-it/target/checkstyle-result.xml> of module with 0 warnings.
[CHECKSTYLE] Successfully parsed file <https://builds.apache.org/job/HBase-TRUNK/6403/artifact/hbase-prefix-tree/target/checkstyle-result.xml> of module with 25 warnings.
[CHECKSTYLE] Successfully parsed file <https://builds.apache.org/job/HBase-TRUNK/6403/artifact/hbase-procedure/target/checkstyle-result.xml> of module with 0 warnings.
[CHECKSTYLE] Successfully parsed file <https://builds.apache.org/job/HBase-TRUNK/6403/artifact/hbase-protocol/target/checkstyle-result.xml> of module with 3 warnings.
[CHECKSTYLE] Successfully parsed file <https://builds.apache.org/job/HBase-TRUNK/6403/artifact/hbase-rest/target/checkstyle-result.xml> of module with 42 warnings.
[CHECKSTYLE] Successfully parsed file <https://builds.apache.org/job/HBase-TRUNK/6403/artifact/hbase-server/target/checkstyle-result.xml> of module with 1377 warnings.
[CHECKSTYLE] Successfully parsed file <https://builds.apache.org/job/HBase-TRUNK/6403/artifact/hbase-shell/target/checkstyle-result.xml> of module with 0 warnings.
[CHECKSTYLE] Successfully parsed file <https://builds.apache.org/job/HBase-TRUNK/6403/artifact/hbase-testing-util/target/checkstyle-result.xml> of module with 0 warnings.
[CHECKSTYLE] Successfully parsed file <https://builds.apache.org/job/HBase-TRUNK/6403/artifact/hbase-thrift/target/checkstyle-result.xml> of module with 32 warnings.
[CHECKSTYLE] Successfully parsed file <https://builds.apache.org/job/HBase-TRUNK/6403/artifact/target/checkstyle-result.xml> of module with 0 warnings.
[CHECKSTYLE] Computing warning deltas based on reference build #6399
Updating HBASE-13526
Build failed in Jenkins: HBase-TRUNK #6402
Posted by Apache Jenkins Server <je...@builds.apache.org>.
See <https://builds.apache.org/job/HBase-TRUNK/6402/changes>
Changes:
[stack] HBASE-13527 The default value for hbase.client.scanner.max.result.size is never actually set on Scans
------------------------------------------
[...truncated 4014 lines...]
Running org.apache.hadoop.hbase.backup.TestHFileArchiving
Running org.apache.hadoop.hbase.zookeeper.TestRecoverableZooKeeper
Tests run: 1, Failures: 0, Errors: 0, Skipped: 0, Time elapsed: 1.293 sec - in org.apache.hadoop.hbase.zookeeper.TestRecoverableZooKeeper
Running org.apache.hadoop.hbase.zookeeper.TestZKLeaderManager
Tests run: 1, Failures: 0, Errors: 0, Skipped: 0, Time elapsed: 0.129 sec - in org.apache.hadoop.hbase.zookeeper.TestZKLeaderManager
Running org.apache.hadoop.hbase.zookeeper.TestZooKeeperACL
Tests run: 6, Failures: 0, Errors: 0, Skipped: 0, Time elapsed: 0.398 sec - in org.apache.hadoop.hbase.zookeeper.TestZooKeeperACL
Tests run: 6, Failures: 0, Errors: 0, Skipped: 0, Time elapsed: 24.554 sec - in org.apache.hadoop.hbase.zookeeper.lock.TestZKInterProcessReadWriteLock
Running org.apache.hadoop.hbase.zookeeper.TestZooKeeperNodeTracker
Running org.apache.hadoop.hbase.zookeeper.TestZKMulti
Tests run: 8, Failures: 0, Errors: 0, Skipped: 0, Time elapsed: 0.704 sec - in org.apache.hadoop.hbase.zookeeper.TestZKMulti
Tests run: 3, Failures: 0, Errors: 0, Skipped: 0, Time elapsed: 1.502 sec - in org.apache.hadoop.hbase.zookeeper.TestZooKeeperNodeTracker
Running org.apache.hadoop.hbase.TestPartialResultsFromClientSide
Running org.apache.hadoop.hbase.mapreduce.TestTableInputFormatScan2
Tests run: 5, Failures: 0, Errors: 0, Skipped: 0, Time elapsed: 78.546 sec - in org.apache.hadoop.hbase.backup.TestHFileArchiving
Tests run: 13, Failures: 0, Errors: 0, Skipped: 0, Time elapsed: 74.36 sec - in org.apache.hadoop.hbase.TestPartialResultsFromClientSide
Running org.apache.hadoop.hbase.mapreduce.TestTableMapReduce
Running org.apache.hadoop.hbase.mapreduce.TestHLogRecordReader
Tests run: 2, Failures: 0, Errors: 0, Skipped: 0, Time elapsed: 2.245 sec - in org.apache.hadoop.hbase.mapreduce.TestHLogRecordReader
Tests run: 31, Failures: 0, Errors: 0, Skipped: 0, Time elapsed: 213.829 sec - in org.apache.hadoop.hbase.wal.TestWALSplit
Running org.apache.hadoop.hbase.mapreduce.TestImportExport
Tests run: 31, Failures: 0, Errors: 0, Skipped: 0, Time elapsed: 218.845 sec - in org.apache.hadoop.hbase.wal.TestWALSplitCompressed
Running org.apache.hadoop.hbase.mapreduce.TestWALPlayer
Running org.apache.hadoop.hbase.mapreduce.TestCopyTable
Tests run: 4, Failures: 0, Errors: 0, Skipped: 0, Time elapsed: 65.309 sec - in org.apache.hadoop.hbase.mapreduce.TestWALPlayer
Running org.apache.hadoop.hbase.mapreduce.TestImportTSVWithOperationAttributes
Tests run: 2, Failures: 0, Errors: 0, Skipped: 0, Time elapsed: 184.091 sec - in org.apache.hadoop.hbase.mapreduce.TestTableMapReduce
Running org.apache.hadoop.hbase.mapreduce.TestRowCounter
Tests run: 7, Failures: 0, Errors: 0, Skipped: 0, Time elapsed: 280.281 sec - in org.apache.hadoop.hbase.mapreduce.TestTableInputFormatScan2
Running org.apache.hadoop.hbase.mapreduce.TestImportTsv
Tests run: 5, Failures: 0, Errors: 0, Skipped: 0, Time elapsed: 165.084 sec - in org.apache.hadoop.hbase.mapreduce.TestCopyTable
Tests run: 2, Failures: 0, Errors: 0, Skipped: 0, Time elapsed: 101.661 sec - in org.apache.hadoop.hbase.mapreduce.TestImportTSVWithOperationAttributes
Running org.apache.hadoop.hbase.mapreduce.TestLoadIncrementalHFilesUseSecurityEndPoint
Running org.apache.hadoop.hbase.mapreduce.TestSecureLoadIncrementalHFiles
Tests run: 16, Failures: 0, Errors: 0, Skipped: 0, Time elapsed: 113.686 sec - in org.apache.hadoop.hbase.mapreduce.TestLoadIncrementalHFilesUseSecurityEndPoint
Tests run: 16, Failures: 0, Errors: 0, Skipped: 0, Time elapsed: 111.982 sec - in org.apache.hadoop.hbase.mapreduce.TestSecureLoadIncrementalHFiles
Running org.apache.hadoop.hbase.mapreduce.TestTimeRangeMapRed
Tests run: 6, Failures: 0, Errors: 0, Skipped: 0, Time elapsed: 218.572 sec - in org.apache.hadoop.hbase.mapreduce.TestRowCounter
Running org.apache.hadoop.hbase.mapreduce.TestTableSnapshotInputFormat
Running org.apache.hadoop.hbase.mapreduce.TestTableInputFormat
Tests run: 1, Failures: 0, Errors: 0, Skipped: 0, Time elapsed: 59.8 sec - in org.apache.hadoop.hbase.mapreduce.TestTimeRangeMapRed
Running org.apache.hadoop.hbase.mapreduce.TestImportTSVWithTTLs
Tests run: 12, Failures: 0, Errors: 0, Skipped: 0, Time elapsed: 478.61 sec - in org.apache.hadoop.hbase.mapreduce.TestImportExport
Tests run: 8, Failures: 0, Errors: 0, Skipped: 0, Time elapsed: 101.906 sec - in org.apache.hadoop.hbase.mapreduce.TestTableInputFormat
Running org.apache.hadoop.hbase.mapreduce.TestLoadIncrementalHFiles
Tests run: 10, Failures: 0, Errors: 0, Skipped: 0, Time elapsed: 302.598 sec - in org.apache.hadoop.hbase.mapreduce.TestImportTsv
Running org.apache.hadoop.hbase.mapreduce.TestHRegionPartitioner
Running org.apache.hadoop.hbase.mapreduce.TestLoadIncrementalHFilesSplitRecovery
Tests run: 1, Failures: 0, Errors: 0, Skipped: 0, Time elapsed: 6.115 sec - in org.apache.hadoop.hbase.mapreduce.TestHRegionPartitioner
Tests run: 1, Failures: 0, Errors: 0, Skipped: 0, Time elapsed: 67.394 sec - in org.apache.hadoop.hbase.mapreduce.TestImportTSVWithTTLs
Running org.apache.hadoop.hbase.mapreduce.TestHFileOutputFormat
Running org.apache.hadoop.hbase.mapreduce.TestImportTSVWithVisibilityLabels
Tests run: 5, Failures: 0, Errors: 0, Skipped: 0, Time elapsed: 43.069 sec - in org.apache.hadoop.hbase.mapreduce.TestLoadIncrementalHFilesSplitRecovery
Running org.apache.hadoop.hbase.mapreduce.TestMultithreadedTableMapper
Tests run: 16, Failures: 0, Errors: 0, Skipped: 0, Time elapsed: 114.13 sec - in org.apache.hadoop.hbase.mapreduce.TestLoadIncrementalHFiles
Running org.apache.hadoop.hbase.mapreduce.TestHFileOutputFormat2
Tests run: 1, Failures: 0, Errors: 0, Skipped: 0, Time elapsed: 109.924 sec - in org.apache.hadoop.hbase.mapreduce.TestMultithreadedTableMapper
Tests run: 7, Failures: 0, Errors: 0, Skipped: 0, Time elapsed: 339.36 sec - in org.apache.hadoop.hbase.mapreduce.TestTableSnapshotInputFormat
Running org.apache.hadoop.hbase.mapreduce.TestTableInputFormatScan1
Running org.apache.hadoop.hbase.mapreduce.TestCellCounter
Tests run: 5, Failures: 0, Errors: 0, Skipped: 0, Time elapsed: 221.966 sec - in org.apache.hadoop.hbase.mapreduce.TestImportTSVWithVisibilityLabels
Running org.apache.hadoop.hbase.mapreduce.TestWALRecordReader
Tests run: 2, Failures: 0, Errors: 0, Skipped: 0, Time elapsed: 1.903 sec - in org.apache.hadoop.hbase.mapreduce.TestWALRecordReader
Running org.apache.hadoop.hbase.mapreduce.TestMultiTableInputFormat
Tests run: 13, Failures: 0, Errors: 0, Skipped: 1, Time elapsed: 319.039 sec - in org.apache.hadoop.hbase.mapreduce.TestHFileOutputFormat
Running org.apache.hadoop.hbase.mapreduce.TestSecureLoadIncrementalHFilesSplitRecovery
Tests run: 5, Failures: 0, Errors: 0, Skipped: 0, Time elapsed: 34.874 sec - in org.apache.hadoop.hbase.mapreduce.TestSecureLoadIncrementalHFilesSplitRecovery
Tests run: 13, Failures: 0, Errors: 0, Skipped: 1, Time elapsed: 330.541 sec - in org.apache.hadoop.hbase.mapreduce.TestHFileOutputFormat2
Running org.apache.hadoop.hbase.filter.TestMultiRowRangeFilter
Running org.apache.hadoop.hbase.filter.TestScanRowPrefix
Tests run: 1, Failures: 0, Errors: 0, Skipped: 0, Time elapsed: 5.835 sec - in org.apache.hadoop.hbase.filter.TestScanRowPrefix
Tests run: 18, Failures: 0, Errors: 0, Skipped: 0, Time elapsed: 26.895 sec - in org.apache.hadoop.hbase.filter.TestMultiRowRangeFilter
Running org.apache.hadoop.hbase.filter.TestFilterWithScanLimits
Tests run: 7, Failures: 0, Errors: 0, Skipped: 0, Time elapsed: 236.362 sec - in org.apache.hadoop.hbase.mapreduce.TestCellCounter
Running org.apache.hadoop.hbase.filter.TestFuzzyRowAndColumnRangeFilter
Tests run: 1, Failures: 0, Errors: 0, Skipped: 0, Time elapsed: 5.088 sec - in org.apache.hadoop.hbase.filter.TestFilterWithScanLimits
Tests run: 1, Failures: 0, Errors: 0, Skipped: 0, Time elapsed: 3.818 sec - in org.apache.hadoop.hbase.filter.TestFuzzyRowAndColumnRangeFilter
Running org.apache.hadoop.hbase.filter.TestColumnRangeFilter
Running org.apache.hadoop.hbase.filter.TestFilterWrapper
Tests run: 7, Failures: 0, Errors: 0, Skipped: 0, Time elapsed: 261.685 sec - in org.apache.hadoop.hbase.mapreduce.TestTableInputFormatScan1
Running org.apache.hadoop.hbase.TestMetaTableAccessor
Tests run: 1, Failures: 0, Errors: 0, Skipped: 0, Time elapsed: 5.873 sec - in org.apache.hadoop.hbase.filter.TestFilterWrapper
Tests run: 1, Failures: 0, Errors: 0, Skipped: 0, Time elapsed: 11.177 sec - in org.apache.hadoop.hbase.filter.TestColumnRangeFilter
Tests run: 4, Failures: 0, Errors: 0, Skipped: 0, Time elapsed: 189.413 sec - in org.apache.hadoop.hbase.mapreduce.TestMultiTableInputFormat
Tests run: 12, Failures: 0, Errors: 0, Skipped: 0, Time elapsed: 17.657 sec - in org.apache.hadoop.hbase.TestMetaTableAccessor
Results :
Failed tests:
TestSnapshotCloneIndependence.testOnlineSnapshotDeleteIndependent:182->runTestSnapshotDeleteIndependent:425 expected:<17576> but was:<14046>
Tests run: 2440, Failures: 1, Errors: 0, Skipped: 17
[INFO] ------------------------------------------------------------------------
[INFO] Reactor Summary:
[INFO]
[INFO] HBase ............................................. SUCCESS [ 2.887 s]
[INFO] HBase - Checkstyle ................................ SUCCESS [ 0.664 s]
[INFO] HBase - Annotations ............................... SUCCESS [ 0.185 s]
[INFO] HBase - Protocol .................................. SUCCESS [ 2.647 s]
[INFO] HBase - Common .................................... SUCCESS [03:09 min]
[INFO] HBase - Procedure ................................. SUCCESS [01:56 min]
[INFO] HBase - Client .................................... SUCCESS [01:46 min]
[INFO] HBase - Hadoop Compatibility ...................... SUCCESS [ 11.186 s]
[INFO] HBase - Hadoop Two Compatibility .................. SUCCESS [ 14.256 s]
[INFO] HBase - Prefix Tree ............................... SUCCESS [ 17.777 s]
[INFO] HBase - Server .................................... FAILURE [ 01:48 h]
[INFO] HBase - Testing Util .............................. SKIPPED
[INFO] HBase - Thrift .................................... SKIPPED
[INFO] HBase - Shell ..................................... SKIPPED
[INFO] HBase - Integration Tests ......................... SKIPPED
[INFO] HBase - Examples .................................. SKIPPED
[INFO] HBase - Rest ...................................... SKIPPED
[INFO] HBase - Assembly .................................. SKIPPED
[INFO] ------------------------------------------------------------------------
[INFO] BUILD FAILURE
[INFO] ------------------------------------------------------------------------
[INFO] Total time: 01:56 h
[INFO] Finished at: 2015-04-22T23:10:04+00:00
[INFO] Final Memory: 60M/542M
[INFO] ------------------------------------------------------------------------
[ERROR] Failed to execute goal org.apache.maven.plugins:maven-surefire-plugin:2.18:test (secondPartTestsExecution) on project hbase-server: There are test failures.
[ERROR]
[ERROR] Please refer to <https://builds.apache.org/job/HBase-TRUNK/ws/hbase-server/target/surefire-reports> for the individual test results.
[ERROR] -> [Help 1]
[ERROR]
[ERROR] To see the full stack trace of the errors, re-run Maven with the -e switch.
[ERROR] Re-run Maven using the -X switch to enable full debug logging.
[ERROR]
[ERROR] For more information about the errors and possible solutions, please read the following articles:
[ERROR] [Help 1] http://cwiki.apache.org/confluence/display/MAVEN/MojoFailureException
[ERROR]
[ERROR] After correcting the problems, you can resume the build with the command
[ERROR] mvn <goals> -rf :hbase-server
Build step 'Invoke top-level Maven targets' marked build as failure
Performing Post build task...
Match found for :.* : True
Logical operation result is TRUE
Running script : ZOMBIE_TESTS_COUNT=`jps | grep surefirebooter | wc -l`
if [[ $ZOMBIE_TESTS_COUNT != 0 ]] ; then
#It seems sometimes the tests are not dying immediately. Let's give them 10s
echo "Suspicious java process found - waiting 10s to see if there are just slow to stop"
sleep 10
ZOMBIE_TESTS_COUNT=`jps | grep surefirebooter | wc -l`
if [[ $ZOMBIE_TESTS_COUNT != 0 ]] ; then
echo "There are $ZOMBIE_TESTS_COUNT zombie tests, they should have been killed by surefire but survived"
echo "************ BEGIN zombies jstack extract"
ZB_STACK=`jps | grep surefirebooter | cut -d ' ' -f 1 | xargs -n 1 jstack | grep ".test" | grep "\.java"`
jps | grep surefirebooter | cut -d ' ' -f 1 | xargs -n 1 jstack
echo "************ END zombies jstack extract"
JIRA_COMMENT="$JIRA_COMMENT
{color:red}-1 core zombie tests{color}. There are ${ZOMBIE_TESTS_COUNT} zombie test(s): ${ZB_STACK}"
BAD=1
jps | grep surefirebooter | cut -d ' ' -f 1 | xargs kill -9
else
echo "We're ok: there is no zombie test, but some tests took some time to stop"
fi
else
echo "We're ok: there is no zombie test"
fi
[HBase-TRUNK] $ /bin/bash -xe /tmp/hudson3789643815305673093.sh
++ jps
++ grep surefirebooter
++ wc -l
+ ZOMBIE_TESTS_COUNT=1
+ [[ 1 != 0 ]]
+ echo 'Suspicious java process found - waiting 10s to see if there are just slow to stop'
Suspicious java process found - waiting 10s to see if there are just slow to stop
+ sleep 10
++ jps
++ grep surefirebooter
++ wc -l
+ ZOMBIE_TESTS_COUNT=1
+ [[ 1 != 0 ]]
+ echo 'There are 1 zombie tests, they should have been killed by surefire but survived'
There are 1 zombie tests, they should have been killed by surefire but survived
+ echo '************ BEGIN zombies jstack extract'
************ BEGIN zombies jstack extract
++ jps
++ cut -d ' ' -f 1
++ grep surefirebooter
++ grep '\.java'
++ grep .test
++ xargs -n 1 jstack
+ ZB_STACK=
POST BUILD TASK : FAILURE
END OF POST BUILD TASK : 0
Archiving artifacts
Sending artifact delta relative to HBase-TRUNK #6399
Archived 2139 artifacts
Archive block size is 32768
Received 87 blocks and 420805618 bytes
Compression is 0.7%
Took 3 min 3 sec
Recording test results
[FINDBUGS] Collecting findbugs analysis files...
[FINDBUGS] Finding all files that match the pattern **/findbugs.xml,**/findbugsXml.xml
[FINDBUGS] Parsing 24 files in <https://builds.apache.org/job/HBase-TRUNK/ws/>
[FINDBUGS] Successfully parsed file <https://builds.apache.org/job/HBase-TRUNK/6402/artifact/hbase-annotations/target/findbugs.xml> of module with 0 warnings.
[FINDBUGS] Successfully parsed file <https://builds.apache.org/job/HBase-TRUNK/6402/artifact/hbase-annotations/target/findbugsXml.xml> of module with 0 warnings.
[FINDBUGS] Successfully parsed file <https://builds.apache.org/job/HBase-TRUNK/6402/artifact/hbase-client/target/findbugs.xml> of module with 0 warnings.
[FINDBUGS] Successfully parsed file <https://builds.apache.org/job/HBase-TRUNK/6402/artifact/hbase-client/target/findbugsXml.xml> of module with 8 warnings.
[FINDBUGS] Successfully parsed file <https://builds.apache.org/job/HBase-TRUNK/6402/artifact/hbase-common/target/findbugs.xml> of module with 0 warnings.
[FINDBUGS] Successfully parsed file <https://builds.apache.org/job/HBase-TRUNK/6402/artifact/hbase-common/target/findbugsXml.xml> of module with 1 warnings.
[FINDBUGS] Successfully parsed file <https://builds.apache.org/job/HBase-TRUNK/6402/artifact/hbase-examples/target/findbugs.xml> of module with 0 warnings.
[FINDBUGS] Successfully parsed file <https://builds.apache.org/job/HBase-TRUNK/6402/artifact/hbase-examples/target/findbugsXml.xml> of module with 0 warnings.
[FINDBUGS] Successfully parsed file <https://builds.apache.org/job/HBase-TRUNK/6402/artifact/hbase-hadoop-compat/target/findbugs.xml> of module with 0 warnings.
[FINDBUGS] Successfully parsed file <https://builds.apache.org/job/HBase-TRUNK/6402/artifact/hbase-hadoop-compat/target/findbugsXml.xml> of module with 0 warnings.
[FINDBUGS] Successfully parsed file <https://builds.apache.org/job/HBase-TRUNK/6402/artifact/hbase-hadoop2-compat/target/findbugs.xml> of module with 0 warnings.
[FINDBUGS] Successfully parsed file <https://builds.apache.org/job/HBase-TRUNK/6402/artifact/hbase-hadoop2-compat/target/findbugsXml.xml> of module with 0 warnings.
[FINDBUGS] Successfully parsed file <https://builds.apache.org/job/HBase-TRUNK/6402/artifact/hbase-prefix-tree/target/findbugs.xml> of module with 0 warnings.
[FINDBUGS] Successfully parsed file <https://builds.apache.org/job/HBase-TRUNK/6402/artifact/hbase-prefix-tree/target/findbugsXml.xml> of module with 0 warnings.
[FINDBUGS] Successfully parsed file <https://builds.apache.org/job/HBase-TRUNK/6402/artifact/hbase-procedure/target/findbugs.xml> of module with 0 warnings.
[FINDBUGS] Successfully parsed file <https://builds.apache.org/job/HBase-TRUNK/6402/artifact/hbase-procedure/target/findbugsXml.xml> of module with 0 warnings.
[FINDBUGS] Successfully parsed file <https://builds.apache.org/job/HBase-TRUNK/6402/artifact/hbase-protocol/target/findbugs.xml> of module with 0 warnings.
[FINDBUGS] Successfully parsed file <https://builds.apache.org/job/HBase-TRUNK/6402/artifact/hbase-protocol/target/findbugsXml.xml> of module with 0 warnings.
[FINDBUGS] Successfully parsed file <https://builds.apache.org/job/HBase-TRUNK/6402/artifact/hbase-rest/target/findbugs.xml> of module with 0 warnings.
[FINDBUGS] Successfully parsed file <https://builds.apache.org/job/HBase-TRUNK/6402/artifact/hbase-rest/target/findbugsXml.xml> of module with 2 warnings.
[FINDBUGS] Successfully parsed file <https://builds.apache.org/job/HBase-TRUNK/6402/artifact/hbase-server/target/findbugs.xml> of module with 0 warnings.
[FINDBUGS] Successfully parsed file <https://builds.apache.org/job/HBase-TRUNK/6402/artifact/hbase-server/target/findbugsXml.xml> of module with 60 warnings.
[FINDBUGS] Successfully parsed file <https://builds.apache.org/job/HBase-TRUNK/6402/artifact/hbase-thrift/target/findbugs.xml> of module with 0 warnings.
[FINDBUGS] Successfully parsed file <https://builds.apache.org/job/HBase-TRUNK/6402/artifact/hbase-thrift/target/findbugsXml.xml> of module with 0 warnings.
[FINDBUGS] Computing warning deltas based on reference build #6399
[CHECKSTYLE] Collecting checkstyle analysis files...
[CHECKSTYLE] Finding all files that match the pattern **/checkstyle-result.xml
[CHECKSTYLE] Parsing 18 files in <https://builds.apache.org/job/HBase-TRUNK/ws/>
[CHECKSTYLE] Successfully parsed file <https://builds.apache.org/job/HBase-TRUNK/6402/artifact/hbase-annotations/target/checkstyle-result.xml> of module with 0 warnings.
[CHECKSTYLE] Successfully parsed file <https://builds.apache.org/job/HBase-TRUNK/6402/artifact/hbase-assembly/target/checkstyle-result.xml> of module with 0 warnings.
[CHECKSTYLE] Successfully parsed file <https://builds.apache.org/job/HBase-TRUNK/6402/artifact/hbase-checkstyle/target/checkstyle-result.xml> of module with 0 warnings.
[CHECKSTYLE] Successfully parsed file <https://builds.apache.org/job/HBase-TRUNK/6402/artifact/hbase-client/target/checkstyle-result.xml> of module with 214 warnings.
[CHECKSTYLE] Successfully parsed file <https://builds.apache.org/job/HBase-TRUNK/6402/artifact/hbase-common/target/checkstyle-result.xml> of module with 125 warnings.
[CHECKSTYLE] Successfully parsed file <https://builds.apache.org/job/HBase-TRUNK/6402/artifact/hbase-examples/target/checkstyle-result.xml> of module with 30 warnings.
[CHECKSTYLE] Successfully parsed file <https://builds.apache.org/job/HBase-TRUNK/6402/artifact/hbase-hadoop-compat/target/checkstyle-result.xml> of module with 2 warnings.
[CHECKSTYLE] Successfully parsed file <https://builds.apache.org/job/HBase-TRUNK/6402/artifact/hbase-hadoop2-compat/target/checkstyle-result.xml> of module with 47 warnings.
[CHECKSTYLE] Successfully parsed file <https://builds.apache.org/job/HBase-TRUNK/6402/artifact/hbase-it/target/checkstyle-result.xml> of module with 0 warnings.
[CHECKSTYLE] Successfully parsed file <https://builds.apache.org/job/HBase-TRUNK/6402/artifact/hbase-prefix-tree/target/checkstyle-result.xml> of module with 25 warnings.
[CHECKSTYLE] Successfully parsed file <https://builds.apache.org/job/HBase-TRUNK/6402/artifact/hbase-procedure/target/checkstyle-result.xml> of module with 0 warnings.
[CHECKSTYLE] Successfully parsed file <https://builds.apache.org/job/HBase-TRUNK/6402/artifact/hbase-protocol/target/checkstyle-result.xml> of module with 3 warnings.
[CHECKSTYLE] Successfully parsed file <https://builds.apache.org/job/HBase-TRUNK/6402/artifact/hbase-rest/target/checkstyle-result.xml> of module with 42 warnings.
[CHECKSTYLE] Successfully parsed file <https://builds.apache.org/job/HBase-TRUNK/6402/artifact/hbase-server/target/checkstyle-result.xml> of module with 1377 warnings.
[CHECKSTYLE] Successfully parsed file <https://builds.apache.org/job/HBase-TRUNK/6402/artifact/hbase-shell/target/checkstyle-result.xml> of module with 0 warnings.
[CHECKSTYLE] Successfully parsed file <https://builds.apache.org/job/HBase-TRUNK/6402/artifact/hbase-testing-util/target/checkstyle-result.xml> of module with 0 warnings.
[CHECKSTYLE] Successfully parsed file <https://builds.apache.org/job/HBase-TRUNK/6402/artifact/hbase-thrift/target/checkstyle-result.xml> of module with 32 warnings.
[CHECKSTYLE] Successfully parsed file <https://builds.apache.org/job/HBase-TRUNK/6402/artifact/target/checkstyle-result.xml> of module with 0 warnings.
[CHECKSTYLE] Computing warning deltas based on reference build #6399
Updating HBASE-13527
Build failed in Jenkins: HBase-TRUNK #6401
Posted by Apache Jenkins Server <je...@builds.apache.org>.
See <https://builds.apache.org/job/HBase-TRUNK/6401/changes>
Changes:
[tedyu] HBASE-13437 ThriftServer leaks ZooKeeper connections (Winger Pun)
------------------------------------------
[...truncated 4155 lines...]
Tests run: 6, Failures: 0, Errors: 0, Skipped: 0, Time elapsed: 2.176 sec - in org.apache.hadoop.hbase.io.hfile.TestCacheConfig
Running org.apache.hadoop.hbase.io.hfile.TestForceCacheImportantBlocks
Running org.apache.hadoop.hbase.io.TestFileLink
Tests run: 5, Failures: 0, Errors: 0, Skipped: 0, Time elapsed: 19.605 sec - in org.apache.hadoop.hbase.io.TestFileLink
Tests run: 20, Failures: 0, Errors: 0, Skipped: 0, Time elapsed: 217.99 sec - in org.apache.hadoop.hbase.io.encoding.TestEncodedSeekers
Running org.apache.hadoop.hbase.procedure.TestZKProcedure
Tests run: 4, Failures: 0, Errors: 0, Skipped: 0, Time elapsed: 2.517 sec - in org.apache.hadoop.hbase.procedure.TestZKProcedure
Running org.apache.hadoop.hbase.procedure.TestZKProcedureControllers
Tests run: 4, Failures: 0, Errors: 0, Skipped: 0, Time elapsed: 2.107 sec - in org.apache.hadoop.hbase.procedure.TestZKProcedureControllers
Running org.apache.hadoop.hbase.ipc.TestHBaseClient
Tests run: 1, Failures: 0, Errors: 0, Skipped: 0, Time elapsed: 0.523 sec - in org.apache.hadoop.hbase.ipc.TestHBaseClient
Tests run: 2, Failures: 0, Errors: 0, Skipped: 0, Time elapsed: 37.984 sec - in org.apache.hadoop.hbase.io.hfile.TestForceCacheImportantBlocks
Running org.apache.hadoop.hbase.ipc.TestProtoBufRpc
Running org.apache.hadoop.hbase.ipc.TestDelayedRpc
Running org.apache.hadoop.hbase.TestLocalHBaseCluster
Tests run: 1, Failures: 0, Errors: 0, Skipped: 0, Time elapsed: 3.232 sec - in org.apache.hadoop.hbase.ipc.TestProtoBufRpc
Tests run: 4, Failures: 0, Errors: 0, Skipped: 0, Time elapsed: 4.808 sec - in org.apache.hadoop.hbase.ipc.TestDelayedRpc
Running org.apache.hadoop.hbase.TestAcidGuarantees
Tests run: 1, Failures: 0, Errors: 0, Skipped: 0, Time elapsed: 12.507 sec - in org.apache.hadoop.hbase.TestLocalHBaseCluster
Running org.apache.hadoop.hbase.zookeeper.TestRecoverableZooKeeper
Running org.apache.hadoop.hbase.zookeeper.TestZooKeeperACL
Tests run: 6, Failures: 0, Errors: 0, Skipped: 0, Time elapsed: 0.271 sec - in org.apache.hadoop.hbase.zookeeper.TestZooKeeperACL
Tests run: 1, Failures: 0, Errors: 0, Skipped: 0, Time elapsed: 1.265 sec - in org.apache.hadoop.hbase.zookeeper.TestRecoverableZooKeeper
Running org.apache.hadoop.hbase.zookeeper.TestZooKeeperNodeTracker
Tests run: 3, Failures: 0, Errors: 0, Skipped: 0, Time elapsed: 1.8 sec - in org.apache.hadoop.hbase.zookeeper.TestZooKeeperNodeTracker
Running org.apache.hadoop.hbase.zookeeper.TestHQuorumPeer
Running org.apache.hadoop.hbase.zookeeper.TestZKLeaderManager
Tests run: 1, Failures: 0, Errors: 0, Skipped: 0, Time elapsed: 0.136 sec - in org.apache.hadoop.hbase.zookeeper.TestZKLeaderManager
Tests run: 4, Failures: 0, Errors: 0, Skipped: 0, Time elapsed: 2.477 sec - in org.apache.hadoop.hbase.zookeeper.TestHQuorumPeer
Running org.apache.hadoop.hbase.zookeeper.TestZKMulti
Running org.apache.hadoop.hbase.zookeeper.lock.TestZKInterProcessReadWriteLock
Tests run: 8, Failures: 0, Errors: 0, Skipped: 0, Time elapsed: 0.658 sec - in org.apache.hadoop.hbase.zookeeper.TestZKMulti
Running org.apache.hadoop.hbase.TestJMXListener
Tests run: 6, Failures: 0, Errors: 0, Skipped: 0, Time elapsed: 24.493 sec - in org.apache.hadoop.hbase.zookeeper.lock.TestZKInterProcessReadWriteLock
Running org.apache.hadoop.hbase.TestMetaTableAccessorNoCluster
Tests run: 2, Failures: 0, Errors: 0, Skipped: 0, Time elapsed: 4.509 sec - in org.apache.hadoop.hbase.TestMetaTableAccessorNoCluster
Tests run: 2, Failures: 0, Errors: 0, Skipped: 0, Time elapsed: 16.792 sec - in org.apache.hadoop.hbase.TestJMXListener
Running org.apache.hadoop.hbase.TestZooKeeper
Running org.apache.hadoop.hbase.replication.regionserver.TestReplicationWALReaderManager
Tests run: 3, Failures: 0, Errors: 0, Skipped: 0, Time elapsed: 91.965 sec - in org.apache.hadoop.hbase.TestAcidGuarantees
Running org.apache.hadoop.hbase.replication.regionserver.TestRegionReplicaReplicationEndpoint
Tests run: 28, Failures: 0, Errors: 0, Skipped: 0, Time elapsed: 383.207 sec - in org.apache.hadoop.hbase.io.encoding.TestDataBlockEncoders
Running org.apache.hadoop.hbase.replication.regionserver.TestRegionReplicaReplicationEndpointNoMaster
Tests run: 9, Failures: 0, Errors: 0, Skipped: 0, Time elapsed: 93.151 sec - in org.apache.hadoop.hbase.replication.regionserver.TestRegionReplicaReplicationEndpoint
Tests run: 4, Failures: 0, Errors: 0, Skipped: 0, Time elapsed: 47.212 sec - in org.apache.hadoop.hbase.replication.regionserver.TestRegionReplicaReplicationEndpointNoMaster
Running org.apache.hadoop.hbase.replication.regionserver.TestReplicationSourceManager
Tests run: 4, Failures: 0, Errors: 0, Skipped: 0, Time elapsed: 3.287 sec - in org.apache.hadoop.hbase.replication.regionserver.TestReplicationSourceManager
Running org.apache.hadoop.hbase.replication.TestReplicationTrackerZKImpl
Running org.apache.hadoop.hbase.replication.regionserver.TestReplicationSink
Tests run: 5, Failures: 0, Errors: 0, Skipped: 0, Time elapsed: 1.382 sec - in org.apache.hadoop.hbase.replication.TestReplicationTrackerZKImpl
Tests run: 5, Failures: 0, Errors: 0, Skipped: 0, Time elapsed: 2.285 sec - in org.apache.hadoop.hbase.replication.regionserver.TestReplicationSink
Running org.apache.hadoop.hbase.replication.TestReplicationKillMasterRSCompressed
Running org.apache.hadoop.hbase.replication.TestReplicationKillMasterRS
Tests run: 1, Failures: 0, Errors: 0, Skipped: 0, Time elapsed: 26.173 sec - in org.apache.hadoop.hbase.replication.TestReplicationKillMasterRSCompressed
Running org.apache.hadoop.hbase.replication.TestMultiSlaveReplication
Tests run: 1, Failures: 0, Errors: 0, Skipped: 0, Time elapsed: 27.068 sec - in org.apache.hadoop.hbase.replication.TestReplicationKillMasterRS
Tests run: 12, Failures: 0, Errors: 0, Skipped: 0, Time elapsed: 214.391 sec - in org.apache.hadoop.hbase.TestZooKeeper
Running org.apache.hadoop.hbase.replication.TestReplicationChangingPeerRegionservers
Tests run: 1, Failures: 0, Errors: 0, Skipped: 0, Time elapsed: 32.441 sec - in org.apache.hadoop.hbase.replication.TestMultiSlaveReplication
Tests run: 1, Failures: 0, Errors: 0, Skipped: 0, Time elapsed: 5.674 sec - in org.apache.hadoop.hbase.replication.TestReplicationChangingPeerRegionservers
Running org.apache.hadoop.hbase.replication.TestReplicationKillSlaveRS
Running org.apache.hadoop.hbase.replication.TestPerTableCFReplication
Tests run: 1, Failures: 0, Errors: 0, Skipped: 0, Time elapsed: 22.945 sec - in org.apache.hadoop.hbase.replication.TestReplicationKillSlaveRS
Running org.apache.hadoop.hbase.replication.TestMasterReplication
Running org.apache.hadoop.hbase.replication.TestReplicationDisableInactivePeer
Tests run: 1, Failures: 0, Errors: 0, Skipped: 0, Time elapsed: 19.701 sec - in org.apache.hadoop.hbase.replication.TestReplicationDisableInactivePeer
Tests run: 2, Failures: 0, Errors: 0, Skipped: 0, Time elapsed: 39.737 sec - in org.apache.hadoop.hbase.replication.TestPerTableCFReplication
Running org.apache.hadoop.hbase.replication.TestReplicationWithTags
Tests run: 1, Failures: 0, Errors: 0, Skipped: 0, Time elapsed: 2.715 sec - in org.apache.hadoop.hbase.replication.TestReplicationWithTags
Running org.apache.hadoop.hbase.replication.TestReplicationEndpoint
Tests run: 3, Failures: 0, Errors: 0, Skipped: 0, Time elapsed: 1.711 sec - in org.apache.hadoop.hbase.replication.TestReplicationEndpoint
Tests run: 8, Failures: 0, Errors: 0, Skipped: 0, Time elapsed: 330.861 sec - in org.apache.hadoop.hbase.replication.regionserver.TestReplicationWALReaderManager
Tests run: 3, Failures: 0, Errors: 0, Skipped: 0, Time elapsed: 71.378 sec - in org.apache.hadoop.hbase.replication.TestMasterReplication
Running org.apache.hadoop.hbase.replication.TestReplicationSmallTests
Running org.apache.hadoop.hbase.replication.TestReplicationSource
Tests run: 1, Failures: 0, Errors: 0, Skipped: 0, Time elapsed: 0.261 sec - in org.apache.hadoop.hbase.replication.TestReplicationSource
Running org.apache.hadoop.hbase.replication.TestReplicationStateZKImpl
Tests run: 6, Failures: 0, Errors: 0, Skipped: 0, Time elapsed: 0.977 sec - in org.apache.hadoop.hbase.replication.TestReplicationStateZKImpl
Running org.apache.hadoop.hbase.fs.TestBlockReorder
Running org.apache.hadoop.hbase.replication.TestReplicationSyncUpTool
Running org.apache.hadoop.hbase.trace.TestHTraceHooks
Tests run: 1, Failures: 0, Errors: 0, Skipped: 0, Time elapsed: 3.42 sec - in org.apache.hadoop.hbase.trace.TestHTraceHooks
Tests run: 3, Failures: 0, Errors: 0, Skipped: 0, Time elapsed: 23.764 sec - in org.apache.hadoop.hbase.fs.TestBlockReorder
Running org.apache.hadoop.hbase.TestMovedRegionsCleaner
Tests run: 1, Failures: 0, Errors: 0, Skipped: 0, Time elapsed: 13.474 sec - in org.apache.hadoop.hbase.TestMovedRegionsCleaner
Running org.apache.hadoop.hbase.TestMetaTableLocator
Tests run: 7, Failures: 0, Errors: 0, Skipped: 0, Time elapsed: 4.123 sec - in org.apache.hadoop.hbase.TestMetaTableLocator
Tests run: 10, Failures: 0, Errors: 0, Skipped: 0, Time elapsed: 55.31 sec - in org.apache.hadoop.hbase.replication.TestReplicationSmallTests
Running org.apache.hadoop.hbase.namespace.TestNamespaceAuditor
Running org.apache.hadoop.hbase.mapred.TestTableSnapshotInputFormat
Running org.apache.hadoop.hbase.mapred.TestTableMapReduceUtil
Tests run: 1, Failures: 0, Errors: 0, Skipped: 0, Time elapsed: 67.5 sec - in org.apache.hadoop.hbase.replication.TestReplicationSyncUpTool
Running org.apache.hadoop.hbase.mapred.TestTableInputFormat
Tests run: 216, Failures: 0, Errors: 0, Skipped: 0, Time elapsed: 628.193 sec - in org.apache.hadoop.hbase.io.hfile.TestCacheOnWrite
Tests run: 7, Failures: 0, Errors: 0, Skipped: 0, Time elapsed: 66.677 sec - in org.apache.hadoop.hbase.namespace.TestNamespaceAuditor
Running org.apache.hadoop.hbase.TestMultiVersions
Tests run: 3, Failures: 0, Errors: 0, Skipped: 0, Time elapsed: 9.21 sec - in org.apache.hadoop.hbase.TestMultiVersions
Running org.apache.hadoop.hbase.mapred.TestTableMapReduce
Tests run: 4, Failures: 0, Errors: 0, Skipped: 0, Time elapsed: 99.258 sec - in org.apache.hadoop.hbase.mapred.TestTableMapReduceUtil
Tests run: 8, Failures: 0, Errors: 0, Skipped: 0, Time elapsed: 99.765 sec - in org.apache.hadoop.hbase.mapred.TestTableInputFormat
Tests run: 2, Failures: 0, Errors: 0, Skipped: 0, Time elapsed: 105.894 sec - in org.apache.hadoop.hbase.mapred.TestTableMapReduce
Tests run: 6, Failures: 0, Errors: 0, Skipped: 0, Time elapsed: 322.395 sec - in org.apache.hadoop.hbase.mapred.TestTableSnapshotInputFormat
Results :
Failed tests:
TestFastFail.testFastFail:272 There should be atleast one thread that retried instead of failing
Tests run: 2439, Failures: 1, Errors: 0, Skipped: 17
[INFO] ------------------------------------------------------------------------
[INFO] Reactor Summary:
[INFO]
[INFO] HBase ............................................. SUCCESS [ 2.879 s]
[INFO] HBase - Checkstyle ................................ SUCCESS [ 0.663 s]
[INFO] HBase - Annotations ............................... SUCCESS [ 0.224 s]
[INFO] HBase - Protocol .................................. SUCCESS [ 2.696 s]
[INFO] HBase - Common .................................... SUCCESS [03:10 min]
[INFO] HBase - Procedure ................................. SUCCESS [01:57 min]
[INFO] HBase - Client .................................... SUCCESS [01:51 min]
[INFO] HBase - Hadoop Compatibility ...................... SUCCESS [ 11.300 s]
[INFO] HBase - Hadoop Two Compatibility .................. SUCCESS [ 14.365 s]
[INFO] HBase - Prefix Tree ............................... SUCCESS [ 17.846 s]
[INFO] HBase - Server .................................... FAILURE [ 01:45 h]
[INFO] HBase - Testing Util .............................. SKIPPED
[INFO] HBase - Thrift .................................... SKIPPED
[INFO] HBase - Shell ..................................... SKIPPED
[INFO] HBase - Integration Tests ......................... SKIPPED
[INFO] HBase - Examples .................................. SKIPPED
[INFO] HBase - Rest ...................................... SKIPPED
[INFO] HBase - Assembly .................................. SKIPPED
[INFO] ------------------------------------------------------------------------
[INFO] BUILD FAILURE
[INFO] ------------------------------------------------------------------------
[INFO] Total time: 01:52 h
[INFO] Finished at: 2015-04-22T17:07:13+00:00
[INFO] Final Memory: 60M/555M
[INFO] ------------------------------------------------------------------------
[ERROR] Failed to execute goal org.apache.maven.plugins:maven-surefire-plugin:2.18:test (secondPartTestsExecution) on project hbase-server: There are test failures.
[ERROR]
[ERROR] Please refer to <https://builds.apache.org/job/HBase-TRUNK/ws/hbase-server/target/surefire-reports> for the individual test results.
[ERROR] -> [Help 1]
[ERROR]
[ERROR] To see the full stack trace of the errors, re-run Maven with the -e switch.
[ERROR] Re-run Maven using the -X switch to enable full debug logging.
[ERROR]
[ERROR] For more information about the errors and possible solutions, please read the following articles:
[ERROR] [Help 1] http://cwiki.apache.org/confluence/display/MAVEN/MojoFailureException
[ERROR]
[ERROR] After correcting the problems, you can resume the build with the command
[ERROR] mvn <goals> -rf :hbase-server
Build step 'Invoke top-level Maven targets' marked build as failure
Performing Post build task...
Match found for :.* : True
Logical operation result is TRUE
Running script : ZOMBIE_TESTS_COUNT=`jps | grep surefirebooter | wc -l`
if [[ $ZOMBIE_TESTS_COUNT != 0 ]] ; then
#It seems sometimes the tests are not dying immediately. Let's give them 10s
echo "Suspicious java process found - waiting 10s to see if there are just slow to stop"
sleep 10
ZOMBIE_TESTS_COUNT=`jps | grep surefirebooter | wc -l`
if [[ $ZOMBIE_TESTS_COUNT != 0 ]] ; then
echo "There are $ZOMBIE_TESTS_COUNT zombie tests, they should have been killed by surefire but survived"
echo "************ BEGIN zombies jstack extract"
ZB_STACK=`jps | grep surefirebooter | cut -d ' ' -f 1 | xargs -n 1 jstack | grep ".test" | grep "\.java"`
jps | grep surefirebooter | cut -d ' ' -f 1 | xargs -n 1 jstack
echo "************ END zombies jstack extract"
JIRA_COMMENT="$JIRA_COMMENT
{color:red}-1 core zombie tests{color}. There are ${ZOMBIE_TESTS_COUNT} zombie test(s): ${ZB_STACK}"
BAD=1
jps | grep surefirebooter | cut -d ' ' -f 1 | xargs kill -9
else
echo "We're ok: there is no zombie test, but some tests took some time to stop"
fi
else
echo "We're ok: there is no zombie test"
fi
[HBase-TRUNK] $ /bin/bash -xe /tmp/hudson5230883634517793679.sh
++ jps
++ grep surefirebooter
++ wc -l
+ ZOMBIE_TESTS_COUNT=0
+ [[ 0 != 0 ]]
+ echo 'We'\''re ok: there is no zombie test'
We're ok: there is no zombie test
POST BUILD TASK : SUCCESS
END OF POST BUILD TASK : 0
Archiving artifacts
Sending artifact delta relative to HBase-TRUNK #6399
Archived 2139 artifacts
Archive block size is 32768
Received 88 blocks and 434518554 bytes
Compression is 0.7%
Took 3 min 24 sec
Recording test results
[FINDBUGS] Collecting findbugs analysis files...
[FINDBUGS] Finding all files that match the pattern **/findbugs.xml,**/findbugsXml.xml
[FINDBUGS] Parsing 24 files in <https://builds.apache.org/job/HBase-TRUNK/ws/>
[FINDBUGS] Successfully parsed file <https://builds.apache.org/job/HBase-TRUNK/6401/artifact/hbase-annotations/target/findbugs.xml> of module with 0 warnings.
[FINDBUGS] Successfully parsed file <https://builds.apache.org/job/HBase-TRUNK/6401/artifact/hbase-annotations/target/findbugsXml.xml> of module with 0 warnings.
[FINDBUGS] Successfully parsed file <https://builds.apache.org/job/HBase-TRUNK/6401/artifact/hbase-client/target/findbugs.xml> of module with 0 warnings.
[FINDBUGS] Successfully parsed file <https://builds.apache.org/job/HBase-TRUNK/6401/artifact/hbase-client/target/findbugsXml.xml> of module with 8 warnings.
[FINDBUGS] Successfully parsed file <https://builds.apache.org/job/HBase-TRUNK/6401/artifact/hbase-common/target/findbugs.xml> of module with 0 warnings.
[FINDBUGS] Successfully parsed file <https://builds.apache.org/job/HBase-TRUNK/6401/artifact/hbase-common/target/findbugsXml.xml> of module with 1 warnings.
[FINDBUGS] Successfully parsed file <https://builds.apache.org/job/HBase-TRUNK/6401/artifact/hbase-examples/target/findbugs.xml> of module with 0 warnings.
[FINDBUGS] Successfully parsed file <https://builds.apache.org/job/HBase-TRUNK/6401/artifact/hbase-examples/target/findbugsXml.xml> of module with 0 warnings.
[FINDBUGS] Successfully parsed file <https://builds.apache.org/job/HBase-TRUNK/6401/artifact/hbase-hadoop-compat/target/findbugs.xml> of module with 0 warnings.
[FINDBUGS] Successfully parsed file <https://builds.apache.org/job/HBase-TRUNK/6401/artifact/hbase-hadoop-compat/target/findbugsXml.xml> of module with 0 warnings.
[FINDBUGS] Successfully parsed file <https://builds.apache.org/job/HBase-TRUNK/6401/artifact/hbase-hadoop2-compat/target/findbugs.xml> of module with 0 warnings.
[FINDBUGS] Successfully parsed file <https://builds.apache.org/job/HBase-TRUNK/6401/artifact/hbase-hadoop2-compat/target/findbugsXml.xml> of module with 0 warnings.
[FINDBUGS] Successfully parsed file <https://builds.apache.org/job/HBase-TRUNK/6401/artifact/hbase-prefix-tree/target/findbugs.xml> of module with 0 warnings.
[FINDBUGS] Successfully parsed file <https://builds.apache.org/job/HBase-TRUNK/6401/artifact/hbase-prefix-tree/target/findbugsXml.xml> of module with 0 warnings.
[FINDBUGS] Successfully parsed file <https://builds.apache.org/job/HBase-TRUNK/6401/artifact/hbase-procedure/target/findbugs.xml> of module with 0 warnings.
[FINDBUGS] Successfully parsed file <https://builds.apache.org/job/HBase-TRUNK/6401/artifact/hbase-procedure/target/findbugsXml.xml> of module with 0 warnings.
[FINDBUGS] Successfully parsed file <https://builds.apache.org/job/HBase-TRUNK/6401/artifact/hbase-protocol/target/findbugs.xml> of module with 0 warnings.
[FINDBUGS] Successfully parsed file <https://builds.apache.org/job/HBase-TRUNK/6401/artifact/hbase-protocol/target/findbugsXml.xml> of module with 0 warnings.
[FINDBUGS] Successfully parsed file <https://builds.apache.org/job/HBase-TRUNK/6401/artifact/hbase-rest/target/findbugs.xml> of module with 0 warnings.
[FINDBUGS] Successfully parsed file <https://builds.apache.org/job/HBase-TRUNK/6401/artifact/hbase-rest/target/findbugsXml.xml> of module with 2 warnings.
[FINDBUGS] Successfully parsed file <https://builds.apache.org/job/HBase-TRUNK/6401/artifact/hbase-server/target/findbugs.xml> of module with 0 warnings.
[FINDBUGS] Successfully parsed file <https://builds.apache.org/job/HBase-TRUNK/6401/artifact/hbase-server/target/findbugsXml.xml> of module with 60 warnings.
[FINDBUGS] Successfully parsed file <https://builds.apache.org/job/HBase-TRUNK/6401/artifact/hbase-thrift/target/findbugs.xml> of module with 0 warnings.
[FINDBUGS] Successfully parsed file <https://builds.apache.org/job/HBase-TRUNK/6401/artifact/hbase-thrift/target/findbugsXml.xml> of module with 0 warnings.
[FINDBUGS] Computing warning deltas based on reference build #6399
[CHECKSTYLE] Collecting checkstyle analysis files...
[CHECKSTYLE] Finding all files that match the pattern **/checkstyle-result.xml
[CHECKSTYLE] Parsing 18 files in <https://builds.apache.org/job/HBase-TRUNK/ws/>
[CHECKSTYLE] Successfully parsed file <https://builds.apache.org/job/HBase-TRUNK/6401/artifact/hbase-annotations/target/checkstyle-result.xml> of module with 0 warnings.
[CHECKSTYLE] Successfully parsed file <https://builds.apache.org/job/HBase-TRUNK/6401/artifact/hbase-assembly/target/checkstyle-result.xml> of module with 0 warnings.
[CHECKSTYLE] Successfully parsed file <https://builds.apache.org/job/HBase-TRUNK/6401/artifact/hbase-checkstyle/target/checkstyle-result.xml> of module with 0 warnings.
[CHECKSTYLE] Successfully parsed file <https://builds.apache.org/job/HBase-TRUNK/6401/artifact/hbase-client/target/checkstyle-result.xml> of module with 214 warnings.
[CHECKSTYLE] Successfully parsed file <https://builds.apache.org/job/HBase-TRUNK/6401/artifact/hbase-common/target/checkstyle-result.xml> of module with 125 warnings.
[CHECKSTYLE] Successfully parsed file <https://builds.apache.org/job/HBase-TRUNK/6401/artifact/hbase-examples/target/checkstyle-result.xml> of module with 30 warnings.
[CHECKSTYLE] Successfully parsed file <https://builds.apache.org/job/HBase-TRUNK/6401/artifact/hbase-hadoop-compat/target/checkstyle-result.xml> of module with 2 warnings.
[CHECKSTYLE] Successfully parsed file <https://builds.apache.org/job/HBase-TRUNK/6401/artifact/hbase-hadoop2-compat/target/checkstyle-result.xml> of module with 47 warnings.
[CHECKSTYLE] Successfully parsed file <https://builds.apache.org/job/HBase-TRUNK/6401/artifact/hbase-it/target/checkstyle-result.xml> of module with 0 warnings.
[CHECKSTYLE] Successfully parsed file <https://builds.apache.org/job/HBase-TRUNK/6401/artifact/hbase-prefix-tree/target/checkstyle-result.xml> of module with 25 warnings.
[CHECKSTYLE] Successfully parsed file <https://builds.apache.org/job/HBase-TRUNK/6401/artifact/hbase-procedure/target/checkstyle-result.xml> of module with 0 warnings.
[CHECKSTYLE] Successfully parsed file <https://builds.apache.org/job/HBase-TRUNK/6401/artifact/hbase-protocol/target/checkstyle-result.xml> of module with 3 warnings.
[CHECKSTYLE] Successfully parsed file <https://builds.apache.org/job/HBase-TRUNK/6401/artifact/hbase-rest/target/checkstyle-result.xml> of module with 42 warnings.
[CHECKSTYLE] Successfully parsed file <https://builds.apache.org/job/HBase-TRUNK/6401/artifact/hbase-server/target/checkstyle-result.xml> of module with 1377 warnings.
[CHECKSTYLE] Successfully parsed file <https://builds.apache.org/job/HBase-TRUNK/6401/artifact/hbase-shell/target/checkstyle-result.xml> of module with 0 warnings.
[CHECKSTYLE] Successfully parsed file <https://builds.apache.org/job/HBase-TRUNK/6401/artifact/hbase-testing-util/target/checkstyle-result.xml> of module with 0 warnings.
[CHECKSTYLE] Successfully parsed file <https://builds.apache.org/job/HBase-TRUNK/6401/artifact/hbase-thrift/target/checkstyle-result.xml> of module with 32 warnings.
[CHECKSTYLE] Successfully parsed file <https://builds.apache.org/job/HBase-TRUNK/6401/artifact/target/checkstyle-result.xml> of module with 0 warnings.
[CHECKSTYLE] Computing warning deltas based on reference build #6399
Updating HBASE-13437