You are viewing a plain text version of this content. The canonical link for it is here.
Posted to yarn-dev@hadoop.apache.org by Apache Jenkins Server <je...@builds.apache.org> on 2015/04/08 08:17:48 UTC

Failed: YARN-3459 PreCommit Build #7251

Jira: https://issues.apache.org/jira/browse/YARN-3459
Build: https://builds.apache.org/job/PreCommit-YARN-Build/7251/

###################################################################################
########################## LAST 60 LINES OF THE CONSOLE ###########################
[...truncated 3404 lines...]


{color:red}-1 overall{color}.  Here are the results of testing the latest attachment 
  http://issues.apache.org/jira/secure/attachment/12723835/apache-yarn-3459.0.patch
  against trunk revision ab04ff9.

    {color:green}+1 @author{color}.  The patch does not contain any @author tags.

    {color:green}+1 tests included{color}.  The patch appears to include 1 new or modified test files.

    {color:green}+1 javac{color}.  The applied patch does not increase the total number of javac compiler warnings.

    {color:green}+1 javadoc{color}.  There were no new javadoc warning messages.

    {color:green}+1 eclipse:eclipse{color}.  The patch built with eclipse:eclipse.

    {color:red}-1 findbugs{color}.  The patch appears to introduce 2 new Findbugs (version 2.0.3) warnings.

    {color:green}+1 release audit{color}.  The applied patch does not increase the total number of release audit warnings.

    {color:green}+1 core tests{color}.  The patch passed unit tests in hadoop-yarn-project/hadoop-yarn/hadoop-yarn-common.

Test results: https://builds.apache.org/job/PreCommit-YARN-Build/7251//testReport/
Findbugs warnings: https://builds.apache.org/job/PreCommit-YARN-Build/7251//artifact/patchprocess/newPatchFindbugsWarningshadoop-yarn-common.html
Console output: https://builds.apache.org/job/PreCommit-YARN-Build/7251//console

This message is automatically generated.


======================================================================
======================================================================
    Adding comment to Jira.
======================================================================
======================================================================


Comment added.
08c26ce6d9299edc52d398ac558221169530370e logged out


======================================================================
======================================================================
    Finished build.
======================================================================
======================================================================


Build step 'Execute shell' marked build as failure
Archiving artifacts
Sending artifact delta relative to PreCommit-YARN-Build #7248
Archived 15 artifacts
Archive block size is 32768
Received 49 blocks and 7507724 bytes
Compression is 17.6%
Took 3.4 sec
[description-setter] Could not determine description.
Recording test results
Email was triggered for: Failure
Sending email for trigger: Failure



###################################################################################
############################## FAILED TESTS (if any) ##############################
All tests passed

Success: YARN-3055 PreCommit Build #7258

Posted by Apache Jenkins Server <je...@builds.apache.org>.
Jira: https://issues.apache.org/jira/browse/YARN-3055
Build: https://builds.apache.org/job/PreCommit-YARN-Build/7258/

###################################################################################
########################## LAST 60 LINES OF THE CONSOLE ###########################
[...truncated 3518 lines...]


{color:green}+1 overall{color}.  Here are the results of testing the latest attachment 
  http://issues.apache.org/jira/secure/attachment/12723981/YARN-3055.patch
  against trunk revision 608c499.

    {color:green}+1 @author{color}.  The patch does not contain any @author tags.

    {color:green}+1 tests included{color}.  The patch appears to include 1 new or modified test files.

    {color:green}+1 javac{color}.  The applied patch does not increase the total number of javac compiler warnings.

    {color:green}+1 javadoc{color}.  There were no new javadoc warning messages.

    {color:green}+1 eclipse:eclipse{color}.  The patch built with eclipse:eclipse.

    {color:green}+1 findbugs{color}.  The patch does not introduce any new Findbugs (version 2.0.3) warnings.

    {color:green}+1 release audit{color}.  The applied patch does not increase the total number of release audit warnings.

    {color:green}+1 core tests{color}.  The patch passed unit tests in hadoop-yarn-project/hadoop-yarn/hadoop-yarn-server/hadoop-yarn-server-resourcemanager.

Test results: https://builds.apache.org/job/PreCommit-YARN-Build/7258//testReport/
Console output: https://builds.apache.org/job/PreCommit-YARN-Build/7258//console

This message is automatically generated.


======================================================================
======================================================================
    Adding comment to Jira.
======================================================================
======================================================================


Unable to log in to server: https://issues.apache.org/jira/rpc/soap/jirasoapservice-v2 with user: hadoopqa.
 Cause: com.atlassian.jira.rpc.exception.RemoteAuthenticationException: Attempt to log in user 'hadoopqa' failed. The maximum number of failed login attempts has been reached. Please log into the application through the web interface to reset the number of failed login attempts.
Unable to log in to server: https://issues.apache.org/jira/rpc/soap/jirasoapservice-v2 with user: hadoopqa.
 Cause: com.atlassian.jira.rpc.exception.RemoteAuthenticationException: Attempt to log in user 'hadoopqa' failed. The maximum number of failed login attempts has been reached. Please log into the application through the web interface to reset the number of failed login attempts.


======================================================================
======================================================================
    Finished build.
======================================================================
======================================================================


Archiving artifacts
Sending artifact delta relative to PreCommit-YARN-Build #7248
Archived 15 artifacts
Archive block size is 32768
Received 57 blocks and 7245109 bytes
Compression is 20.5%
Took 3.8 sec
Description set: YARN-3055
Recording test results
Email was triggered for: Success
Sending email for trigger: Success



###################################################################################
############################## FAILED TESTS (if any) ##############################
All tests passed

Failed: YARN-2684 PreCommit Build #7257

Posted by Apache Jenkins Server <je...@builds.apache.org>.
Jira: https://issues.apache.org/jira/browse/YARN-2684
Build: https://builds.apache.org/job/PreCommit-YARN-Build/7257/

###################################################################################
########################## LAST 60 LINES OF THE CONSOLE ###########################
[...truncated 60 lines...]
      DominantResourceCalculator.class.getName());
    CapacitySchedulerConfiguration csConf =
        new CapacitySchedulerConfiguration(conf);
    setupQueueConfiguration(csConf);
    MemoryRMStateStore memStore = new MemoryRMStateStore();
    memStore.init(csConf);
    rm1 = new MockRM(csConf, memStore);
    rm1.start();
    MockNM nm1 =
        new MockNM("127.0.0.1:1234", 8192, rm1.getResourceTrackerService());

error: patch failed: hadoop-yarn-project/hadoop-yarn/hadoop-yarn-server/hadoop-yarn-server-resourcemanager/src/test/java/org/apache/hadoop/yarn/server/resourcemanager/TestWorkPreservingRMRestart.java:586
error: hadoop-yarn-project/hadoop-yarn/hadoop-yarn-server/hadoop-yarn-server-resourcemanager/src/test/java/org/apache/hadoop/yarn/server/resourcemanager/TestWorkPreservingRMRestart.java: patch does not apply
Checking patch hadoop-yarn-project/hadoop-yarn/hadoop-yarn-server/hadoop-yarn-server-resourcemanager/src/test/java/org/apache/hadoop/yarn/server/resourcemanager/scheduler/fair/TestFairScheduler.java...
Hunk #1 succeeded at 1038 (offset 72 lines).
Hunk #2 succeeded at 1064 (offset 72 lines).
Hunk #3 succeeded at 1191 (offset 72 lines).
PATCH APPLICATION FAILED




{color:red}-1 overall{color}.  Here are the results of testing the latest attachment 
  http://issues.apache.org/jira/secure/attachment/12690068/0001-YARN-2684.patch
  against trunk revision ba9ee22.

    {color:red}-1 patch{color}.  The patch command could not apply the patch.

Console output: https://builds.apache.org/job/PreCommit-YARN-Build/7257//console

This message is automatically generated.


======================================================================
======================================================================
    Adding comment to Jira.
======================================================================
======================================================================


Unable to log in to server: https://issues.apache.org/jira/rpc/soap/jirasoapservice-v2 with user: hadoopqa.
 Cause: com.atlassian.jira.rpc.exception.RemoteAuthenticationException: Attempt to log in user 'hadoopqa' failed. The maximum number of failed login attempts has been reached. Please log into the application through the web interface to reset the number of failed login attempts.
Unable to log in to server: https://issues.apache.org/jira/rpc/soap/jirasoapservice-v2 with user: hadoopqa.
 Cause: com.atlassian.jira.rpc.exception.RemoteAuthenticationException: Attempt to log in user 'hadoopqa' failed. The maximum number of failed login attempts has been reached. Please log into the application through the web interface to reset the number of failed login attempts.


======================================================================
======================================================================
    Finished build.
======================================================================
======================================================================


Build step 'Execute shell' marked build as failure
Archiving artifacts
[description-setter] Could not determine description.
Recording test results
Email was triggered for: Failure
Sending email for trigger: Failure



###################################################################################
############################## FAILED TESTS (if any) ##############################
No tests ran.

Failed: YARN-3347 PreCommit Build #7256

Posted by Apache Jenkins Server <je...@builds.apache.org>.
Jira: https://issues.apache.org/jira/browse/YARN-3347
Build: https://builds.apache.org/job/PreCommit-YARN-Build/7256/

###################################################################################
########################## LAST 60 LINES OF THE CONSOLE ###########################
[...truncated 3526 lines...]
{color:red}-1 overall{color}.  Here are the results of testing the latest attachment 
  http://issues.apache.org/jira/secure/attachment/12723954/YARN-3347.3.patch
  against trunk revision dd852f5.

    {color:green}+1 @author{color}.  The patch does not contain any @author tags.

    {color:green}+1 tests included{color}.  The patch appears to include 1 new or modified test files.

    {color:green}+1 javac{color}.  The applied patch does not increase the total number of javac compiler warnings.

    {color:green}+1 javadoc{color}.  There were no new javadoc warning messages.

    {color:green}+1 eclipse:eclipse{color}.  The patch built with eclipse:eclipse.

    {color:red}-1 findbugs{color}.  The patch appears to introduce 2 new Findbugs (version 2.0.3) warnings.

    {color:green}+1 release audit{color}.  The applied patch does not increase the total number of release audit warnings.

    {color:green}+1 core tests{color}.  The patch passed unit tests in hadoop-yarn-project/hadoop-yarn/hadoop-yarn-client hadoop-yarn-project/hadoop-yarn/hadoop-yarn-common.

Test results: https://builds.apache.org/job/PreCommit-YARN-Build/7256//testReport/
Findbugs warnings: https://builds.apache.org/job/PreCommit-YARN-Build/7256//artifact/patchprocess/newPatchFindbugsWarningshadoop-yarn-common.html
Console output: https://builds.apache.org/job/PreCommit-YARN-Build/7256//console

This message is automatically generated.


======================================================================
======================================================================
    Adding comment to Jira.
======================================================================
======================================================================


Unable to log in to server: https://issues.apache.org/jira/rpc/soap/jirasoapservice-v2 with user: hadoopqa.
 Cause: com.atlassian.jira.rpc.exception.RemoteAuthenticationException: Attempt to log in user 'hadoopqa' failed. The maximum number of failed login attempts has been reached. Please log into the application through the web interface to reset the number of failed login attempts.
Unable to log in to server: https://issues.apache.org/jira/rpc/soap/jirasoapservice-v2 with user: hadoopqa.
 Cause: com.atlassian.jira.rpc.exception.RemoteAuthenticationException: Attempt to log in user 'hadoopqa' failed. The maximum number of failed login attempts has been reached. Please log into the application through the web interface to reset the number of failed login attempts.


======================================================================
======================================================================
    Finished build.
======================================================================
======================================================================


Build step 'Execute shell' marked build as failure
Archiving artifacts
Sending artifact delta relative to PreCommit-YARN-Build #7248
Archived 25 artifacts
Archive block size is 32768
Received 53 blocks and 8933790 bytes
Compression is 16.3%
Took 2.6 sec
[description-setter] Could not determine description.
Recording test results
Email was triggered for: Failure
Sending email for trigger: Failure



###################################################################################
############################## FAILED TESTS (if any) ##############################
All tests passed

Failed: YARN-3466 PreCommit Build #7255

Posted by Apache Jenkins Server <je...@builds.apache.org>.
Jira: https://issues.apache.org/jira/browse/YARN-3466
Build: https://builds.apache.org/job/PreCommit-YARN-Build/7255/

###################################################################################
########################## LAST 60 LINES OF THE CONSOLE ###########################
[...truncated 3507 lines...]
  http://issues.apache.org/jira/secure/attachment/12723947/YARN-3466.001.patch
  against trunk revision dd852f5.

    {color:green}+1 @author{color}.  The patch does not contain any @author tags.

    {color:red}-1 tests included{color}.  The patch doesn't appear to include any new or modified tests.
                        Please justify why no new tests are needed for this patch.
                        Also please list what manual steps were performed to verify this patch.

    {color:green}+1 javac{color}.  The applied patch does not increase the total number of javac compiler warnings.

    {color:green}+1 javadoc{color}.  There were no new javadoc warning messages.

    {color:green}+1 eclipse:eclipse{color}.  The patch built with eclipse:eclipse.

    {color:green}+1 findbugs{color}.  The patch does not introduce any new Findbugs (version 2.0.3) warnings.

    {color:green}+1 release audit{color}.  The applied patch does not increase the total number of release audit warnings.

    {color:green}+1 core tests{color}.  The patch passed unit tests in hadoop-yarn-project/hadoop-yarn/hadoop-yarn-server/hadoop-yarn-server-resourcemanager.

Test results: https://builds.apache.org/job/PreCommit-YARN-Build/7255//testReport/
Console output: https://builds.apache.org/job/PreCommit-YARN-Build/7255//console

This message is automatically generated.


======================================================================
======================================================================
    Adding comment to Jira.
======================================================================
======================================================================


Unable to log in to server: https://issues.apache.org/jira/rpc/soap/jirasoapservice-v2 with user: hadoopqa.
 Cause: com.atlassian.jira.rpc.exception.RemoteAuthenticationException: Attempt to log in user 'hadoopqa' failed. The maximum number of failed login attempts has been reached. Please log into the application through the web interface to reset the number of failed login attempts.
Unable to log in to server: https://issues.apache.org/jira/rpc/soap/jirasoapservice-v2 with user: hadoopqa.
 Cause: com.atlassian.jira.rpc.exception.RemoteAuthenticationException: Attempt to log in user 'hadoopqa' failed. The maximum number of failed login attempts has been reached. Please log into the application through the web interface to reset the number of failed login attempts.


======================================================================
======================================================================
    Finished build.
======================================================================
======================================================================


Build step 'Execute shell' marked build as failure
Archiving artifacts
Sending artifact delta relative to PreCommit-YARN-Build #7248
Archived 15 artifacts
Archive block size is 32768
Received 224 blocks and 1772925 bytes
Compression is 80.5%
Took 3.6 sec
[description-setter] Could not determine description.
Recording test results
Email was triggered for: Failure
Sending email for trigger: Failure



###################################################################################
############################## FAILED TESTS (if any) ##############################
All tests passed

Failed: YARN-3293 PreCommit Build #7254

Posted by Apache Jenkins Server <je...@builds.apache.org>.
Jira: https://issues.apache.org/jira/browse/YARN-3293
Build: https://builds.apache.org/job/PreCommit-YARN-Build/7254/

###################################################################################
########################## LAST 60 LINES OF THE CONSOLE ###########################
[...truncated 37 lines...]
Fast-forwarded trunk to dd852f5b8c8fe9e52d15987605f36b5b60f02701.
YARN-3293 patch is being downloaded at Wed Apr  8 15:10:24 UTC 2015 from
http://issues.apache.org/jira/secure/attachment/12723930/apache-yarn-3293.6.patch
cp: cannot stat '/home/jenkins/buildSupport/lib/*': No such file or directory


======================================================================
======================================================================
 Pre-build trunk to verify trunk stability and javac warnings
======================================================================
======================================================================


Compiling /home/jenkins/jenkins-slave/workspace/PreCommit-YARN-Build
/home/jenkins/tools/maven/latest/bin/mvn clean test -DskipTests -DHadoopPatchProcess -Ptest-patch > /home/jenkins/jenkins-slave/workspace/PreCommit-YARN-Build/../patchprocess/trunkJavacWarnings.txt 2>&1
/home/jenkins/tools/maven/latest/bin/mvn clean test javadoc:javadoc -DskipTests -Pdocs -DHadoopPatchProcess > /home/jenkins/jenkins-slave/workspace/PreCommit-YARN-Build/../patchprocess/trunkJavadocWarnings.txt 2>&1
/home/jenkins/jenkins-slave/workspace/PreCommit-YARN-Build/dev-support/test-patch.sh: line 310: /home/jenkins/jenkins-slave/workspace/PreCommit-YARN-Build/../patchprocess/trunkJavadocWarnings.txt: No such file or directory
Trunk javadoc compilation is broken?




{color:red}-1 overall{color}.  Here are the results of testing the latest attachment 
  http://issues.apache.org/jira/secure/attachment/12723930/apache-yarn-3293.6.patch
  against trunk revision dd852f5.

    {color:red}-1 patch{color}.  Trunk compilation may be broken.

Console output: https://builds.apache.org/job/PreCommit-YARN-Build/7254//console

This message is automatically generated.


======================================================================
======================================================================
    Adding comment to Jira.
======================================================================
======================================================================


Unable to log in to server: https://issues.apache.org/jira/rpc/soap/jirasoapservice-v2 with user: hadoopqa.
 Cause: com.atlassian.jira.rpc.exception.RemoteAuthenticationException: Attempt to log in user 'hadoopqa' failed. The maximum number of failed login attempts has been reached. Please log into the application through the web interface to reset the number of failed login attempts.
Unable to log in to server: https://issues.apache.org/jira/rpc/soap/jirasoapservice-v2 with user: hadoopqa.
 Cause: com.atlassian.jira.rpc.exception.RemoteAuthenticationException: Attempt to log in user 'hadoopqa' failed. The maximum number of failed login attempts has been reached. Please log into the application through the web interface to reset the number of failed login attempts.


======================================================================
======================================================================
    Finished build.
======================================================================
======================================================================


Build step 'Execute shell' marked build as failure
Archiving artifacts
[description-setter] Could not determine description.
Recording test results
Email was triggered for: Failure
Sending email for trigger: Failure



###################################################################################
############################## FAILED TESTS (if any) ##############################
No tests ran.

Failed: YARN-3348 PreCommit Build #7253

Posted by Apache Jenkins Server <je...@builds.apache.org>.
Jira: https://issues.apache.org/jira/browse/YARN-3348
Build: https://builds.apache.org/job/PreCommit-YARN-Build/7253/

###################################################################################
########################## LAST 60 LINES OF THE CONSOLE ###########################
[...truncated 3920 lines...]
{color:red}-1 overall{color}.  Here are the results of testing the latest attachment 
  http://issues.apache.org/jira/secure/attachment/12723912/apache-yarn-3348.2.patch
  against trunk revision dd852f5.

    {color:green}+1 @author{color}.  The patch does not contain any @author tags.

    {color:green}+1 tests included{color}.  The patch appears to include 3 new or modified test files.

    {color:green}+1 javac{color}.  The applied patch does not increase the total number of javac compiler warnings.

    {color:green}+1 javadoc{color}.  There were no new javadoc warning messages.

    {color:green}+1 eclipse:eclipse{color}.  The patch built with eclipse:eclipse.

    {color:red}-1 findbugs{color}.  The patch appears to introduce 2 new Findbugs (version 2.0.3) warnings.

    {color:green}+1 release audit{color}.  The applied patch does not increase the total number of release audit warnings.

    {color:green}+1 core tests{color}.  The patch passed unit tests in hadoop-yarn-project/hadoop-yarn/hadoop-yarn-api hadoop-yarn-project/hadoop-yarn/hadoop-yarn-client hadoop-yarn-project/hadoop-yarn/hadoop-yarn-common hadoop-yarn-project/hadoop-yarn/hadoop-yarn-server/hadoop-yarn-server-resourcemanager.

Test results: https://builds.apache.org/job/PreCommit-YARN-Build/7253//testReport/
Findbugs warnings: https://builds.apache.org/job/PreCommit-YARN-Build/7253//artifact/patchprocess/newPatchFindbugsWarningshadoop-yarn-common.html
Console output: https://builds.apache.org/job/PreCommit-YARN-Build/7253//console

This message is automatically generated.


======================================================================
======================================================================
    Adding comment to Jira.
======================================================================
======================================================================


Unable to log in to server: https://issues.apache.org/jira/rpc/soap/jirasoapservice-v2 with user: hadoopqa.
 Cause: com.atlassian.jira.rpc.exception.RemoteAuthenticationException: Attempt to log in user 'hadoopqa' failed. The maximum number of failed login attempts has been reached. Please log into the application through the web interface to reset the number of failed login attempts.
Unable to log in to server: https://issues.apache.org/jira/rpc/soap/jirasoapservice-v2 with user: hadoopqa.
 Cause: com.atlassian.jira.rpc.exception.RemoteAuthenticationException: Attempt to log in user 'hadoopqa' failed. The maximum number of failed login attempts has been reached. Please log into the application through the web interface to reset the number of failed login attempts.


======================================================================
======================================================================
    Finished build.
======================================================================
======================================================================


Build step 'Execute shell' marked build as failure
Archiving artifacts
Sending artifact delta relative to PreCommit-YARN-Build #7248
Archived 30 artifacts
Archive block size is 32768
Received 211 blocks and 2968980 bytes
Compression is 70.0%
Took 2.7 sec
[description-setter] Could not determine description.
Recording test results
Email was triggered for: Failure
Sending email for trigger: Failure



###################################################################################
############################## FAILED TESTS (if any) ##############################
All tests passed

Failed: YARN-3457 PreCommit Build #7252

Posted by Apache Jenkins Server <je...@builds.apache.org>.
Jira: https://issues.apache.org/jira/browse/YARN-3457
Build: https://builds.apache.org/job/PreCommit-YARN-Build/7252/

###################################################################################
########################## LAST 60 LINES OF THE CONSOLE ###########################
[...truncated 3519 lines...]

{color:red}-1 overall{color}.  Here are the results of testing the latest attachment 
  http://issues.apache.org/jira/secure/attachment/12723815/YARN-3457.001.patch
  against trunk revision ab04ff9.

    {color:green}+1 @author{color}.  The patch does not contain any @author tags.

    {color:red}-1 tests included{color}.  The patch doesn't appear to include any new or modified tests.
                        Please justify why no new tests are needed for this patch.
                        Also please list what manual steps were performed to verify this patch.

    {color:green}+1 javac{color}.  The applied patch does not increase the total number of javac compiler warnings.

    {color:green}+1 javadoc{color}.  There were no new javadoc warning messages.

    {color:green}+1 eclipse:eclipse{color}.  The patch built with eclipse:eclipse.

    {color:green}+1 findbugs{color}.  The patch does not introduce any new Findbugs (version 2.0.3) warnings.

    {color:green}+1 release audit{color}.  The applied patch does not increase the total number of release audit warnings.

    {color:green}+1 core tests{color}.  The patch passed unit tests in hadoop-yarn-project/hadoop-yarn/hadoop-yarn-server/hadoop-yarn-server-nodemanager.

Test results: https://builds.apache.org/job/PreCommit-YARN-Build/7252//testReport/
Console output: https://builds.apache.org/job/PreCommit-YARN-Build/7252//console

This message is automatically generated.


======================================================================
======================================================================
    Adding comment to Jira.
======================================================================
======================================================================


Comment added.
f42f72ece83f011366ec8c28cc5d2a1c758840e3 logged out


======================================================================
======================================================================
    Finished build.
======================================================================
======================================================================


Build step 'Execute shell' marked build as failure
Archiving artifacts
Sending artifact delta relative to PreCommit-YARN-Build #7248
Archived 15 artifacts
Archive block size is 32768
Received 48 blocks and 7457621 bytes
Compression is 17.4%
Took 1.6 sec
[description-setter] Could not determine description.
Recording test results
Email was triggered for: Failure
Sending email for trigger: Failure



###################################################################################
############################## FAILED TESTS (if any) ##############################
All tests passed