You are viewing a plain text version of this content. The canonical link for it is here.
Posted to builds@beam.apache.org by Apache Jenkins Server <je...@builds.apache.org> on 2020/02/25 00:48:11 UTC
Build failed in Jenkins:
beam_PostCommit_Java_ValidatesRunner_PortabilityApi_Dataflow #3106
See <https://builds.apache.org/job/beam_PostCommit_Java_ValidatesRunner_PortabilityApi_Dataflow/3106/display/redirect?page=changes>
Changes:
[github] [GoSDK] Fix race condition in statemgr & test (#10941)
[github] [BEAM-9347] Don't overwrite default runner harness for unified worker
------------------------------------------
[...truncated 31.95 KB...]
Resolving github.com/openzipkin/zipkin-go: commit='3741243b287094fda649c7f0fa74bd51f37dc122', urls=[https://github.com/openzipkin/zipkin-go.git, git@github.com:openzipkin/zipkin-go.git]
Resolving github.com/pelletier/go-toml: commit='acdc4509485b587f5e675510c4f2c63e90ff68a8', urls=[https://github.com/pelletier/go-toml.git, git@github.com:pelletier/go-toml.git]
Resolving cached github.com/coreos/etcd: commit='11214aa33bf5a47d3d9d8dafe0f6b97237dfe921', urls=[https://github.com/coreos/etcd.git, git@github.com:coreos/etcd.git]
Resolving github.com/pierrec/lz4: commit='ed8d4cc3b461464e69798080a0092bd028910298', urls=[https://github.com/pierrec/lz4.git, git@github.com:pierrec/lz4.git]
Resolving github.com/pierrec/xxHash: commit='a0006b13c722f7f12368c00a3d3c2ae8a999a0c6', urls=[https://github.com/pierrec/xxHash.git, git@github.com:pierrec/xxHash.git]
Resolving github.com/pkg/errors: commit='30136e27e2ac8d167177e8a583aa4c3fea5be833', urls=[https://github.com/pkg/errors.git, git@github.com:pkg/errors.git]
Resolving github.com/pkg/sftp: commit='22e9c1ccc02fc1b9fa3264572e49109b68a86947', urls=[https://github.com/pkg/sftp.git, git@github.com:pkg/sftp.git]
Resolving github.com/prometheus/client_golang: commit='9bb6ab929dcbe1c8393cd9ef70387cb69811bd1c', urls=[https://github.com/prometheus/client_golang.git, git@github.com:prometheus/client_golang.git]
Resolving cached github.com/coreos/etcd: commit='11214aa33bf5a47d3d9d8dafe0f6b97237dfe921', urls=[https://github.com/coreos/etcd.git, git@github.com:coreos/etcd.git]
Resolving cached github.com/coreos/etcd: commit='11214aa33bf5a47d3d9d8dafe0f6b97237dfe921', urls=[https://github.com/coreos/etcd.git, git@github.com:coreos/etcd.git]
Resolving github.com/prometheus/procfs: commit='cb4147076ac75738c9a7d279075a253c0cc5acbd', urls=[https://github.com/prometheus/procfs.git, git@github.com:prometheus/procfs.git]
Resolving github.com/rcrowley/go-metrics: commit='8732c616f52954686704c8645fe1a9d59e9df7c1', urls=[https://github.com/rcrowley/go-metrics.git, git@github.com:rcrowley/go-metrics.git]
Resolving github.com/cpuguy83/go-md2man: commit='dc9f53734905c233adfc09fd4f063dce63ce3daf', urls=[https://github.com/cpuguy83/go-md2man.git, git@github.com:cpuguy83/go-md2man.git]
Resolving cached github.com/cpuguy83/go-md2man: commit='dc9f53734905c233adfc09fd4f063dce63ce3daf', urls=[https://github.com/cpuguy83/go-md2man.git, git@github.com:cpuguy83/go-md2man.git]
Resolving cached github.com/coreos/etcd: commit='11214aa33bf5a47d3d9d8dafe0f6b97237dfe921', urls=[https://github.com/coreos/etcd.git, git@github.com:coreos/etcd.git]
Resolving cached github.com/coreos/etcd: commit='11214aa33bf5a47d3d9d8dafe0f6b97237dfe921', urls=[https://github.com/coreos/etcd.git, git@github.com:coreos/etcd.git]
Resolving github.com/spf13/afero: commit='bb8f1927f2a9d3ab41c9340aa034f6b803f4359c', urls=[https://github.com/spf13/afero.git, git@github.com:spf13/afero.git]
Resolving github.com/spf13/cast: commit='acbeb36b902d72a7a4c18e8f3241075e7ab763e4', urls=[https://github.com/spf13/cast.git, git@github.com:spf13/cast.git]
Resolving github.com/spf13/cobra: commit='93959269ad99e80983c9ba742a7e01203a4c0e4f', urls=[https://github.com/spf13/cobra.git, git@github.com:spf13/cobra.git]
Resolving github.com/spf13/jwalterweatherman: commit='7c0cea34c8ece3fbeb2b27ab9b59511d360fb394', urls=[https://github.com/spf13/jwalterweatherman.git, git@github.com:spf13/jwalterweatherman.git]
Resolving cached github.com/coreos/etcd: commit='11214aa33bf5a47d3d9d8dafe0f6b97237dfe921', urls=[https://github.com/coreos/etcd.git, git@github.com:coreos/etcd.git]
Resolving github.com/spf13/viper: commit='aafc9e6bc7b7bb53ddaa75a5ef49a17d6e654be5', urls=[https://github.com/spf13/viper.git, git@github.com:spf13/viper.git]
Resolving github.com/stathat/go: commit='74669b9f388d9d788c97399a0824adbfee78400e', urls=[https://github.com/stathat/go.git, git@github.com:stathat/go.git]
Resolving cached github.com/coreos/etcd: commit='11214aa33bf5a47d3d9d8dafe0f6b97237dfe921', urls=[https://github.com/coreos/etcd.git, git@github.com:coreos/etcd.git]
Resolving cached github.com/coreos/etcd: commit='11214aa33bf5a47d3d9d8dafe0f6b97237dfe921', urls=[https://github.com/coreos/etcd.git, git@github.com:coreos/etcd.git]
Resolving cached github.com/coreos/etcd: commit='11214aa33bf5a47d3d9d8dafe0f6b97237dfe921', urls=[https://github.com/coreos/etcd.git, git@github.com:coreos/etcd.git]
Resolving cached github.com/coreos/etcd: commit='11214aa33bf5a47d3d9d8dafe0f6b97237dfe921', urls=[https://github.com/coreos/etcd.git, git@github.com:coreos/etcd.git]
Resolving github.com/xordataexchange/crypt: commit='b2862e3d0a775f18c7cfe02273500ae307b61218', urls=[https://github.com/xordataexchange/crypt.git, git@github.com:xordataexchange/crypt.git]
Resolving go.opencensus.io: commit='aa2b39d1618ef56ba156f27cfcdae9042f68f0bc', urls=[https://github.com/census-instrumentation/opencensus-go]
> Task :sdks:java:core:shadowJar
> Task :sdks:java:extensions:protobuf:extractIncludeProto
> Task :sdks:java:extensions:protobuf:generateProto NO-SOURCE
> Task :runners:local-java:compileJava FROM-CACHE
> Task :runners:local-java:classes UP-TO-DATE
> Task :runners:local-java:jar
> Task :runners:core-construction-java:compileJava FROM-CACHE
> Task :runners:core-construction-java:classes UP-TO-DATE
> Task :sdks:java:extensions:google-cloud-platform-core:compileJava FROM-CACHE
> Task :sdks:java:extensions:google-cloud-platform-core:classes UP-TO-DATE
> Task :sdks:go:resolveBuildDependencies
Resolving golang.org/x/crypto: commit='d9133f5469342136e669e85192a26056b587f503', urls=[https://go.googlesource.com/crypto]
> Task :sdks:java:io:common:compileTestJava FROM-CACHE
> Task :sdks:java:io:common:testClasses UP-TO-DATE
> Task :sdks:java:extensions:google-cloud-platform-core:jar
> Task :sdks:java:io:common:testJar
> Task :vendor:sdks-java-extensions-protobuf:compileJava FROM-CACHE
> Task :vendor:sdks-java-extensions-protobuf:classes UP-TO-DATE
> Task :sdks:java:io:kafka:compileJava FROM-CACHE
> Task :sdks:java:io:kafka:classes UP-TO-DATE
> Task :sdks:java:testing:test-utils:compileJava FROM-CACHE
> Task :sdks:java:testing:test-utils:classes UP-TO-DATE
> Task :runners:core-construction-java:jar
> Task :sdks:java:io:kafka:jar
> Task :sdks:java:testing:test-utils:jar
> Task :sdks:java:fn-execution:compileJava FROM-CACHE
> Task :sdks:java:fn-execution:classes UP-TO-DATE
> Task :sdks:java:testing:test-utils:compileTestJava FROM-CACHE
> Task :sdks:java:testing:test-utils:testClasses UP-TO-DATE
> Task :sdks:java:fn-execution:jar
> Task :sdks:java:testing:test-utils:testJar
> Task :vendor:sdks-java-extensions-protobuf:shadowJar
> Task :runners:core-java:compileJava FROM-CACHE
> Task :runners:core-java:classes UP-TO-DATE
> Task :sdks:java:extensions:protobuf:compileJava FROM-CACHE
> Task :runners:core-java:jar
> Task :sdks:java:extensions:protobuf:classes UP-TO-DATE
> Task :sdks:java:extensions:protobuf:jar
> Task :sdks:java:harness:compileJava FROM-CACHE
> Task :sdks:java:harness:classes UP-TO-DATE
> Task :sdks:java:harness:jar
> Task :sdks:java:io:google-cloud-platform:compileJava FROM-CACHE
> Task :sdks:java:io:google-cloud-platform:classes UP-TO-DATE
> Task :sdks:java:core:compileTestJava FROM-CACHE
> Task :sdks:java:core:testClasses
> Task :sdks:java:io:google-cloud-platform:jar
> Task :runners:google-cloud-dataflow-java:compileJava FROM-CACHE
> Task :runners:google-cloud-dataflow-java:classes
> Task :runners:google-cloud-dataflow-java:jar
> Task :sdks:go:resolveBuildDependencies
Resolving golang.org/x/debug: commit='95515998a8a4bd7448134b2cb5971dbeb12e0b77', urls=[https://go.googlesource.com/debug]
Resolving golang.org/x/net: commit='2fb46b16b8dda405028c50f7c7f0f9dd1fa6bfb1', urls=[https://go.googlesource.com/net]
Resolving golang.org/x/oauth2: commit='a032972e28060ca4f5644acffae3dfc268cc09db', urls=[https://go.googlesource.com/oauth2]
Resolving golang.org/x/sync: commit='fd80eb99c8f653c847d294a001bdf2a3a6f768f5', urls=[https://go.googlesource.com/sync]
> Task :sdks:java:core:shadowTestJar
> Task :sdks:java:extensions:google-cloud-platform-core:compileTestJava FROM-CACHE
> Task :sdks:java:extensions:google-cloud-platform-core:testClasses UP-TO-DATE
> Task :sdks:java:extensions:google-cloud-platform-core:testJar
> Task :sdks:go:resolveBuildDependencies
Resolving golang.org/x/sys: commit='37707fdb30a5b38865cfb95e5aab41707daec7fd', urls=[https://go.googlesource.com/sys]
Resolving cached github.com/coreos/etcd: commit='11214aa33bf5a47d3d9d8dafe0f6b97237dfe921', urls=[https://github.com/coreos/etcd.git, git@github.com:coreos/etcd.git]
Resolving cached github.com/coreos/etcd: commit='11214aa33bf5a47d3d9d8dafe0f6b97237dfe921', urls=[https://github.com/coreos/etcd.git, git@github.com:coreos/etcd.git]
> Task :sdks:java:harness:shadowJar
> Task :sdks:java:container:copyDockerfileDependencies
> Task :runners:java-fn-execution:compileJava FROM-CACHE
> Task :runners:java-fn-execution:classes UP-TO-DATE
> Task :runners:java-fn-execution:jar
> Task :runners:direct-java:compileJava FROM-CACHE
> Task :runners:direct-java:classes UP-TO-DATE
> Task :runners:google-cloud-dataflow-java:worker:compileJava FROM-CACHE
> Task :runners:google-cloud-dataflow-java:worker:classes
> Task :runners:direct-java:shadowJar
> Task :sdks:java:io:google-cloud-platform:compileTestJava FROM-CACHE
> Task :sdks:java:io:google-cloud-platform:testClasses UP-TO-DATE
> Task :sdks:java:io:google-cloud-platform:testJar
> Task :runners:google-cloud-dataflow-java:compileTestJava FROM-CACHE
> Task :runners:google-cloud-dataflow-java:testClasses UP-TO-DATE
> Task :runners:google-cloud-dataflow-java:testJar
> Task :runners:google-cloud-dataflow-java:worker:shadowJar
> Task :sdks:go:resolveBuildDependencies
Resolving google.golang.org/api: commit='386d4e5f4f92f86e6aec85985761bba4b938a2d5', urls=[https://code.googlesource.com/google-api-go-client]
Resolving google.golang.org/genproto: commit='2b5a72b8730b0b16380010cfe5286c42108d88e7', urls=[https://github.com/google/go-genproto]
Resolving google.golang.org/grpc: commit='7646b5360d049a7ca31e9133315db43456f39e2e', urls=[https://github.com/grpc/grpc-go]
Resolving cached github.com/coreos/etcd: commit='11214aa33bf5a47d3d9d8dafe0f6b97237dfe921', urls=[https://github.com/coreos/etcd.git, git@github.com:coreos/etcd.git]
Resolving cached github.com/coreos/etcd: commit='11214aa33bf5a47d3d9d8dafe0f6b97237dfe921', urls=[https://github.com/coreos/etcd.git, git@github.com:coreos/etcd.git]
> Task :sdks:go:installDependencies
> Task :sdks:go:buildLinuxAmd64
> Task :sdks:go:goBuild
> Task :sdks:java:container:resolveBuildDependencies
Resolving ./github.com/apache/beam/sdks/go@<https://builds.apache.org/job/beam_PostCommit_Java_ValidatesRunner_PortabilityApi_Dataflow/ws/src/sdks/go>
> Task :sdks:java:container:installDependencies
> Task :sdks:java:container:buildLinuxAmd64
> Task :sdks:java:container:goBuild
> Task :sdks:java:container:dockerPrepare
> Task :sdks:java:container:docker
> Task :runners:google-cloud-dataflow-java:buildAndPushDockerContainer
WARNING: `gcloud docker` will not be supported for Docker client versions above 18.03.
As an alternative, use `gcloud auth configure-docker` to configure `docker` to
use `gcloud` as a credential helper, then use `docker` as you would for non-GCR
registries, e.g. `docker pull gcr.io/project-id/my-image`. Add
`--verbosity=error` to silence this warning: `gcloud docker
--verbosity=error -- pull gcr.io/project-id/my-image`.
See: https://cloud.google.com/container-registry/docs/support/deprecation-notices#gcloud-docker
The push refers to repository [us.gcr.io/apache-beam-testing/java-postcommit-it/java]
bebff931800d: Preparing
4a337883711d: Preparing
c4e66c02e6bb: Preparing
229a3632058f: Preparing
16da43654254: Preparing
8132fe859cc9: Preparing
e11042b69baa: Preparing
58080c4d9aa4: Preparing
c601709dd5d2: Preparing
72ce39f2b7f6: Preparing
33783834b288: Preparing
5c813a85f7f0: Preparing
bdca38f94ff0: Preparing
faac394a1ad3: Preparing
ce8168f12337: Preparing
5c813a85f7f0: Waiting
bdca38f94ff0: Waiting
e11042b69baa: Waiting
faac394a1ad3: Waiting
72ce39f2b7f6: Waiting
58080c4d9aa4: Waiting
c601709dd5d2: Waiting
ce8168f12337: Waiting
33783834b288: Waiting
8132fe859cc9: Waiting
bebff931800d: Pushed
16da43654254: Pushed
4a337883711d: Pushed
229a3632058f: Pushed
c601709dd5d2: Layer already exists
72ce39f2b7f6: Layer already exists
33783834b288: Layer already exists
5c813a85f7f0: Layer already exists
bdca38f94ff0: Layer already exists
faac394a1ad3: Layer already exists
ce8168f12337: Layer already exists
c4e66c02e6bb: Pushed
58080c4d9aa4: Pushed
e11042b69baa: Pushed
8132fe859cc9: Pushed
20200224224727: digest: sha256:a7c30544825fd20e98b624e415ea27ea2c5d5bfbf6bd1a47c8e6ebc4a74ff2c7 size: 3470
> Task :runners:google-cloud-dataflow-java:validatesRunnerFnApiWorkerTest
org.apache.beam.sdk.transforms.ParDoTest$TimerFamilyTests > testTimerWithMultipleTimerFamilyUnbounded FAILED
java.lang.RuntimeException at ParDoTest.java:4725
org.apache.beam.sdk.transforms.ParDoTest$TimerFamilyTests > testTimerWithMultipleTimerFamilyBounded FAILED
java.lang.RuntimeException at ParDoTest.java:4725
org.apache.beam.sdk.transforms.ParDoTest$TimerFamilyTests > testTimerFamilyAndTimerBounded FAILED
java.lang.RuntimeException at ParDoTest.java:4786
org.apache.beam.sdk.transforms.ParDoTest$TimerFamilyTests > testTimerFamilyAndTimerUnbounded FAILED
java.lang.RuntimeException at ParDoTest.java:4786
org.apache.beam.sdk.transforms.ParDoTest$TimerFamilyTests > testTimerFamilyEventTimeBounded FAILED
java.lang.RuntimeException at ParDoTest.java:4663
org.apache.beam.sdk.transforms.ParDoTest$TimerFamilyTests > testTimerFamilyEventTimeUnbounded FAILED
java.lang.RuntimeException at ParDoTest.java:4663
157 tests completed, 6 failed, 3 skipped
> Task :runners:google-cloud-dataflow-java:validatesRunnerFnApiWorkerTest FAILED
> Task :runners:google-cloud-dataflow-java:cleanUpDockerImages
Untagged: us.gcr.io/apache-beam-testing/java-postcommit-it/java:20200224224727
Untagged: us.gcr.io/apache-beam-testing/java-postcommit-it/java@sha256:a7c30544825fd20e98b624e415ea27ea2c5d5bfbf6bd1a47c8e6ebc4a74ff2c7
Digests:
- us.gcr.io/apache-beam-testing/java-postcommit-it/java@sha256:a7c30544825fd20e98b624e415ea27ea2c5d5bfbf6bd1a47c8e6ebc4a74ff2c7
Associated tags:
- 20200224224727
Tags:
- us.gcr.io/apache-beam-testing/java-postcommit-it/java:20200224224727
Deleted [us.gcr.io/apache-beam-testing/java-postcommit-it/java:20200224224727].
Deleted [us.gcr.io/apache-beam-testing/java-postcommit-it/java@sha256:a7c30544825fd20e98b624e415ea27ea2c5d5bfbf6bd1a47c8e6ebc4a74ff2c7].
FAILURE: Build failed with an exception.
* What went wrong:
Execution failed for task ':runners:google-cloud-dataflow-java:validatesRunnerFnApiWorkerTest'.
> There were failing tests. See the report at: file://<https://builds.apache.org/job/beam_PostCommit_Java_ValidatesRunner_PortabilityApi_Dataflow/ws/src/runners/google-cloud-dataflow-java/build/reports/tests/validatesRunnerFnApiWorkerTest/index.html>
* Try:
Run with --stacktrace option to get the stack trace. Run with --info or --debug option to get more log output. Run with --scan to get full insights.
* Get more help at https://help.gradle.org
Deprecated Gradle features were used in this build, making it incompatible with Gradle 6.0.
Use '--warning-mode all' to show the individual deprecation warnings.
See https://docs.gradle.org/5.2.1/userguide/command_line_interface.html#sec:command_line_warnings
BUILD FAILED in 2h 0m 54s
97 actionable tasks: 69 executed, 27 from cache, 1 up-to-date
Publishing build scan...
https://gradle.com/s/ovgbyqunyvh6u
Build step 'Invoke Gradle script' changed build result to FAILURE
Build step 'Invoke Gradle script' marked build as failure
---------------------------------------------------------------------
To unsubscribe, e-mail: builds-unsubscribe@beam.apache.org
For additional commands, e-mail: builds-help@beam.apache.org
Build failed in Jenkins:
beam_PostCommit_Java_ValidatesRunner_PortabilityApi_Dataflow #3109
Posted by Apache Jenkins Server <je...@builds.apache.org>.
See <https://builds.apache.org/job/beam_PostCommit_Java_ValidatesRunner_PortabilityApi_Dataflow/3109/display/redirect?page=changes>
Changes:
[github] [BEAM-9240]: Check for Nullability in typesEqual() method of FieldType
------------------------------------------
[...truncated 42.20 KB...]
> Task :sdks:java:testing:test-utils:jar
> Task :runners:core-construction-java:compileJava FROM-CACHE
> Task :runners:core-construction-java:classes UP-TO-DATE
> Task :sdks:java:fn-execution:compileJava FROM-CACHE
> Task :sdks:java:fn-execution:classes UP-TO-DATE
> Task :sdks:java:testing:test-utils:compileTestJava FROM-CACHE
> Task :runners:core-construction-java:jar
> Task :sdks:java:testing:test-utils:testClasses UP-TO-DATE
> Task :sdks:java:io:google-cloud-platform:compileJava FROM-CACHE
> Task :sdks:java:io:google-cloud-platform:classes UP-TO-DATE
> Task :sdks:java:testing:test-utils:testJar
> Task :sdks:java:fn-execution:jar
> Task :sdks:java:io:google-cloud-platform:jar
> Task :sdks:go:resolveBuildDependencies
Resolving golang.org/x/crypto: commit='d9133f5469342136e669e85192a26056b587f503', urls=[https://go.googlesource.com/crypto]
> Task :runners:core-java:compileJava FROM-CACHE
> Task :runners:core-java:classes UP-TO-DATE
> Task :runners:core-java:jar
> Task :runners:google-cloud-dataflow-java:compileJava FROM-CACHE
> Task :runners:google-cloud-dataflow-java:classes
> Task :sdks:java:harness:compileJava FROM-CACHE
> Task :sdks:java:harness:classes UP-TO-DATE
> Task :sdks:java:harness:jar
> Task :runners:google-cloud-dataflow-java:jar
> Task :sdks:go:resolveBuildDependencies
Resolving golang.org/x/debug: commit='95515998a8a4bd7448134b2cb5971dbeb12e0b77', urls=[https://go.googlesource.com/debug]
Resolving golang.org/x/net: commit='2fb46b16b8dda405028c50f7c7f0f9dd1fa6bfb1', urls=[https://go.googlesource.com/net]
Resolving golang.org/x/oauth2: commit='a032972e28060ca4f5644acffae3dfc268cc09db', urls=[https://go.googlesource.com/oauth2]
Resolving golang.org/x/sync: commit='fd80eb99c8f653c847d294a001bdf2a3a6f768f5', urls=[https://go.googlesource.com/sync]
Resolving golang.org/x/sys: commit='37707fdb30a5b38865cfb95e5aab41707daec7fd', urls=[https://go.googlesource.com/sys]
Resolving cached github.com/coreos/etcd: commit='11214aa33bf5a47d3d9d8dafe0f6b97237dfe921', urls=[https://github.com/coreos/etcd.git, git@github.com:coreos/etcd.git]
Resolving cached github.com/coreos/etcd: commit='11214aa33bf5a47d3d9d8dafe0f6b97237dfe921', urls=[https://github.com/coreos/etcd.git, git@github.com:coreos/etcd.git]
> Task :sdks:java:harness:shadowJar
> Task :sdks:java:container:copyDockerfileDependencies
> Task :runners:java-fn-execution:compileJava FROM-CACHE
> Task :runners:java-fn-execution:classes UP-TO-DATE
> Task :runners:java-fn-execution:jar
> Task :runners:direct-java:compileJava FROM-CACHE
> Task :runners:direct-java:classes UP-TO-DATE
> Task :runners:google-cloud-dataflow-java:worker:compileJava FROM-CACHE
> Task :runners:google-cloud-dataflow-java:worker:classes
> Task :runners:direct-java:shadowJar
> Task :sdks:java:core:compileTestJava
Note: Some input files use or override a deprecated API.
Note: Recompile with -Xlint:deprecation for details.
Note: Some input files use unchecked or unsafe operations.
Note: Recompile with -Xlint:unchecked for details.
> Task :sdks:java:core:testClasses
> Task :sdks:java:core:shadowTestJar
> Task :runners:google-cloud-dataflow-java:worker:shadowJar
> Task :sdks:java:extensions:google-cloud-platform-core:compileTestJava
Note: Some input files use or override a deprecated API.
Note: Recompile with -Xlint:deprecation for details.
> Task :sdks:java:extensions:google-cloud-platform-core:testClasses
> Task :sdks:java:extensions:google-cloud-platform-core:testJar
> Task :sdks:java:io:google-cloud-platform:compileTestJava
Note: Some input files use or override a deprecated API.
Note: Recompile with -Xlint:deprecation for details.
Note: Some input files use unchecked or unsafe operations.
Note: Recompile with -Xlint:unchecked for details.
> Task :sdks:java:io:google-cloud-platform:testClasses
> Task :sdks:java:io:google-cloud-platform:testJar
> Task :runners:google-cloud-dataflow-java:compileTestJava
Note: Some input files use or override a deprecated API.
Note: Recompile with -Xlint:deprecation for details.
Note: Some input files use unchecked or unsafe operations.
Note: Recompile with -Xlint:unchecked for details.
> Task :runners:google-cloud-dataflow-java:testClasses
> Task :runners:google-cloud-dataflow-java:testJar
> Task :sdks:go:resolveBuildDependencies
Resolving google.golang.org/api: commit='386d4e5f4f92f86e6aec85985761bba4b938a2d5', urls=[https://code.googlesource.com/google-api-go-client]
Resolving google.golang.org/genproto: commit='2b5a72b8730b0b16380010cfe5286c42108d88e7', urls=[https://github.com/google/go-genproto]
Resolving google.golang.org/grpc: commit='7646b5360d049a7ca31e9133315db43456f39e2e', urls=[https://github.com/grpc/grpc-go]
Resolving cached github.com/coreos/etcd: commit='11214aa33bf5a47d3d9d8dafe0f6b97237dfe921', urls=[https://github.com/coreos/etcd.git, git@github.com:coreos/etcd.git]
Resolving cached github.com/coreos/etcd: commit='11214aa33bf5a47d3d9d8dafe0f6b97237dfe921', urls=[https://github.com/coreos/etcd.git, git@github.com:coreos/etcd.git]
> Task :sdks:go:installDependencies
> Task :sdks:go:buildLinuxAmd64
> Task :sdks:go:goBuild
> Task :sdks:java:container:resolveBuildDependencies
Resolving ./github.com/apache/beam/sdks/go@/home/jenkins/jenkins-slave/workspace/beam_PostCommit_Java_ValidatesRunner_PortabilityApi_Dataflow/src/sdks/go
> Task :sdks:java:container:installDependencies
> Task :sdks:java:container:buildLinuxAmd64
> Task :sdks:java:container:goBuild
> Task :sdks:java:container:dockerPrepare
> Task :sdks:java:container:docker
> Task :runners:google-cloud-dataflow-java:buildAndPushDockerContainer
WARNING: `gcloud docker` will not be supported for Docker client versions above 18.03.
As an alternative, use `gcloud auth configure-docker` to configure `docker` to
use `gcloud` as a credential helper, then use `docker` as you would for non-GCR
registries, e.g. `docker pull gcr.io/project-id/my-image`. Add
`--verbosity=error` to silence this warning: `gcloud docker
--verbosity=error -- pull gcr.io/project-id/my-image`.
See: https://cloud.google.com/container-registry/docs/support/deprecation-notices#gcloud-docker
The push refers to repository [us.gcr.io/apache-beam-testing/java-postcommit-it/java]
fe4a5f5320a1: Preparing
87e522bf7d6e: Preparing
77fde59f57c7: Preparing
e4fbcc58dcf1: Preparing
3cadf6d8f99e: Preparing
da0e188dff4a: Preparing
9a41df7f98d3: Preparing
ad5be2e1aab3: Preparing
c601709dd5d2: Preparing
72ce39f2b7f6: Preparing
33783834b288: Preparing
da0e188dff4a: Waiting
9a41df7f98d3: Waiting
5c813a85f7f0: Preparing
bdca38f94ff0: Preparing
c601709dd5d2: Waiting
33783834b288: Waiting
5c813a85f7f0: Waiting
faac394a1ad3: Preparing
ce8168f12337: Preparing
bdca38f94ff0: Waiting
72ce39f2b7f6: Waiting
faac394a1ad3: Waiting
fe4a5f5320a1: Pushed
87e522bf7d6e: Pushed
3cadf6d8f99e: Pushed
e4fbcc58dcf1: Pushed
c601709dd5d2: Layer already exists
72ce39f2b7f6: Layer already exists
33783834b288: Layer already exists
5c813a85f7f0: Layer already exists
bdca38f94ff0: Layer already exists
faac394a1ad3: Layer already exists
ce8168f12337: Layer already exists
9a41df7f98d3: Pushed
ad5be2e1aab3: Pushed
77fde59f57c7: Pushed
da0e188dff4a: Pushed
20200225053407: digest: sha256:1d0c4feea2ead481859fa12cdd7096457435951f3a006129224cf7dc4d972361 size: 3470
> Task :runners:google-cloud-dataflow-java:validatesRunnerFnApiWorkerTest
org.apache.beam.sdk.transforms.ParDoTest$TimerFamilyTests > testTimerWithMultipleTimerFamilyUnbounded FAILED
java.lang.RuntimeException at ParDoTest.java:4725
org.apache.beam.sdk.transforms.ParDoTest$TimerFamilyTests > testTimerWithMultipleTimerFamilyBounded FAILED
java.lang.RuntimeException at ParDoTest.java:4725
org.apache.beam.sdk.transforms.ParDoTest$TimerFamilyTests > testTimerFamilyAndTimerBounded FAILED
java.lang.RuntimeException at ParDoTest.java:4786
org.apache.beam.sdk.transforms.ParDoTest$TimerFamilyTests > testTimerFamilyAndTimerUnbounded FAILED
java.lang.RuntimeException at ParDoTest.java:4786
org.apache.beam.sdk.transforms.ParDoTest$TimerFamilyTests > testTimerFamilyEventTimeBounded FAILED
java.lang.RuntimeException at ParDoTest.java:4663
org.apache.beam.sdk.transforms.ParDoTest$TimerFamilyTests > testTimerFamilyEventTimeUnbounded FAILED
java.lang.RuntimeException at ParDoTest.java:4663
FATAL: command execution failed
java.io.IOException: Backing channel 'JNLP4-connect connection from 89.93.66.34.bc.googleusercontent.com/34.66.93.89:60646' is disconnected.
at hudson.remoting.RemoteInvocationHandler.channelOrFail(RemoteInvocationHandler.java:214)
at hudson.remoting.RemoteInvocationHandler.invoke(RemoteInvocationHandler.java:283)
at com.sun.proxy.$Proxy143.isAlive(Unknown Source)
at hudson.Launcher$RemoteLauncher$ProcImpl.isAlive(Launcher.java:1150)
at hudson.Launcher$RemoteLauncher$ProcImpl.join(Launcher.java:1142)
at hudson.Launcher$ProcStarter.join(Launcher.java:470)
at hudson.plugins.gradle.Gradle.perform(Gradle.java:317)
at hudson.tasks.BuildStepMonitor$1.perform(BuildStepMonitor.java:20)
at hudson.model.AbstractBuild$AbstractBuildExecution.perform(AbstractBuild.java:741)
at hudson.model.Build$BuildExecution.build(Build.java:206)
at hudson.model.Build$BuildExecution.doRun(Build.java:163)
at hudson.model.AbstractBuild$AbstractBuildExecution.run(AbstractBuild.java:504)
at hudson.model.Run.execute(Run.java:1815)
at hudson.model.FreeStyleBuild.run(FreeStyleBuild.java:43)
at hudson.model.ResourceController.execute(ResourceController.java:97)
at hudson.model.Executor.run(Executor.java:429)
Caused by: java.nio.channels.ClosedChannelException
at org.jenkinsci.remoting.protocol.impl.ChannelApplicationLayer.onReadClosed(ChannelApplicationLayer.java:209)
at org.jenkinsci.remoting.protocol.ApplicationLayer.onRecvClosed(ApplicationLayer.java:222)
at org.jenkinsci.remoting.protocol.ProtocolStack$Ptr.onRecvClosed(ProtocolStack.java:816)
at org.jenkinsci.remoting.protocol.FilterLayer.onRecvClosed(FilterLayer.java:287)
at org.jenkinsci.remoting.protocol.impl.SSLEngineFilterLayer.onRecvClosed(SSLEngineFilterLayer.java:181)
at org.jenkinsci.remoting.protocol.impl.SSLEngineFilterLayer.switchToNoSecure(SSLEngineFilterLayer.java:283)
at org.jenkinsci.remoting.protocol.impl.SSLEngineFilterLayer.processWrite(SSLEngineFilterLayer.java:503)
at org.jenkinsci.remoting.protocol.impl.SSLEngineFilterLayer.processQueuedWrites(SSLEngineFilterLayer.java:248)
at org.jenkinsci.remoting.protocol.impl.SSLEngineFilterLayer.doSend(SSLEngineFilterLayer.java:200)
at org.jenkinsci.remoting.protocol.impl.SSLEngineFilterLayer.doCloseSend(SSLEngineFilterLayer.java:213)
at org.jenkinsci.remoting.protocol.ProtocolStack$Ptr.doCloseSend(ProtocolStack.java:784)
at org.jenkinsci.remoting.protocol.ApplicationLayer.doCloseWrite(ApplicationLayer.java:173)
at org.jenkinsci.remoting.protocol.impl.ChannelApplicationLayer$ByteBufferCommandTransport.closeWrite(ChannelApplicationLayer.java:314)
at hudson.remoting.Channel.close(Channel.java:1452)
at hudson.remoting.Channel.close(Channel.java:1405)
at hudson.slaves.SlaveComputer.closeChannel(SlaveComputer.java:847)
at hudson.slaves.SlaveComputer.kill(SlaveComputer.java:814)
at hudson.model.AbstractCIBase.killComputer(AbstractCIBase.java:89)
at jenkins.model.Jenkins.access$2100(Jenkins.java:312)
at jenkins.model.Jenkins$19.run(Jenkins.java:3464)
at hudson.model.Queue._withLock(Queue.java:1379)
at hudson.model.Queue.withLock(Queue.java:1256)
at jenkins.model.Jenkins._cleanUpDisconnectComputers(Jenkins.java:3458)
at jenkins.model.Jenkins.cleanUp(Jenkins.java:3336)
at hudson.WebAppMain.contextDestroyed(WebAppMain.java:379)
at org.apache.catalina.core.StandardContext.listenerStop(StandardContext.java:4732)
at org.apache.catalina.core.StandardContext.stopInternal(StandardContext.java:5396)
at org.apache.catalina.util.LifecycleBase.stop(LifecycleBase.java:257)
at org.apache.catalina.core.ContainerBase$StopChild.call(ContainerBase.java:1400)
at org.apache.catalina.core.ContainerBase$StopChild.call(ContainerBase.java:1389)
at java.util.concurrent.FutureTask.run(FutureTask.java:266)
at org.apache.tomcat.util.threads.InlineExecutorService.execute(InlineExecutorService.java:75)
at java.util.concurrent.AbstractExecutorService.submit(AbstractExecutorService.java:134)
at org.apache.catalina.core.ContainerBase.stopInternal(ContainerBase.java:976)
at org.apache.catalina.util.LifecycleBase.stop(LifecycleBase.java:257)
at org.apache.catalina.core.ContainerBase$StopChild.call(ContainerBase.java:1400)
at org.apache.catalina.core.ContainerBase$StopChild.call(ContainerBase.java:1389)
at java.util.concurrent.FutureTask.run(FutureTask.java:266)
at org.apache.tomcat.util.threads.InlineExecutorService.execute(InlineExecutorService.java:75)
at java.util.concurrent.AbstractExecutorService.submit(AbstractExecutorService.java:134)
at org.apache.catalina.core.ContainerBase.stopInternal(ContainerBase.java:976)
at org.apache.catalina.util.LifecycleBase.stop(LifecycleBase.java:257)
at org.apache.catalina.core.StandardService.stopInternal(StandardService.java:473)
at org.apache.catalina.util.LifecycleBase.stop(LifecycleBase.java:257)
at org.apache.catalina.core.StandardServer.stopInternal(StandardServer.java:994)
at org.apache.catalina.util.LifecycleBase.stop(LifecycleBase.java:257)
at org.apache.catalina.startup.Catalina.stop(Catalina.java:706)
at org.apache.catalina.startup.Catalina.start(Catalina.java:668)
at sun.reflect.NativeMethodAccessorImpl.invoke0(Native Method)
at sun.reflect.NativeMethodAccessorImpl.invoke(NativeMethodAccessorImpl.java:62)
at sun.reflect.DelegatingMethodAccessorImpl.invoke(DelegatingMethodAccessorImpl.java:43)
at java.lang.reflect.Method.invoke(Method.java:498)
at org.apache.catalina.startup.Bootstrap.start(Bootstrap.java:344)
at org.apache.catalina.startup.Bootstrap.main(Bootstrap.java:475)
Build step 'Invoke Gradle script' changed build result to FAILURE
Build step 'Invoke Gradle script' marked build as failure
ERROR: apache-beam-jenkins-3 is offline; cannot locate JDK 1.8 (latest)
---------------------------------------------------------------------
To unsubscribe, e-mail: builds-unsubscribe@beam.apache.org
For additional commands, e-mail: builds-help@beam.apache.org
Build failed in Jenkins:
beam_PostCommit_Java_ValidatesRunner_PortabilityApi_Dataflow #3108
Posted by Apache Jenkins Server <je...@builds.apache.org>.
See <https://builds.apache.org/job/beam_PostCommit_Java_ValidatesRunner_PortabilityApi_Dataflow/3108/display/redirect?page=changes>
Changes:
[github] [BEAM-7926] Data-centric Interactive Part3 (#10731)
------------------------------------------
[...truncated 35.02 KB...]
Resolving github.com/spf13/jwalterweatherman: commit='7c0cea34c8ece3fbeb2b27ab9b59511d360fb394', urls=[https://github.com/spf13/jwalterweatherman.git, git@github.com:spf13/jwalterweatherman.git]
Resolving cached github.com/coreos/etcd: commit='11214aa33bf5a47d3d9d8dafe0f6b97237dfe921', urls=[https://github.com/coreos/etcd.git, git@github.com:coreos/etcd.git]
Resolving github.com/spf13/viper: commit='aafc9e6bc7b7bb53ddaa75a5ef49a17d6e654be5', urls=[https://github.com/spf13/viper.git, git@github.com:spf13/viper.git]
Resolving github.com/stathat/go: commit='74669b9f388d9d788c97399a0824adbfee78400e', urls=[https://github.com/stathat/go.git, git@github.com:stathat/go.git]
Resolving cached github.com/coreos/etcd: commit='11214aa33bf5a47d3d9d8dafe0f6b97237dfe921', urls=[https://github.com/coreos/etcd.git, git@github.com:coreos/etcd.git]
Resolving cached github.com/coreos/etcd: commit='11214aa33bf5a47d3d9d8dafe0f6b97237dfe921', urls=[https://github.com/coreos/etcd.git, git@github.com:coreos/etcd.git]
Resolving cached github.com/coreos/etcd: commit='11214aa33bf5a47d3d9d8dafe0f6b97237dfe921', urls=[https://github.com/coreos/etcd.git, git@github.com:coreos/etcd.git]
Resolving cached github.com/coreos/etcd: commit='11214aa33bf5a47d3d9d8dafe0f6b97237dfe921', urls=[https://github.com/coreos/etcd.git, git@github.com:coreos/etcd.git]
Resolving github.com/xordataexchange/crypt: commit='b2862e3d0a775f18c7cfe02273500ae307b61218', urls=[https://github.com/xordataexchange/crypt.git, git@github.com:xordataexchange/crypt.git]
Resolving go.opencensus.io: commit='aa2b39d1618ef56ba156f27cfcdae9042f68f0bc', urls=[https://github.com/census-instrumentation/opencensus-go]
> Task :sdks:java:core:shadowJar
> Task :sdks:java:extensions:protobuf:extractIncludeProto
> Task :sdks:java:extensions:protobuf:generateProto NO-SOURCE
> Task :sdks:java:extensions:google-cloud-platform-core:compileJava FROM-CACHE
> Task :sdks:java:extensions:google-cloud-platform-core:classes UP-TO-DATE
> Task :vendor:sdks-java-extensions-protobuf:compileJava FROM-CACHE
> Task :vendor:sdks-java-extensions-protobuf:classes UP-TO-DATE
> Task :sdks:java:extensions:google-cloud-platform-core:jar
> Task :runners:local-java:compileJava FROM-CACHE
> Task :runners:local-java:classes UP-TO-DATE
> Task :runners:local-java:jar
> Task :runners:core-construction-java:compileJava FROM-CACHE
> Task :runners:core-construction-java:classes UP-TO-DATE
> Task :sdks:java:io:kafka:compileJava FROM-CACHE
> Task :sdks:java:io:kafka:classes UP-TO-DATE
> Task :sdks:java:io:kafka:jar
> Task :sdks:java:fn-execution:compileJava FROM-CACHE
> Task :sdks:java:fn-execution:classes UP-TO-DATE
> Task :vendor:sdks-java-extensions-protobuf:shadowJar
> Task :sdks:go:resolveBuildDependencies
Resolving golang.org/x/crypto: commit='d9133f5469342136e669e85192a26056b587f503', urls=[https://go.googlesource.com/crypto]
> Task :sdks:java:fn-execution:jar
> Task :runners:core-construction-java:jar
> Task :sdks:java:extensions:protobuf:compileJava FROM-CACHE
> Task :sdks:java:extensions:protobuf:classes UP-TO-DATE
> Task :runners:core-java:compileJava FROM-CACHE
> Task :runners:core-java:classes UP-TO-DATE
> Task :sdks:java:extensions:protobuf:jar
> Task :runners:core-java:jar
> Task :sdks:java:harness:compileJava FROM-CACHE
> Task :sdks:java:harness:classes UP-TO-DATE
> Task :sdks:java:io:google-cloud-platform:compileJava FROM-CACHE
> Task :sdks:java:io:google-cloud-platform:classes UP-TO-DATE
> Task :sdks:java:harness:jar
> Task :sdks:java:core:compileTestJava FROM-CACHE
> Task :sdks:java:core:testClasses
> Task :sdks:java:io:google-cloud-platform:jar
> Task :runners:google-cloud-dataflow-java:compileJava FROM-CACHE
> Task :runners:google-cloud-dataflow-java:classes
> Task :runners:google-cloud-dataflow-java:jar
> Task :sdks:go:resolveBuildDependencies
Resolving golang.org/x/debug: commit='95515998a8a4bd7448134b2cb5971dbeb12e0b77', urls=[https://go.googlesource.com/debug]
Resolving golang.org/x/net: commit='2fb46b16b8dda405028c50f7c7f0f9dd1fa6bfb1', urls=[https://go.googlesource.com/net]
Resolving golang.org/x/oauth2: commit='a032972e28060ca4f5644acffae3dfc268cc09db', urls=[https://go.googlesource.com/oauth2]
Resolving golang.org/x/sync: commit='fd80eb99c8f653c847d294a001bdf2a3a6f768f5', urls=[https://go.googlesource.com/sync]
> Task :sdks:java:core:shadowTestJar
> Task :sdks:java:io:common:compileTestJava
Note: <https://builds.apache.org/job/beam_PostCommit_Java_ValidatesRunner_PortabilityApi_Dataflow/ws/src/sdks/java/io/common/src/test/java/org/apache/beam/sdk/io/common/IOITHelperTest.java> uses or overrides a deprecated API.
Note: Recompile with -Xlint:deprecation for details.
> Task :sdks:java:testing:test-utils:compileJava
> Task :sdks:java:io:common:testClasses
> Task :sdks:java:testing:test-utils:classes
> Task :sdks:go:resolveBuildDependencies
Resolving golang.org/x/sys: commit='37707fdb30a5b38865cfb95e5aab41707daec7fd', urls=[https://go.googlesource.com/sys]
Resolving cached github.com/coreos/etcd: commit='11214aa33bf5a47d3d9d8dafe0f6b97237dfe921', urls=[https://github.com/coreos/etcd.git, git@github.com:coreos/etcd.git]
Resolving cached github.com/coreos/etcd: commit='11214aa33bf5a47d3d9d8dafe0f6b97237dfe921', urls=[https://github.com/coreos/etcd.git, git@github.com:coreos/etcd.git]
> Task :sdks:java:io:common:testJar
> Task :sdks:java:testing:test-utils:jar
> Task :sdks:java:testing:test-utils:compileTestJava
> Task :sdks:java:testing:test-utils:testClasses
> Task :sdks:java:testing:test-utils:testJar
> Task :sdks:java:extensions:google-cloud-platform-core:compileTestJava
Note: Some input files use or override a deprecated API.
Note: Recompile with -Xlint:deprecation for details.
> Task :sdks:java:extensions:google-cloud-platform-core:testClasses
> Task :sdks:java:extensions:google-cloud-platform-core:testJar
> Task :sdks:java:harness:shadowJar
> Task :sdks:java:container:copyDockerfileDependencies
> Task :runners:java-fn-execution:compileJava FROM-CACHE
> Task :runners:java-fn-execution:classes UP-TO-DATE
> Task :runners:java-fn-execution:jar
> Task :runners:direct-java:compileJava FROM-CACHE
> Task :runners:direct-java:classes UP-TO-DATE
> Task :runners:google-cloud-dataflow-java:worker:compileJava FROM-CACHE
> Task :runners:google-cloud-dataflow-java:worker:classes
> Task :runners:direct-java:shadowJar
> Task :sdks:java:io:google-cloud-platform:compileTestJava
Note: Some input files use or override a deprecated API.
Note: Recompile with -Xlint:deprecation for details.
Note: Some input files use unchecked or unsafe operations.
Note: Recompile with -Xlint:unchecked for details.
> Task :sdks:java:io:google-cloud-platform:testClasses
> Task :sdks:java:io:google-cloud-platform:testJar
> Task :runners:google-cloud-dataflow-java:worker:shadowJar
> Task :runners:google-cloud-dataflow-java:compileTestJava
Note: Some input files use or override a deprecated API.
Note: Recompile with -Xlint:deprecation for details.
Note: Some input files use unchecked or unsafe operations.
Note: Recompile with -Xlint:unchecked for details.
> Task :runners:google-cloud-dataflow-java:testClasses
> Task :runners:google-cloud-dataflow-java:testJar
> Task :sdks:go:resolveBuildDependencies
Resolving google.golang.org/api: commit='386d4e5f4f92f86e6aec85985761bba4b938a2d5', urls=[https://code.googlesource.com/google-api-go-client]
Resolving google.golang.org/genproto: commit='2b5a72b8730b0b16380010cfe5286c42108d88e7', urls=[https://github.com/google/go-genproto]
Resolving google.golang.org/grpc: commit='7646b5360d049a7ca31e9133315db43456f39e2e', urls=[https://github.com/grpc/grpc-go]
Resolving cached github.com/coreos/etcd: commit='11214aa33bf5a47d3d9d8dafe0f6b97237dfe921', urls=[https://github.com/coreos/etcd.git, git@github.com:coreos/etcd.git]
Resolving cached github.com/coreos/etcd: commit='11214aa33bf5a47d3d9d8dafe0f6b97237dfe921', urls=[https://github.com/coreos/etcd.git, git@github.com:coreos/etcd.git]
> Task :sdks:go:installDependencies
> Task :sdks:go:buildLinuxAmd64
> Task :sdks:go:goBuild
> Task :sdks:java:container:resolveBuildDependencies
Resolving ./github.com/apache/beam/sdks/go@<https://builds.apache.org/job/beam_PostCommit_Java_ValidatesRunner_PortabilityApi_Dataflow/ws/src/sdks/go>
> Task :sdks:java:container:installDependencies
> Task :sdks:java:container:buildLinuxAmd64
> Task :sdks:java:container:goBuild
> Task :sdks:java:container:dockerPrepare
> Task :sdks:java:container:docker
> Task :runners:google-cloud-dataflow-java:buildAndPushDockerContainer
WARNING: `gcloud docker` will not be supported for Docker client versions above 18.03.
As an alternative, use `gcloud auth configure-docker` to configure `docker` to
use `gcloud` as a credential helper, then use `docker` as you would for non-GCR
registries, e.g. `docker pull gcr.io/project-id/my-image`. Add
`--verbosity=error` to silence this warning: `gcloud docker
--verbosity=error -- pull gcr.io/project-id/my-image`.
See: https://cloud.google.com/container-registry/docs/support/deprecation-notices#gcloud-docker
The push refers to repository [us.gcr.io/apache-beam-testing/java-postcommit-it/java]
ebbdd5fa732f: Preparing
cdfe10572901: Preparing
9acb13568333: Preparing
9b01cd156b35: Preparing
94d28781af51: Preparing
96e3c13cbda5: Preparing
b1cd818fec85: Preparing
c9759a6ac653: Preparing
c601709dd5d2: Preparing
72ce39f2b7f6: Preparing
33783834b288: Preparing
5c813a85f7f0: Preparing
bdca38f94ff0: Preparing
faac394a1ad3: Preparing
ce8168f12337: Preparing
c9759a6ac653: Waiting
96e3c13cbda5: Waiting
faac394a1ad3: Waiting
72ce39f2b7f6: Waiting
c601709dd5d2: Waiting
bdca38f94ff0: Waiting
b1cd818fec85: Waiting
ce8168f12337: Waiting
5c813a85f7f0: Waiting
9b01cd156b35: Pushed
ebbdd5fa732f: Pushed
cdfe10572901: Pushed
94d28781af51: Pushed
c601709dd5d2: Layer already exists
72ce39f2b7f6: Layer already exists
33783834b288: Layer already exists
5c813a85f7f0: Layer already exists
bdca38f94ff0: Layer already exists
faac394a1ad3: Layer already exists
ce8168f12337: Layer already exists
c9759a6ac653: Pushed
9acb13568333: Pushed
b1cd818fec85: Pushed
96e3c13cbda5: Pushed
20200225025717: digest: sha256:271c9e5363855b4ba99dc5166884eef86d1a559355cad99b5f951dcce9d060a4 size: 3470
> Task :runners:google-cloud-dataflow-java:validatesRunnerFnApiWorkerTest
org.apache.beam.sdk.transforms.ParDoTest$TimerFamilyTests > testTimerWithMultipleTimerFamilyUnbounded FAILED
java.lang.RuntimeException at ParDoTest.java:4725
org.apache.beam.sdk.transforms.ParDoTest$TimerFamilyTests > testTimerWithMultipleTimerFamilyBounded FAILED
java.lang.RuntimeException at ParDoTest.java:4725
org.apache.beam.sdk.transforms.ParDoTest$TimerFamilyTests > testTimerFamilyAndTimerBounded FAILED
java.lang.RuntimeException at ParDoTest.java:4786
org.apache.beam.sdk.transforms.ParDoTest$TimerFamilyTests > testTimerFamilyAndTimerUnbounded FAILED
java.lang.RuntimeException at ParDoTest.java:4786
org.apache.beam.sdk.transforms.ParDoTest$TimerFamilyTests > testTimerFamilyEventTimeBounded FAILED
java.lang.RuntimeException at ParDoTest.java:4663
org.apache.beam.sdk.transforms.ParDoTest$TimerFamilyTests > testTimerFamilyEventTimeUnbounded FAILED
java.lang.RuntimeException at ParDoTest.java:4663
157 tests completed, 6 failed, 3 skipped
> Task :runners:google-cloud-dataflow-java:validatesRunnerFnApiWorkerTest FAILED
> Task :runners:google-cloud-dataflow-java:cleanUpDockerImages
Untagged: us.gcr.io/apache-beam-testing/java-postcommit-it/java:20200225025717
Untagged: us.gcr.io/apache-beam-testing/java-postcommit-it/java@sha256:271c9e5363855b4ba99dc5166884eef86d1a559355cad99b5f951dcce9d060a4
Digests:
- us.gcr.io/apache-beam-testing/java-postcommit-it/java@sha256:271c9e5363855b4ba99dc5166884eef86d1a559355cad99b5f951dcce9d060a4
Associated tags:
- 20200225025717
Tags:
- us.gcr.io/apache-beam-testing/java-postcommit-it/java:20200225025717
Deleted [us.gcr.io/apache-beam-testing/java-postcommit-it/java:20200225025717].
Deleted [us.gcr.io/apache-beam-testing/java-postcommit-it/java@sha256:271c9e5363855b4ba99dc5166884eef86d1a559355cad99b5f951dcce9d060a4].
FAILURE: Build failed with an exception.
* What went wrong:
Execution failed for task ':runners:google-cloud-dataflow-java:validatesRunnerFnApiWorkerTest'.
> There were failing tests. See the report at: file://<https://builds.apache.org/job/beam_PostCommit_Java_ValidatesRunner_PortabilityApi_Dataflow/ws/src/runners/google-cloud-dataflow-java/build/reports/tests/validatesRunnerFnApiWorkerTest/index.html>
* Try:
Run with --stacktrace option to get the stack trace. Run with --info or --debug option to get more log output. Run with --scan to get full insights.
* Get more help at https://help.gradle.org
Deprecated Gradle features were used in this build, making it incompatible with Gradle 6.0.
Use '--warning-mode all' to show the individual deprecation warnings.
See https://docs.gradle.org/5.2.1/userguide/command_line_interface.html#sec:command_line_warnings
BUILD FAILED in 2h 0m 50s
97 actionable tasks: 75 executed, 21 from cache, 1 up-to-date
Publishing build scan...
https://gradle.com/s/ewb3odybnxir4
Build step 'Invoke Gradle script' changed build result to FAILURE
Build step 'Invoke Gradle script' marked build as failure
---------------------------------------------------------------------
To unsubscribe, e-mail: builds-unsubscribe@beam.apache.org
For additional commands, e-mail: builds-help@beam.apache.org
Build failed in Jenkins:
beam_PostCommit_Java_ValidatesRunner_PortabilityApi_Dataflow #3107
Posted by Apache Jenkins Server <je...@builds.apache.org>.
See <https://builds.apache.org/job/beam_PostCommit_Java_ValidatesRunner_PortabilityApi_Dataflow/3107/display/redirect?page=changes>
Changes:
[drubinstein] Bump google cloud bigquery to 1.24.0
[boyuanz] Clean up and add type-hints to SDF API
[relax] Support null fields in rows with ByteBuddy generated code.
[boyuanz] Update docstring of ManualWatermarkEstimator.set_watermark()
[boyuanz] Address comments
[boyuanz] Address comments again
[github] [BEAM-9228] Support further partition for FnApi ListBuffer (#10847)
------------------------------------------
[...truncated 34.38 KB...]
Resolving cached github.com/coreos/etcd: commit='11214aa33bf5a47d3d9d8dafe0f6b97237dfe921', urls=[https://github.com/coreos/etcd.git, git@github.com:coreos/etcd.git]
Resolving cached github.com/coreos/etcd: commit='11214aa33bf5a47d3d9d8dafe0f6b97237dfe921', urls=[https://github.com/coreos/etcd.git, git@github.com:coreos/etcd.git]
Resolving github.com/spf13/afero: commit='bb8f1927f2a9d3ab41c9340aa034f6b803f4359c', urls=[https://github.com/spf13/afero.git, git@github.com:spf13/afero.git]
Resolving github.com/spf13/cast: commit='acbeb36b902d72a7a4c18e8f3241075e7ab763e4', urls=[https://github.com/spf13/cast.git, git@github.com:spf13/cast.git]
Resolving github.com/spf13/cobra: commit='93959269ad99e80983c9ba742a7e01203a4c0e4f', urls=[https://github.com/spf13/cobra.git, git@github.com:spf13/cobra.git]
Resolving github.com/spf13/jwalterweatherman: commit='7c0cea34c8ece3fbeb2b27ab9b59511d360fb394', urls=[https://github.com/spf13/jwalterweatherman.git, git@github.com:spf13/jwalterweatherman.git]
Resolving cached github.com/coreos/etcd: commit='11214aa33bf5a47d3d9d8dafe0f6b97237dfe921', urls=[https://github.com/coreos/etcd.git, git@github.com:coreos/etcd.git]
Resolving github.com/spf13/viper: commit='aafc9e6bc7b7bb53ddaa75a5ef49a17d6e654be5', urls=[https://github.com/spf13/viper.git, git@github.com:spf13/viper.git]
Resolving github.com/stathat/go: commit='74669b9f388d9d788c97399a0824adbfee78400e', urls=[https://github.com/stathat/go.git, git@github.com:stathat/go.git]
Resolving cached github.com/coreos/etcd: commit='11214aa33bf5a47d3d9d8dafe0f6b97237dfe921', urls=[https://github.com/coreos/etcd.git, git@github.com:coreos/etcd.git]
Resolving cached github.com/coreos/etcd: commit='11214aa33bf5a47d3d9d8dafe0f6b97237dfe921', urls=[https://github.com/coreos/etcd.git, git@github.com:coreos/etcd.git]
Resolving cached github.com/coreos/etcd: commit='11214aa33bf5a47d3d9d8dafe0f6b97237dfe921', urls=[https://github.com/coreos/etcd.git, git@github.com:coreos/etcd.git]
Resolving cached github.com/coreos/etcd: commit='11214aa33bf5a47d3d9d8dafe0f6b97237dfe921', urls=[https://github.com/coreos/etcd.git, git@github.com:coreos/etcd.git]
Resolving github.com/xordataexchange/crypt: commit='b2862e3d0a775f18c7cfe02273500ae307b61218', urls=[https://github.com/xordataexchange/crypt.git, git@github.com:xordataexchange/crypt.git]
Resolving go.opencensus.io: commit='aa2b39d1618ef56ba156f27cfcdae9042f68f0bc', urls=[https://github.com/census-instrumentation/opencensus-go]
> Task :sdks:java:core:shadowJar
> Task :sdks:java:extensions:protobuf:extractIncludeProto
> Task :sdks:java:extensions:protobuf:generateProto NO-SOURCE
> Task :sdks:java:extensions:google-cloud-platform-core:compileJava FROM-CACHE
> Task :sdks:java:extensions:google-cloud-platform-core:classes UP-TO-DATE
> Task :sdks:java:extensions:google-cloud-platform-core:jar
> Task :sdks:java:io:common:compileTestJava FROM-CACHE
> Task :sdks:java:io:common:testClasses UP-TO-DATE
> Task :runners:local-java:compileJava FROM-CACHE
> Task :runners:local-java:classes UP-TO-DATE
> Task :sdks:java:io:common:testJar
> Task :runners:local-java:jar
> Task :runners:core-construction-java:compileJava FROM-CACHE
> Task :runners:core-construction-java:classes UP-TO-DATE
> Task :sdks:java:io:kafka:compileJava FROM-CACHE
> Task :sdks:java:io:kafka:classes UP-TO-DATE
> Task :vendor:sdks-java-extensions-protobuf:compileJava FROM-CACHE
> Task :vendor:sdks-java-extensions-protobuf:classes UP-TO-DATE
> Task :sdks:java:testing:test-utils:compileJava FROM-CACHE
> Task :sdks:java:testing:test-utils:classes UP-TO-DATE
> Task :sdks:java:testing:test-utils:jar
> Task :sdks:java:io:kafka:jar
> Task :sdks:java:fn-execution:compileJava FROM-CACHE
> Task :sdks:java:fn-execution:classes UP-TO-DATE
> Task :runners:core-construction-java:jar
> Task :sdks:java:testing:test-utils:compileTestJava FROM-CACHE
> Task :sdks:java:testing:test-utils:testClasses UP-TO-DATE
> Task :sdks:java:testing:test-utils:testJar
> Task :sdks:java:fn-execution:jar
> Task :vendor:sdks-java-extensions-protobuf:shadowJar
> Task :runners:core-java:compileJava FROM-CACHE
> Task :runners:core-java:classes UP-TO-DATE
> Task :sdks:java:extensions:protobuf:compileJava FROM-CACHE
> Task :sdks:java:extensions:protobuf:classes UP-TO-DATE
> Task :sdks:java:extensions:protobuf:jar
> Task :sdks:go:resolveBuildDependencies
Resolving golang.org/x/crypto: commit='d9133f5469342136e669e85192a26056b587f503', urls=[https://go.googlesource.com/crypto]
> Task :runners:core-java:jar
> Task :sdks:java:harness:compileJava FROM-CACHE
> Task :sdks:java:harness:classes UP-TO-DATE
> Task :sdks:java:io:google-cloud-platform:compileJava FROM-CACHE
> Task :sdks:java:io:google-cloud-platform:classes UP-TO-DATE
> Task :sdks:java:harness:jar
> Task :sdks:java:io:google-cloud-platform:jar
> Task :sdks:java:core:compileTestJava FROM-CACHE
> Task :sdks:java:core:testClasses
> Task :runners:google-cloud-dataflow-java:compileJava FROM-CACHE
> Task :runners:google-cloud-dataflow-java:classes
> Task :runners:google-cloud-dataflow-java:jar
> Task :sdks:go:resolveBuildDependencies
Resolving golang.org/x/debug: commit='95515998a8a4bd7448134b2cb5971dbeb12e0b77', urls=[https://go.googlesource.com/debug]
Resolving golang.org/x/net: commit='2fb46b16b8dda405028c50f7c7f0f9dd1fa6bfb1', urls=[https://go.googlesource.com/net]
Resolving golang.org/x/oauth2: commit='a032972e28060ca4f5644acffae3dfc268cc09db', urls=[https://go.googlesource.com/oauth2]
Resolving golang.org/x/sync: commit='fd80eb99c8f653c847d294a001bdf2a3a6f768f5', urls=[https://go.googlesource.com/sync]
> Task :sdks:java:core:shadowTestJar
> Task :sdks:go:resolveBuildDependencies
Resolving golang.org/x/sys: commit='37707fdb30a5b38865cfb95e5aab41707daec7fd', urls=[https://go.googlesource.com/sys]
Resolving cached github.com/coreos/etcd: commit='11214aa33bf5a47d3d9d8dafe0f6b97237dfe921', urls=[https://github.com/coreos/etcd.git, git@github.com:coreos/etcd.git]
Resolving cached github.com/coreos/etcd: commit='11214aa33bf5a47d3d9d8dafe0f6b97237dfe921', urls=[https://github.com/coreos/etcd.git, git@github.com:coreos/etcd.git]
> Task :sdks:java:extensions:google-cloud-platform-core:compileTestJava
Note: Some input files use or override a deprecated API.
Note: Recompile with -Xlint:deprecation for details.
> Task :sdks:java:extensions:google-cloud-platform-core:testClasses
> Task :sdks:java:extensions:google-cloud-platform-core:testJar
> Task :sdks:java:harness:shadowJar
> Task :sdks:java:container:copyDockerfileDependencies
> Task :runners:java-fn-execution:compileJava FROM-CACHE
> Task :runners:java-fn-execution:classes UP-TO-DATE
> Task :runners:java-fn-execution:jar
> Task :runners:direct-java:compileJava FROM-CACHE
> Task :runners:direct-java:classes UP-TO-DATE
> Task :runners:google-cloud-dataflow-java:worker:compileJava FROM-CACHE
> Task :runners:google-cloud-dataflow-java:worker:classes
> Task :runners:direct-java:shadowJar
> Task :sdks:java:io:google-cloud-platform:compileTestJava
Note: Some input files use or override a deprecated API.
Note: Recompile with -Xlint:deprecation for details.
Note: Some input files use unchecked or unsafe operations.
Note: Recompile with -Xlint:unchecked for details.
> Task :sdks:java:io:google-cloud-platform:testClasses
> Task :sdks:java:io:google-cloud-platform:testJar
> Task :runners:google-cloud-dataflow-java:compileTestJava
Note: Some input files use or override a deprecated API.
Note: Recompile with -Xlint:deprecation for details.
Note: Some input files use unchecked or unsafe operations.
Note: Recompile with -Xlint:unchecked for details.
> Task :runners:google-cloud-dataflow-java:testClasses
> Task :runners:google-cloud-dataflow-java:testJar
> Task :runners:google-cloud-dataflow-java:worker:shadowJar
> Task :sdks:go:resolveBuildDependencies
Resolving google.golang.org/api: commit='386d4e5f4f92f86e6aec85985761bba4b938a2d5', urls=[https://code.googlesource.com/google-api-go-client]
Resolving google.golang.org/genproto: commit='2b5a72b8730b0b16380010cfe5286c42108d88e7', urls=[https://github.com/google/go-genproto]
Resolving google.golang.org/grpc: commit='7646b5360d049a7ca31e9133315db43456f39e2e', urls=[https://github.com/grpc/grpc-go]
Resolving cached github.com/coreos/etcd: commit='11214aa33bf5a47d3d9d8dafe0f6b97237dfe921', urls=[https://github.com/coreos/etcd.git, git@github.com:coreos/etcd.git]
Resolving cached github.com/coreos/etcd: commit='11214aa33bf5a47d3d9d8dafe0f6b97237dfe921', urls=[https://github.com/coreos/etcd.git, git@github.com:coreos/etcd.git]
> Task :sdks:go:installDependencies
> Task :sdks:go:buildLinuxAmd64
> Task :sdks:go:goBuild
> Task :sdks:java:container:resolveBuildDependencies
Resolving ./github.com/apache/beam/sdks/go@<https://builds.apache.org/job/beam_PostCommit_Java_ValidatesRunner_PortabilityApi_Dataflow/ws/src/sdks/go>
> Task :sdks:java:container:installDependencies
> Task :sdks:java:container:buildLinuxAmd64
> Task :sdks:java:container:goBuild
> Task :sdks:java:container:dockerPrepare
> Task :sdks:java:container:docker
> Task :runners:google-cloud-dataflow-java:buildAndPushDockerContainer
WARNING: `gcloud docker` will not be supported for Docker client versions above 18.03.
As an alternative, use `gcloud auth configure-docker` to configure `docker` to
use `gcloud` as a credential helper, then use `docker` as you would for non-GCR
registries, e.g. `docker pull gcr.io/project-id/my-image`. Add
`--verbosity=error` to silence this warning: `gcloud docker
--verbosity=error -- pull gcr.io/project-id/my-image`.
See: https://cloud.google.com/container-registry/docs/support/deprecation-notices#gcloud-docker
The push refers to repository [us.gcr.io/apache-beam-testing/java-postcommit-it/java]
e3cf9cc72edd: Preparing
6d3c2b6a26e0: Preparing
69286c5a6a2a: Preparing
e74af3c556d7: Preparing
39e688b137e1: Preparing
7859be2fb1f3: Preparing
92ae005b97d7: Preparing
68b75cfa1b27: Preparing
c601709dd5d2: Preparing
72ce39f2b7f6: Preparing
33783834b288: Preparing
5c813a85f7f0: Preparing
bdca38f94ff0: Preparing
faac394a1ad3: Preparing
92ae005b97d7: Waiting
ce8168f12337: Preparing
7859be2fb1f3: Waiting
68b75cfa1b27: Waiting
72ce39f2b7f6: Waiting
33783834b288: Waiting
5c813a85f7f0: Waiting
bdca38f94ff0: Waiting
c601709dd5d2: Waiting
ce8168f12337: Waiting
39e688b137e1: Pushed
e74af3c556d7: Pushed
6d3c2b6a26e0: Pushed
e3cf9cc72edd: Pushed
c601709dd5d2: Layer already exists
72ce39f2b7f6: Layer already exists
33783834b288: Layer already exists
5c813a85f7f0: Layer already exists
bdca38f94ff0: Layer already exists
faac394a1ad3: Layer already exists
ce8168f12337: Layer already exists
69286c5a6a2a: Pushed
68b75cfa1b27: Pushed
92ae005b97d7: Pushed
7859be2fb1f3: Pushed
20200225005522: digest: sha256:a1cb82d580c47bd66b9edda32caf85bc390e90e48b10b4164cdf4580168dffa4 size: 3470
> Task :runners:google-cloud-dataflow-java:validatesRunnerFnApiWorkerTest
org.apache.beam.sdk.transforms.ParDoTest$TimerFamilyTests > testTimerWithMultipleTimerFamilyUnbounded FAILED
java.lang.RuntimeException at ParDoTest.java:4725
org.apache.beam.sdk.transforms.ParDoTest$TimerFamilyTests > testTimerWithMultipleTimerFamilyBounded FAILED
java.lang.RuntimeException at ParDoTest.java:4725
org.apache.beam.sdk.transforms.ParDoTest$TimerFamilyTests > testTimerFamilyAndTimerBounded FAILED
java.lang.RuntimeException at ParDoTest.java:4786
org.apache.beam.sdk.transforms.ParDoTest$TimerFamilyTests > testTimerFamilyAndTimerUnbounded FAILED
java.lang.RuntimeException at ParDoTest.java:4786
org.apache.beam.sdk.transforms.ParDoTest$TimerFamilyTests > testTimerFamilyEventTimeBounded FAILED
java.lang.RuntimeException at ParDoTest.java:4663
org.apache.beam.sdk.transforms.ParDoTest$TimerFamilyTests > testTimerFamilyEventTimeUnbounded FAILED
java.lang.RuntimeException at ParDoTest.java:4663
157 tests completed, 6 failed, 3 skipped
> Task :runners:google-cloud-dataflow-java:validatesRunnerFnApiWorkerTest FAILED
> Task :runners:google-cloud-dataflow-java:cleanUpDockerImages
Untagged: us.gcr.io/apache-beam-testing/java-postcommit-it/java:20200225005522
Untagged: us.gcr.io/apache-beam-testing/java-postcommit-it/java@sha256:a1cb82d580c47bd66b9edda32caf85bc390e90e48b10b4164cdf4580168dffa4
Digests:
- us.gcr.io/apache-beam-testing/java-postcommit-it/java@sha256:a1cb82d580c47bd66b9edda32caf85bc390e90e48b10b4164cdf4580168dffa4
Associated tags:
- 20200225005522
Tags:
- us.gcr.io/apache-beam-testing/java-postcommit-it/java:20200225005522
Deleted [us.gcr.io/apache-beam-testing/java-postcommit-it/java:20200225005522].
Deleted [us.gcr.io/apache-beam-testing/java-postcommit-it/java@sha256:a1cb82d580c47bd66b9edda32caf85bc390e90e48b10b4164cdf4580168dffa4].
FAILURE: Build failed with an exception.
* What went wrong:
Execution failed for task ':runners:google-cloud-dataflow-java:validatesRunnerFnApiWorkerTest'.
> There were failing tests. See the report at: file://<https://builds.apache.org/job/beam_PostCommit_Java_ValidatesRunner_PortabilityApi_Dataflow/ws/src/runners/google-cloud-dataflow-java/build/reports/tests/validatesRunnerFnApiWorkerTest/index.html>
* Try:
Run with --stacktrace option to get the stack trace. Run with --info or --debug option to get more log output. Run with --scan to get full insights.
* Get more help at https://help.gradle.org
Deprecated Gradle features were used in this build, making it incompatible with Gradle 6.0.
Use '--warning-mode all' to show the individual deprecation warnings.
See https://docs.gradle.org/5.2.1/userguide/command_line_interface.html#sec:command_line_warnings
BUILD FAILED in 2h 1m 12s
97 actionable tasks: 72 executed, 24 from cache, 1 up-to-date
Publishing build scan...
https://gradle.com/s/32c6v54ryhfye
Build step 'Invoke Gradle script' changed build result to FAILURE
Build step 'Invoke Gradle script' marked build as failure
---------------------------------------------------------------------
To unsubscribe, e-mail: builds-unsubscribe@beam.apache.org
For additional commands, e-mail: builds-help@beam.apache.org