You are viewing a plain text version of this content. The canonical link for it is here.
Posted to mapreduce-dev@hadoop.apache.org by Apache Jenkins Server <je...@builds.apache.org> on 2015/08/29 00:57:11 UTC
Hadoop-Mapreduce-trunk-Java8 - Build # 318 - Still Failing
See https://builds.apache.org/job/Hadoop-Mapreduce-trunk-Java8/318/
###################################################################################
########################## LAST 60 LINES OF THE CONSOLE ###########################
[...truncated 11292 lines...]
Running org.apache.hadoop.mapreduce.v2.TestMRAppWithCombiner
Tests run: 1, Failures: 0, Errors: 0, Skipped: 0, Time elapsed: 86.695 sec - in org.apache.hadoop.mapreduce.v2.TestMRAppWithCombiner
Java HotSpot(TM) 64-Bit Server VM warning: ignoring option MaxPermSize=768m; support was removed in 8.0
Running org.apache.hadoop.mapreduce.v2.TestMRJobs
Results :
Tests in error:
TestMRTimelineEventHandling.testMRTimelineEventHandling:131 » NoClassDefFound ...
TestJobSysDirWithDFS.testWithDFS:132->runWordCount:108->launchWordCount:89 » NoClassDefFound
Tests run: 336, Failures: 0, Errors: 1, Skipped: 11
[INFO] ------------------------------------------------------------------------
[INFO] Reactor Summary:
[INFO]
[INFO] Apache Hadoop MapReduce Client .................... SUCCESS [ 2.319 s]
[INFO] Apache Hadoop MapReduce Core ...................... SUCCESS [01:17 min]
[INFO] Apache Hadoop MapReduce Common .................... SUCCESS [ 25.257 s]
[INFO] Apache Hadoop MapReduce Shuffle ................... SUCCESS [ 3.886 s]
[INFO] Apache Hadoop MapReduce App ....................... SUCCESS [10:26 min]
[INFO] Apache Hadoop MapReduce HistoryServer ............. SUCCESS [06:11 min]
[INFO] Apache Hadoop MapReduce JobClient ................. FAILURE [ 01:17 h]
[INFO] Apache Hadoop MapReduce HistoryServer Plugins ..... SKIPPED
[INFO] Apache Hadoop MapReduce NativeTask ................ SKIPPED
[INFO] Apache Hadoop MapReduce Examples .................. SKIPPED
[INFO] Apache Hadoop MapReduce ........................... SKIPPED
[INFO] ------------------------------------------------------------------------
[INFO] BUILD FAILURE
[INFO] ------------------------------------------------------------------------
[INFO] Total time: 01:35 h
[INFO] Finished at: 2015-08-28T22:58:08+00:00
[INFO] Final Memory: 44M/247M
[INFO] ------------------------------------------------------------------------
[ERROR] Failed to execute goal org.apache.maven.plugins:maven-surefire-plugin:2.17:test (default-test) on project hadoop-mapreduce-client-jobclient: ExecutionException: java.lang.RuntimeException: The forked VM terminated without properly saying goodbye. VM crash or System.exit called?
[ERROR] Command was /bin/sh -c cd /home/jenkins/jenkins-slave/workspace/Hadoop-Mapreduce-trunk-Java8/hadoop-mapreduce-project/hadoop-mapreduce-client/hadoop-mapreduce-client-jobclient && /home/jenkins/tools/java/jdk1.8.0/jre/bin/java -Xmx4096m -XX:MaxPermSize=768m -XX:+HeapDumpOnOutOfMemoryError -jar /home/jenkins/jenkins-slave/workspace/Hadoop-Mapreduce-trunk-Java8/hadoop-mapreduce-project/hadoop-mapreduce-client/hadoop-mapreduce-client-jobclient/target/surefire/surefirebooter3826714791119526544.jar /home/jenkins/jenkins-slave/workspace/Hadoop-Mapreduce-trunk-Java8/hadoop-mapreduce-project/hadoop-mapreduce-client/hadoop-mapreduce-client-jobclient/target/surefire/surefire5395580678162871570tmp /home/jenkins/jenkins-slave/workspace/Hadoop-Mapreduce-trunk-Java8/hadoop-mapreduce-project/hadoop-mapreduce-client/hadoop-mapreduce-client-jobclient/target/surefire/surefire_1625356977585688459510tmp
[ERROR] -> [Help 1]
[ERROR]
[ERROR] To see the full stack trace of the errors, re-run Maven with the -e switch.
[ERROR] Re-run Maven using the -X switch to enable full debug logging.
[ERROR]
[ERROR] For more information about the errors and possible solutions, please read the following articles:
[ERROR] [Help 1] http://cwiki.apache.org/confluence/display/MAVEN/MojoFailureException
[ERROR]
[ERROR] After correcting the problems, you can resume the build with the command
[ERROR] mvn <goals> -rf :hadoop-mapreduce-client-jobclient
Build step 'Execute shell' marked build as failure
[FINDBUGS] Skipping publisher since build result is FAILURE
Archiving artifacts
Sending artifact delta relative to Hadoop-Mapreduce-trunk-Java8 #311
Archived 1 artifacts
Archive block size is 32768
Received 0 blocks and 20469525 bytes
Compression is 0.0%
Took 5.5 sec
Recording test results
Updating HDFS-8938
Email was triggered for: Failure
Sending email for trigger: Failure
###################################################################################
############################## FAILED TESTS (if any) ##############################
1 tests failed.
FAILED: org.apache.hadoop.mapred.TestJobSysDirWithDFS.testWithDFS
Error Message:
org/apache/hadoop/yarn/client/api/YarnClient
Stack Trace:
java.lang.NoClassDefFoundError: org/apache/hadoop/yarn/client/api/YarnClient
at java.net.URLClassLoader$1.run(URLClassLoader.java:372)
at java.net.URLClassLoader$1.run(URLClassLoader.java:361)
at java.security.AccessController.doPrivileged(Native Method)
at java.net.URLClassLoader.findClass(URLClassLoader.java:360)
at java.lang.ClassLoader.loadClass(ClassLoader.java:424)
at sun.misc.Launcher$AppClassLoader.loadClass(Launcher.java:308)
at java.lang.ClassLoader.loadClass(ClassLoader.java:357)
at java.lang.ClassLoader.defineClass1(Native Method)
at java.lang.ClassLoader.defineClass(ClassLoader.java:760)
at java.security.SecureClassLoader.defineClass(SecureClassLoader.java:142)
at java.net.URLClassLoader.defineClass(URLClassLoader.java:455)
at java.net.URLClassLoader.access$100(URLClassLoader.java:73)
at java.net.URLClassLoader$1.run(URLClassLoader.java:367)
at java.net.URLClassLoader$1.run(URLClassLoader.java:361)
at java.security.AccessController.doPrivileged(Native Method)
at java.net.URLClassLoader.findClass(URLClassLoader.java:360)
at java.lang.ClassLoader.loadClass(ClassLoader.java:424)
at sun.misc.Launcher$AppClassLoader.loadClass(Launcher.java:308)
at java.lang.ClassLoader.loadClass(ClassLoader.java:357)
at org.apache.hadoop.mapred.YARNRunner.<init>(YARNRunner.java:122)
at org.apache.hadoop.mapred.YarnClientProtocolProvider.create(YarnClientProtocolProvider.java:34)
at org.apache.hadoop.mapreduce.Cluster.initialize(Cluster.java:95)
at org.apache.hadoop.mapreduce.Cluster.<init>(Cluster.java:82)
at org.apache.hadoop.mapreduce.Cluster.<init>(Cluster.java:75)
at org.apache.hadoop.mapred.JobClient.init(JobClient.java:475)
at org.apache.hadoop.mapred.JobClient.<init>(JobClient.java:454)
at org.apache.hadoop.mapred.TestJobSysDirWithDFS.launchWordCount(TestJobSysDirWithDFS.java:89)
at org.apache.hadoop.mapred.TestJobSysDirWithDFS.runWordCount(TestJobSysDirWithDFS.java:108)
at org.apache.hadoop.mapred.TestJobSysDirWithDFS.testWithDFS(TestJobSysDirWithDFS.java:132)
Hadoop-Mapreduce-trunk-Java8 - Build # 319 - Still Failing
Posted by Apache Jenkins Server <je...@builds.apache.org>.
See https://builds.apache.org/job/Hadoop-Mapreduce-trunk-Java8/319/
###################################################################################
########################## LAST 60 LINES OF THE CONSOLE ###########################
[...truncated 11310 lines...]
Running org.apache.hadoop.mapred.TestAuditLogger
Tests run: 3, Failures: 0, Errors: 0, Skipped: 0, Time elapsed: 1.034 sec - in org.apache.hadoop.mapred.TestAuditLogger
Java HotSpot(TM) 64-Bit Server VM warning: ignoring option MaxPermSize=768m; support was removed in 8.0
Running org.apache.hadoop.mapred.TestClientServiceDelegate
Tests run: 26, Failures: 0, Errors: 0, Skipped: 0, Time elapsed: 9.142 sec - in org.apache.hadoop.mapred.TestClientServiceDelegate
Java HotSpot(TM) 64-Bit Server VM warning: ignoring option MaxPermSize=768m; support was removed in 8.0
Running org.apache.hadoop.mapred.join.TestDatamerge
Results :
Tests run: 440, Failures: 0, Errors: 0, Skipped: 7
[INFO] ------------------------------------------------------------------------
[INFO] Reactor Summary:
[INFO]
[INFO] Apache Hadoop MapReduce Client .................... SUCCESS [ 2.362 s]
[INFO] Apache Hadoop MapReduce Core ...................... SUCCESS [01:18 min]
[INFO] Apache Hadoop MapReduce Common .................... SUCCESS [ 26.195 s]
[INFO] Apache Hadoop MapReduce Shuffle ................... SUCCESS [ 3.971 s]
[INFO] Apache Hadoop MapReduce App ....................... SUCCESS [10:27 min]
[INFO] Apache Hadoop MapReduce HistoryServer ............. SUCCESS [06:08 min]
[INFO] Apache Hadoop MapReduce JobClient ................. FAILURE [ 01:23 h]
[INFO] Apache Hadoop MapReduce HistoryServer Plugins ..... SKIPPED
[INFO] Apache Hadoop MapReduce NativeTask ................ SKIPPED
[INFO] Apache Hadoop MapReduce Examples .................. SKIPPED
[INFO] Apache Hadoop MapReduce ........................... SKIPPED
[INFO] ------------------------------------------------------------------------
[INFO] BUILD FAILURE
[INFO] ------------------------------------------------------------------------
[INFO] Total time: 01:41 h
[INFO] Finished at: 2015-08-29T01:05:37+00:00
[INFO] Final Memory: 41M/247M
[INFO] ------------------------------------------------------------------------
[ERROR] Failed to execute goal org.apache.maven.plugins:maven-surefire-plugin:2.17:test (default-test) on project hadoop-mapreduce-client-jobclient: ExecutionException: java.lang.RuntimeException: The forked VM terminated without properly saying goodbye. VM crash or System.exit called?
[ERROR] Command was /bin/sh -c cd /home/jenkins/jenkins-slave/workspace/Hadoop-Mapreduce-trunk-Java8/hadoop-mapreduce-project/hadoop-mapreduce-client/hadoop-mapreduce-client-jobclient && /home/jenkins/tools/java/jdk1.8.0/jre/bin/java -Xmx4096m -XX:MaxPermSize=768m -XX:+HeapDumpOnOutOfMemoryError -jar /home/jenkins/jenkins-slave/workspace/Hadoop-Mapreduce-trunk-Java8/hadoop-mapreduce-project/hadoop-mapreduce-client/hadoop-mapreduce-client-jobclient/target/surefire/surefirebooter6926778436085939921.jar /home/jenkins/jenkins-slave/workspace/Hadoop-Mapreduce-trunk-Java8/hadoop-mapreduce-project/hadoop-mapreduce-client/hadoop-mapreduce-client-jobclient/target/surefire/surefire7518330715383346013tmp /home/jenkins/jenkins-slave/workspace/Hadoop-Mapreduce-trunk-Java8/hadoop-mapreduce-project/hadoop-mapreduce-client/hadoop-mapreduce-client-jobclient/target/surefire/surefire_1934297739992189687012tmp
[ERROR] -> [Help 1]
[ERROR]
[ERROR] To see the full stack trace of the errors, re-run Maven with the -e switch.
[ERROR] Re-run Maven using the -X switch to enable full debug logging.
[ERROR]
[ERROR] For more information about the errors and possible solutions, please read the following articles:
[ERROR] [Help 1] http://cwiki.apache.org/confluence/display/MAVEN/MojoFailureException
[ERROR]
[ERROR] After correcting the problems, you can resume the build with the command
[ERROR] mvn <goals> -rf :hadoop-mapreduce-client-jobclient
Build step 'Execute shell' marked build as failure
[FINDBUGS] Skipping publisher since build result is FAILURE
Archiving artifacts
Sending artifact delta relative to Hadoop-Mapreduce-trunk-Java8 #311
Archived 1 artifacts
Archive block size is 32768
Received 0 blocks and 20468561 bytes
Compression is 0.0%
Took 5.2 sec
Recording test results
Updating HDFS-8950
Updating HDFS-8925
Email was triggered for: Failure
Sending email for trigger: Failure
###################################################################################
############################## FAILED TESTS (if any) ##############################
All tests passed