You are viewing a plain text version of this content. The canonical link for it is here.
Posted to builds@beam.apache.org by Apache Jenkins Server <je...@builds.apache.org> on 2019/09/21 02:52:17 UTC
Build failed in Jenkins: beam_PostCommit_Python37 #519
See <https://builds.apache.org/job/beam_PostCommit_Python37/519/display/redirect?page=changes>
Changes:
[relax] Merge pull request #9604: Restore portable schema changes, with simple
------------------------------------------
[...truncated 258.53 KB...]
test_big_query_write_without_schema (apache_beam.io.gcp.bigquery_write_it_test.BigQueryWriteIntegrationTests) ... ok
test_big_query_legacy_sql (apache_beam.io.gcp.big_query_query_to_table_it_test.BigQueryQueryToTableIT) ... ok
test_big_query_new_types (apache_beam.io.gcp.big_query_query_to_table_it_test.BigQueryQueryToTableIT) ... ok
test_big_query_standard_sql (apache_beam.io.gcp.big_query_query_to_table_it_test.BigQueryQueryToTableIT) ... FAIL
test_big_query_standard_sql_kms_key_native (apache_beam.io.gcp.big_query_query_to_table_it_test.BigQueryQueryToTableIT) ... SKIP: This test doesn't work on DirectRunner.
test_wordcount_it (apache_beam.examples.wordcount_it_test.WordCountIT) ... ok
test_streaming_data_only (apache_beam.io.gcp.pubsub_integration_test.PubSubIntegrationTest) ... ok
test_streaming_with_attributes (apache_beam.io.gcp.pubsub_integration_test.PubSubIntegrationTest) ... ok
======================================================================
FAIL: test_big_query_standard_sql (apache_beam.io.gcp.big_query_query_to_table_it_test.BigQueryQueryToTableIT)
----------------------------------------------------------------------
Traceback (most recent call last):
File "<https://builds.apache.org/job/beam_PostCommit_Python37/ws/src/sdks/python/apache_beam/io/gcp/big_query_query_to_table_it_test.py",> line 167, in test_big_query_standard_sql
big_query_query_to_table_pipeline.run_bq_pipeline(options)
File "<https://builds.apache.org/job/beam_PostCommit_Python37/ws/src/sdks/python/apache_beam/io/gcp/big_query_query_to_table_pipeline.py",> line 82, in run_bq_pipeline
result = p.run()
File "<https://builds.apache.org/job/beam_PostCommit_Python37/ws/src/sdks/python/apache_beam/testing/test_pipeline.py",> line 112, in run
else test_runner_api))
File "<https://builds.apache.org/job/beam_PostCommit_Python37/ws/src/sdks/python/apache_beam/pipeline.py",> line 407, in run
self._options).run(False)
File "<https://builds.apache.org/job/beam_PostCommit_Python37/ws/src/sdks/python/apache_beam/pipeline.py",> line 420, in run
return self.runner.run_pipeline(self, self._options)
File "<https://builds.apache.org/job/beam_PostCommit_Python37/ws/src/sdks/python/apache_beam/runners/direct/test_direct_runner.py",> line 51, in run_pipeline
hc_assert_that(self.result, pickler.loads(on_success_matcher))
AssertionError:
Expected: (Test pipeline expected terminated in state: DONE and Expected checksum is 158a8ea1c254fcf40d4ed3e7c0242c3ea0a29e72)
but: Expected checksum is 158a8ea1c254fcf40d4ed3e7c0242c3ea0a29e72 Actual checksum is da39a3ee5e6b4b0d3255bfef95601890afd80709
-------------------- >> begin captured logging << --------------------
root: DEBUG: Unhandled type_constraint: Union[]
root: DEBUG: Unhandled type_constraint: Union[]
root: DEBUG: Unhandled type_constraint: Any
root: DEBUG: Unhandled type_constraint: Any
root: INFO: Running pipeline with DirectRunner.
root: DEBUG: Query SELECT * FROM (SELECT "apple" as fruit) UNION ALL (SELECT "orange" as fruit) does not reference any tables.
root: WARNING: Dataset apache-beam-testing:temp_dataset_6e295f429e3446e09208b792ecc2c411 does not exist so we will create it as temporary with location=None
root: DEBUG: Creating or getting table <TableReference
datasetId: 'python_query_to_table_15690308455122'
projectId: 'apache-beam-testing'
tableId: 'output_table'> with schema {'fields': [{'name': 'fruit', 'type': 'STRING', 'mode': 'NULLABLE'}]}.
root: DEBUG: Created the table with id output_table
root: INFO: Created table apache-beam-testing.python_query_to_table_15690308455122.output_table with schema <TableSchema
fields: [<TableFieldSchema
fields: []
mode: 'NULLABLE'
name: 'fruit'
type: 'STRING'>]>. Result: <Table
creationTime: 1569030851076
etag: 'eAimwJglQiaojXIeoGQbqA=='
id: 'apache-beam-testing:python_query_to_table_15690308455122.output_table'
kind: 'bigquery#table'
lastModifiedTime: 1569030851125
location: 'US'
numBytes: 0
numLongTermBytes: 0
numRows: 0
schema: <TableSchema
fields: [<TableFieldSchema
fields: []
mode: 'NULLABLE'
name: 'fruit'
type: 'STRING'>]>
selfLink: 'https://www.googleapis.com/bigquery/v2/projects/apache-beam-testing/datasets/python_query_to_table_15690308455122/tables/output_table'
tableReference: <TableReference
datasetId: 'python_query_to_table_15690308455122'
projectId: 'apache-beam-testing'
tableId: 'output_table'>
type: 'TABLE'>.
root: DEBUG: Attempting to flush to all destinations. Total buffered: 2
root: DEBUG: Flushing data to apache-beam-testing:python_query_to_table_15690308455122.output_table. Total 2 rows.
root: DEBUG: Passed: True. Errors are []
root: INFO: Attempting to perform query SELECT fruit from `python_query_to_table_15690308455122.output_table`; to BQ
google.auth.transport._http_client: DEBUG: Making request: GET http://169.254.169.254
google.auth.transport._http_client: DEBUG: Making request: GET http://metadata.google.internal/computeMetadata/v1/project/project-id
urllib3.util.retry: DEBUG: Converted retries value: 3 -> Retry(total=3, connect=None, read=None, redirect=None, status=None)
google.auth.transport.requests: DEBUG: Making request: GET http://metadata.google.internal/computeMetadata/v1/instance/service-accounts/default/?recursive=true
urllib3.connectionpool: DEBUG: Starting new HTTP connection (1): metadata.google.internal:80
urllib3.connectionpool: DEBUG: http://metadata.google.internal:80 "GET /computeMetadata/v1/instance/service-accounts/default/?recursive=true HTTP/1.1" 200 144
google.auth.transport.requests: DEBUG: Making request: GET http://metadata.google.internal/computeMetadata/v1/instance/service-accounts/844138762903-compute@developer.gserviceaccount.com/token
urllib3.connectionpool: DEBUG: http://metadata.google.internal:80 "GET /computeMetadata/v1/instance/service-accounts/844138762903-compute@developer.gserviceaccount.com/token HTTP/1.1" 200 181
urllib3.connectionpool: DEBUG: Starting new HTTPS connection (1): www.googleapis.com:443
urllib3.connectionpool: DEBUG: https://www.googleapis.com:443 "POST /bigquery/v2/projects/apache-beam-testing/jobs HTTP/1.1" 200 None
urllib3.connectionpool: DEBUG: https://www.googleapis.com:443 "GET /bigquery/v2/projects/apache-beam-testing/queries/0f10e94e-7a0d-43fa-b29d-54b35c4e4a60?maxResults=0&location=US HTTP/1.1" 200 None
urllib3.connectionpool: DEBUG: https://www.googleapis.com:443 "GET /bigquery/v2/projects/apache-beam-testing/datasets/_7357fab0f784d2a7327ddbe81cdd1f4ca7e429cd/tables/anondce0ff42b0afa0a502e91c8343300c20e98d4688/data HTTP/1.1" 200 None
root: INFO: Read from given query (SELECT fruit from `python_query_to_table_15690308455122.output_table`;), total rows 0
root: INFO: Generate checksum: da39a3ee5e6b4b0d3255bfef95601890afd80709
--------------------- >> end captured logging << ---------------------
----------------------------------------------------------------------
XML: nosetests-postCommitIT-direct-py37.xml
----------------------------------------------------------------------
XML: <https://builds.apache.org/job/beam_PostCommit_Python37/ws/src/sdks/python/nosetests.xml>
----------------------------------------------------------------------
Ran 15 tests in 25.903s
FAILED (SKIP=1, failures=1)
> Task :sdks:python:test-suites:direct:py37:postCommitIT FAILED
> Task :sdks:python:test-suites:dataflow:py37:postCommitIT
<https://builds.apache.org/job/beam_PostCommit_Python37/ws/src/sdks/python/apache_beam/io/gcp/bigquery.py>:1145: BeamDeprecationWarning: options is deprecated since First stable release. References to <pipeline>.options will not be supported
Worker logs: https://console.cloud.google.com/dataflow/jobsDetail/locations/us-central1/jobs/2019-09-20_18_51_04-7791102533366259519?project=apache-beam-testing
experiments = p.options.view_as(DebugOptions).experiments or []
Worker logs: https://console.cloud.google.com/dataflow/jobsDetail/locations/us-central1/jobs/2019-09-20_19_08_34-15611344242763035679?project=apache-beam-testing
Worker logs: https://console.cloud.google.com/dataflow/jobsDetail/locations/us-central1/jobs/2019-09-20_19_18_18-7217375769489343192?project=apache-beam-testing
Worker logs: https://console.cloud.google.com/dataflow/jobsDetail/locations/us-central1/jobs/2019-09-20_19_27_52-11261231488225919100?project=apache-beam-testing
Worker logs: https://console.cloud.google.com/dataflow/jobsDetail/locations/us-central1/jobs/2019-09-20_19_38_40-7962610347377928632?project=apache-beam-testing
Worker logs: https://console.cloud.google.com/dataflow/jobsDetail/locations/us-central1/jobs/2019-09-20_18_50_59-16928682917569216787?project=apache-beam-testing
<https://builds.apache.org/job/beam_PostCommit_Python37/ws/src/sdks/python/apache_beam/runners/dataflow/dataflow_runner.py>:695: BeamDeprecationWarning: BigQuerySink is deprecated since 2.11.0. Use WriteToBigQuery instead.
Worker logs: https://console.cloud.google.com/dataflow/jobsDetail/locations/us-central1/jobs/2019-09-20_19_17_09-4265144547356834960?project=apache-beam-testing
Worker logs: https://console.cloud.google.com/dataflow/jobsDetail/locations/us-central1/jobs/2019-09-20_19_27_58-11988307898474378628?project=apache-beam-testing
kms_key=transform.kms_key))
Worker logs: https://console.cloud.google.com/dataflow/jobsDetail/locations/us-central1/jobs/2019-09-20_19_38_28-18010345902740061008?project=apache-beam-testing
<https://builds.apache.org/job/beam_PostCommit_Python37/ws/src/sdks/python/apache_beam/io/gcp/bigquery.py>:1145: BeamDeprecationWarning: options is deprecated since First stable release. References to <pipeline>.options will not be supported
Worker logs: https://console.cloud.google.com/dataflow/jobsDetail/locations/us-central1/jobs/2019-09-20_18_51_04-11459286446731292053?project=apache-beam-testing
experiments = p.options.view_as(DebugOptions).experiments or []
Worker logs: https://console.cloud.google.com/dataflow/jobsDetail/locations/us-central1/jobs/2019-09-20_19_05_13-1058074712006811530?project=apache-beam-testing
Worker logs: https://console.cloud.google.com/dataflow/jobsDetail/locations/us-central1/jobs/2019-09-20_19_15_57-52722781765595598?project=apache-beam-testing
Worker logs: https://console.cloud.google.com/dataflow/jobsDetail/locations/us-central1/jobs/2019-09-20_19_34_26-8642436444516222701?project=apache-beam-testing
Worker logs: https://console.cloud.google.com/dataflow/jobsDetail/locations/us-central1/jobs/2019-09-20_18_50_59-6086565587597999701?project=apache-beam-testing
<https://builds.apache.org/job/beam_PostCommit_Python37/ws/src/sdks/python/apache_beam/runners/dataflow/dataflow_runner.py>:695: BeamDeprecationWarning: BigQuerySink is deprecated since 2.11.0. Use WriteToBigQuery instead.
Worker logs: https://console.cloud.google.com/dataflow/jobsDetail/locations/us-central1/jobs/2019-09-20_19_02_47-2124368926551134120?project=apache-beam-testing
kms_key=transform.kms_key))
Worker logs: https://console.cloud.google.com/dataflow/jobsDetail/locations/us-central1/jobs/2019-09-20_19_12_27-17239260792781945869?project=apache-beam-testing
<https://builds.apache.org/job/beam_PostCommit_Python37/ws/src/sdks/python/apache_beam/io/gcp/big_query_query_to_table_pipeline.py>:73: BeamDeprecationWarning: BigQuerySink is deprecated since 2.11.0. Use WriteToBigQuery instead.
Worker logs: https://console.cloud.google.com/dataflow/jobsDetail/locations/us-central1/jobs/2019-09-20_19_21_52-8151076299831503031?project=apache-beam-testing
Worker logs: https://console.cloud.google.com/dataflow/jobsDetail/locations/us-central1/jobs/2019-09-20_19_31_32-3855303047865083488?project=apache-beam-testing
kms_key=kms_key))
Worker logs: https://console.cloud.google.com/dataflow/jobsDetail/locations/us-central1/jobs/2019-09-20_18_50_59-7708269561657645246?project=apache-beam-testing
Worker logs: https://console.cloud.google.com/dataflow/jobsDetail/locations/us-central1/jobs/2019-09-20_19_12_45-656231086947409968?project=apache-beam-testing
Worker logs: https://console.cloud.google.com/dataflow/jobsDetail/locations/us-central1/jobs/2019-09-20_19_23_57-2169688695656914713?project=apache-beam-testing
Worker logs: https://console.cloud.google.com/dataflow/jobsDetail/locations/us-central1/jobs/2019-09-20_19_33_42-1390755687716319137?project=apache-beam-testing
<https://builds.apache.org/job/beam_PostCommit_Python37/ws/src/sdks/python/apache_beam/io/gcp/bigquery.py>:1145: BeamDeprecationWarning: options is deprecated since First stable release. References to <pipeline>.options will not be supported
experiments = p.options.view_as(DebugOptions).experiments or []
<https://builds.apache.org/job/beam_PostCommit_Python37/ws/src/sdks/python/apache_beam/io/gcp/bigquery_file_loads.py>:793: BeamDeprecationWarning: options is deprecated since First stable release. References to <pipeline>.options will not be supported
temp_location = p.options.view_as(GoogleCloudOptions).temp_location
Worker logs: https://console.cloud.google.com/dataflow/jobsDetail/locations/us-central1/jobs/2019-09-20_18_50_58-8715490141139417835?project=apache-beam-testing
<https://builds.apache.org/job/beam_PostCommit_Python37/ws/src/sdks/python/apache_beam/runners/dataflow/dataflow_runner.py>:695: BeamDeprecationWarning: BigQuerySink is deprecated since 2.11.0. Use WriteToBigQuery instead.
kms_key=transform.kms_key))
Worker logs: https://console.cloud.google.com/dataflow/jobsDetail/locations/us-central1/jobs/2019-09-20_19_01_27-11475600571876187316?project=apache-beam-testing
<https://builds.apache.org/job/beam_PostCommit_Python37/ws/src/sdks/python/apache_beam/io/gcp/bigquery_test.py>:577: BeamDeprecationWarning: options is deprecated since First stable release. References to <pipeline>.options will not be supported
Worker logs: https://console.cloud.google.com/dataflow/jobsDetail/locations/us-central1/jobs/2019-09-20_19_12_41-12270254951534758037?project=apache-beam-testing
streaming = self.test_pipeline.options.view_as(StandardOptions).streaming
Worker logs: https://console.cloud.google.com/dataflow/jobsDetail/locations/us-central1/jobs/2019-09-20_19_24_07-10774632331715716013?project=apache-beam-testing
<https://builds.apache.org/job/beam_PostCommit_Python37/ws/src/sdks/python/apache_beam/io/gcp/bigquery.py>:1145: BeamDeprecationWarning: options is deprecated since First stable release. References to <pipeline>.options will not be supported
Worker logs: https://console.cloud.google.com/dataflow/jobsDetail/locations/us-central1/jobs/2019-09-20_19_33_33-2460640730108284762?project=apache-beam-testing
experiments = p.options.view_as(DebugOptions).experiments or []
<https://builds.apache.org/job/beam_PostCommit_Python37/ws/src/sdks/python/apache_beam/io/fileio_test.py>:232: FutureWarning: MatchAll is experimental.
| 'GetPath' >> beam.Map(lambda metadata: metadata.path))
<https://builds.apache.org/job/beam_PostCommit_Python37/ws/src/sdks/python/apache_beam/io/fileio_test.py>:243: FutureWarning: MatchAll is experimental.
| 'Checksums' >> beam.Map(compute_hash))
<https://builds.apache.org/job/beam_PostCommit_Python37/ws/src/sdks/python/apache_beam/io/fileio_test.py>:243: FutureWarning: ReadMatches is experimental.
| 'Checksums' >> beam.Map(compute_hash))
Worker logs: https://console.cloud.google.com/dataflow/jobsDetail/locations/us-central1/jobs/2019-09-20_18_51_05-10719262685618833864?project=apache-beam-testing
Worker logs: https://console.cloud.google.com/dataflow/jobsDetail/locations/us-central1/jobs/2019-09-20_19_01_35-2401264438770401818?project=apache-beam-testing
Worker logs: https://console.cloud.google.com/dataflow/jobsDetail/locations/us-central1/jobs/2019-09-20_19_11_58-4904758810590296920?project=apache-beam-testing
Worker logs: https://console.cloud.google.com/dataflow/jobsDetail/locations/us-central1/jobs/2019-09-20_19_22_30-1948721987308228552?project=apache-beam-testing
Worker logs: https://console.cloud.google.com/dataflow/jobsDetail/locations/us-central1/jobs/2019-09-20_19_32_28-5120572562598991698?project=apache-beam-testing
Worker logs: https://console.cloud.google.com/dataflow/jobsDetail/locations/us-central1/jobs/2019-09-20_19_42_11-3976281917791502158?project=apache-beam-testing
Worker logs: https://console.cloud.google.com/dataflow/jobsDetail/locations/us-central1/jobs/2019-09-20_18_51_00-9553363816672428546?project=apache-beam-testing
Worker logs: https://console.cloud.google.com/dataflow/jobsDetail/locations/us-central1/jobs/2019-09-20_19_03_37-2885760980880999378?project=apache-beam-testing
<https://builds.apache.org/job/beam_PostCommit_Python37/ws/src/sdks/python/apache_beam/io/gcp/bigquery.py>:1145: BeamDeprecationWarning: options is deprecated since First stable release. References to <pipeline>.options will not be supported
experiments = p.options.view_as(DebugOptions).experiments or []
Worker logs: https://console.cloud.google.com/dataflow/jobsDetail/locations/us-central1/jobs/2019-09-20_19_16_16-5757331935579327427?project=apache-beam-testing
Worker logs: https://console.cloud.google.com/dataflow/jobsDetail/locations/us-central1/jobs/2019-09-20_19_26_43-10288614197750189885?project=apache-beam-testing
<https://builds.apache.org/job/beam_PostCommit_Python37/ws/src/sdks/python/apache_beam/io/gcp/bigquery_file_loads.py>:793: BeamDeprecationWarning: options is deprecated since First stable release. References to <pipeline>.options will not be supported
temp_location = p.options.view_as(GoogleCloudOptions).temp_location
test_datastore_wordcount_it (apache_beam.examples.cookbook.datastore_wordcount_it_test.DatastoreWordCountIT) ... SKIP: This test still needs to be fixed on Python 3TODO: BEAM-4543
test_avro_it (apache_beam.examples.fastavro_it_test.FastavroIT) ... SKIP: Due to a known issue in avro-python3 package, thistest is skipped until BEAM-6522 is addressed.
test_bigquery_tornadoes_it (apache_beam.examples.cookbook.bigquery_tornadoes_it_test.BigqueryTornadoesIT) ... ok
test_streaming_wordcount_it (apache_beam.examples.streaming_wordcount_it_test.StreamingWordCountIT) ... ok
test_autocomplete_it (apache_beam.examples.complete.autocomplete_test.AutocompleteTest) ... ok
test_wordcount_fnapi_it (apache_beam.examples.wordcount_it_test.WordCountIT) ... ok
test_leader_board_it (apache_beam.examples.complete.game.leader_board_it_test.LeaderBoardIT) ... ok
test_game_stats_it (apache_beam.examples.complete.game.game_stats_it_test.GameStatsIT) ... ok
test_wordcount_it (apache_beam.examples.wordcount_it_test.WordCountIT) ... ok
test_user_score_it (apache_beam.examples.complete.game.user_score_it_test.UserScoreIT) ... ok
test_bigquery_read_1M_python (apache_beam.io.gcp.bigquery_io_read_it_test.BigqueryIOReadIT) ... ok
test_hourly_team_score_it (apache_beam.examples.complete.game.hourly_team_score_it_test.HourlyTeamScoreIT) ... ok
test_value_provider_transform (apache_beam.io.gcp.bigquery_test.BigQueryStreamingInsertTransformIntegrationTests) ... ok
test_datastore_write_limit (apache_beam.io.gcp.datastore_write_it_test.DatastoreWriteIT) ... SKIP: This test still needs to be fixed on Python 3TODO: BEAM-4543
test_copy (apache_beam.io.gcp.gcsio_integration_test.GcsIOIntegrationTest) ... ok
test_copy_batch (apache_beam.io.gcp.gcsio_integration_test.GcsIOIntegrationTest) ... ok
test_copy_batch_kms (apache_beam.io.gcp.gcsio_integration_test.GcsIOIntegrationTest) ... ok
test_copy_batch_rewrite_token (apache_beam.io.gcp.gcsio_integration_test.GcsIOIntegrationTest) ... ok
test_copy_kms (apache_beam.io.gcp.gcsio_integration_test.GcsIOIntegrationTest) ... ok
test_copy_rewrite_token (apache_beam.io.gcp.gcsio_integration_test.GcsIOIntegrationTest) ... ok
test_multiple_destinations_transform (apache_beam.io.gcp.bigquery_test.BigQueryStreamingInsertTransformIntegrationTests) ... ok
test_bqfl_streaming (apache_beam.io.gcp.bigquery_file_loads_test.BigQueryFileLoadsIT) ... SKIP: TestStream is not supported on TestDataflowRunner
test_multiple_destinations_transform (apache_beam.io.gcp.bigquery_file_loads_test.BigQueryFileLoadsIT) ... ok
test_one_job_fails_all_jobs_fail (apache_beam.io.gcp.bigquery_file_loads_test.BigQueryFileLoadsIT) ... ok
test_big_query_read (apache_beam.io.gcp.bigquery_read_it_test.BigQueryReadIntegrationTests) ... ok
test_big_query_read_new_types (apache_beam.io.gcp.bigquery_read_it_test.BigQueryReadIntegrationTests) ... ok
test_transform_on_gcs (apache_beam.io.fileio_test.MatchIntegrationTest) ... ok
test_file_loads (apache_beam.io.gcp.bigquery_test.PubSubBigQueryIT) ... SKIP: https://issuetracker.google.com/issues/118375066
test_streaming_inserts (apache_beam.io.gcp.bigquery_test.PubSubBigQueryIT) ... ok
test_parquetio_it (apache_beam.io.parquetio_it_test.TestParquetIT) ... ok
test_big_query_legacy_sql (apache_beam.io.gcp.big_query_query_to_table_it_test.BigQueryQueryToTableIT) ... ok
test_big_query_new_types (apache_beam.io.gcp.big_query_query_to_table_it_test.BigQueryQueryToTableIT) ... ok
test_big_query_standard_sql (apache_beam.io.gcp.big_query_query_to_table_it_test.BigQueryQueryToTableIT) ... ok
test_big_query_standard_sql_kms_key_native (apache_beam.io.gcp.big_query_query_to_table_it_test.BigQueryQueryToTableIT) ... ok
Runs streaming Dataflow job and verifies that user metrics are reported ... ok
test_job_python_from_python_it (apache_beam.transforms.external_test_it.ExternalTransformIT) ... ok
test_streaming_data_only (apache_beam.io.gcp.pubsub_integration_test.PubSubIntegrationTest) ... ok
test_streaming_with_attributes (apache_beam.io.gcp.pubsub_integration_test.PubSubIntegrationTest) ... ok
test_big_query_write (apache_beam.io.gcp.bigquery_write_it_test.BigQueryWriteIntegrationTests) ... ok
test_big_query_write_new_types (apache_beam.io.gcp.bigquery_write_it_test.BigQueryWriteIntegrationTests) ... ok
test_big_query_write_schema_autodetect (apache_beam.io.gcp.bigquery_write_it_test.BigQueryWriteIntegrationTests) ... SKIP: DataflowRunner does not support schema autodetection
test_big_query_write_without_schema (apache_beam.io.gcp.bigquery_write_it_test.BigQueryWriteIntegrationTests) ... ok
test_metrics_fnapi_it (apache_beam.runners.dataflow.dataflow_exercise_metrics_pipeline_test.ExerciseMetricsPipelineTest) ... ok
test_metrics_it (apache_beam.runners.dataflow.dataflow_exercise_metrics_pipeline_test.ExerciseMetricsPipelineTest) ... ok
test_datastore_write_limit (apache_beam.io.gcp.datastore.v1new.datastore_write_it_test.DatastoreWriteIT) ... ok
----------------------------------------------------------------------
XML: nosetests-postCommitIT-df-py37.xml
----------------------------------------------------------------------
XML: <https://builds.apache.org/job/beam_PostCommit_Python37/ws/src/sdks/python/nosetests.xml>
----------------------------------------------------------------------
Ran 45 tests in 3689.779s
OK (SKIP=6)
FAILURE: Build failed with an exception.
* Where:
Build file '<https://builds.apache.org/job/beam_PostCommit_Python37/ws/src/sdks/python/test-suites/direct/py37/build.gradle'> line: 51
* What went wrong:
Execution failed for task ':sdks:python:test-suites:direct:py37:postCommitIT'.
> Process 'command 'sh'' finished with non-zero exit value 1
* Try:
Run with --stacktrace option to get the stack trace. Run with --info or --debug option to get more log output. Run with --scan to get full insights.
* Get more help at https://help.gradle.org
Deprecated Gradle features were used in this build, making it incompatible with Gradle 6.0.
Use '--warning-mode all' to show the individual deprecation warnings.
See https://docs.gradle.org/5.2.1/userguide/command_line_interface.html#sec:command_line_warnings
BUILD FAILED in 1h 2m 21s
65 actionable tasks: 48 executed, 17 from cache
Publishing build scan...
https://gradle.com/s/uafhs35aqgkqk
Build step 'Invoke Gradle script' changed build result to FAILURE
Build step 'Invoke Gradle script' marked build as failure
---------------------------------------------------------------------
To unsubscribe, e-mail: builds-unsubscribe@beam.apache.org
For additional commands, e-mail: builds-help@beam.apache.org