You are viewing a plain text version of this content. The canonical link for it is here.
Posted to commits@tomee.apache.org by Apache Jenkins Server <je...@builds.apache.org> on 2026/05/12 09:55:56 UTC

Build failed in Jenkins: TomEE » tomee-10-build-full-tck #68

See <https://ci-builds.apache.org/job/Tomee/job/tomee-10-build-full-tck/68/display/redirect?page=changes>

Changes:

[github] TOMEE-4603 - LinkageError in tomee 10.1 with scope="request" (#2633)

[github] [tomee-10.x]: Bump commons-io:commons-io from 2.21.0 to 2.22.0 (#2634)

[github] [tomee-10.x]: Bump joda-time:joda-time from 2.14.1 to 2.14.2 (#2636)

[github] [tomee-10.x]: Bump org.jboss.shrinkwrap.resolver:shrinkwrap-resolver-bom (#2642)

[github] [tomee-10.x]: Bump com.google.code.gson:gson from 2.2.4 to 2.14.0 (#2653)

[github] [tomee-10.x]: Bump commons-codec:commons-codec from 1.21.0 to 1.22.0 (#2638)

[github] [tomee-10.x]: Bump version.activemq from 6.2.4 to 6.2.5 (#2640)

[github] [tomee-10.x]: Bump version.jackson from 2.21.2 to 2.21.3 (#2645)

[github] [tomee-10.x]: Bump org.apache.neethi:neethi from 3.2.1 to 3.2.2 (#2648)

[github] [tomee-10.x]: Bump org.glassfish:jakarta.faces from 4.0.15 to 4.0.17 (#2650)

[github] [tomee-10.x]: Bump version.microprofile.impl.config (#2652)

[github] TOMEE-4610 - RemoteException is not chained with AuthenticationException at openejb-client authentication (#2549)


------------------------------------------
[...truncated 1.19 MiB...]
[INFO] TomEE :: Connector Examples :: Connector in EAR :: Connector Impl 10.1.6-SNAPSHOT SUCCESS [  0.285 s]
[INFO] TomEE :: Connector Examples :: Connector in EAR :: RAR Packaging 10.1.6-SNAPSHOT SUCCESS [  0.580 s]
[INFO] TomEE :: Connector Examples :: Connector in EAR :: Sample WAR 10.1.6-SNAPSHOT SUCCESS [  0.153 s]
[INFO] TomEE :: Connector Examples :: Connector in EAR :: EAR Packaging 10.1.6-SNAPSHOT SUCCESS [  0.340 s]
[INFO] TomEE :: Connector Examples :: Connector in EAR :: Functional Tests 10.1.6-SNAPSHOT SUCCESS [  0.828 s]
[INFO] TomEE :: Connector Examples :: Connector in WAR 10.1.6-SNAPSHOT SUCCESS [  0.469 s]
[INFO] TomEE :: Examples :: Cucumber JVM 10.1.6-SNAPSHOT .. SUCCESS [  2.388 s]
[INFO] TomEE :: Examples :: Expanded support for Env Entries 10.1.6-SNAPSHOT SUCCESS [  0.229 s]
[INFO] TomEE :: Examples :: Datasource Ciphered Password 10.1.6-SNAPSHOT SUCCESS [  0.152 s]
[INFO] TomEE :: Examples :: Datasource Definition 10.1.6-SNAPSHOT SUCCESS [  0.370 s]
[INFO] TomEE :: Examples :: Datasource Versioning 10.1.6-SNAPSHOT SUCCESS [  0.758 s]
[INFO] TomEE :: Examples :: Decorators 10.1.6-SNAPSHOT .... SUCCESS [  0.264 s]
[INFO] TomEE :: Examples :: Dynamic DAO Implementation 10.1.6-SNAPSHOT SUCCESS [  0.247 s]
[INFO] TomEE :: Examples :: Dynamic Datasource Routing 10.1.6-SNAPSHOT SUCCESS [  0.297 s]
[INFO] TomEE :: Examples :: Dynamic Implementation 10.1.6-SNAPSHOT SUCCESS [  0.242 s]
[INFO] TomEE :: Examples :: Dynamic MBean Proxy 10.1.6-SNAPSHOT SUCCESS [  0.251 s]
[INFO] TomEE :: Examples :: Ear Testing 10.1.6-SNAPSHOT ... SUCCESS [  0.004 s]
[INFO] TomEE :: Examples :: Ear Testing :: Business Model 10.1.6-SNAPSHOT SUCCESS [  0.057 s]
[INFO] TomEE :: Examples :: Ear Testing :: Business Logic 10.1.6-SNAPSHOT SUCCESS [  0.197 s]
[INFO] TomEE :: Web Examples :: EJB Examples War 10.1.6-SNAPSHOT SUCCESS [  0.234 s]
[INFO] TomEE :: Web Examples :: EJB Remote Call 10.1.6-SNAPSHOT SUCCESS [  0.196 s]
[INFO] TomEE :: Web Examples :: EJB Remote Call 10.1.6-SNAPSHOT SUCCESS [  0.153 s]
[INFO] TomEE :: Web Examples :: EJB WebService 10.1.6-SNAPSHOT SUCCESS [  0.073 s]
[INFO] TomEE :: Arquillian Adaptors Parent :: OpenEJB Container 10.1.6-SNAPSHOT SUCCESS [  1.562 s]
[INFO] TomEE :: Examples :: Groovy CDI 10.1.6-SNAPSHOT .... SUCCESS [  1.232 s]
[INFO] TomEE :: Examples :: Groovy JPA 10.1.6-SNAPSHOT .... SUCCESS [  0.964 s]
[INFO] TomEE :: Examples :: Hello World - Weblogic 10.1.6-SNAPSHOT SUCCESS [  0.193 s]
[INFO] TomEE :: Examples :: @Resource jakarta.jms.ConnectionFactory 10.1.6-SNAPSHOT SUCCESS [  0.407 s]
[INFO] TomEE :: Examples :: @Resource DataSource Injection 10.1.6-SNAPSHOT SUCCESS [  0.217 s]
[INFO] TomEE :: Examples :: @EJB Injection 10.1.6-SNAPSHOT  SUCCESS [  0.182 s]
[INFO] TomEE :: Examples :: @PersistenceContext EntityManager Injection 10.1.6-SNAPSHOT SUCCESS [  0.233 s]
[INFO] TomEE :: Examples :: @Resource env-entry Injection 10.1.6-SNAPSHOT SUCCESS [  0.207 s]
[INFO] TomEE :: Examples :: Interceptors 10.1.6-SNAPSHOT .. SUCCESS [  0.232 s]
[INFO] TomEE :: Examples :: JakartaMail API 10.1.6-SNAPSHOT SUCCESS [  0.707 s]
[INFO] TomEE :: Examples :: Jakarta Mail API with Velocity 10.1.6-SNAPSHOT SUCCESS [  1.850 s]
[INFO] TomEE :: Web Examples :: Java Modules (Simple REST resource) 10.1.6-SNAPSHOT SUCCESS [  1.103 s]
[INFO] TomEE :: Examples :: JAXRS Filter 10.1.6-SNAPSHOT .. SUCCESS [  0.505 s]
[INFO] TomEE :: Examples :: JAXRS JSON Provider with Jettison 10.1.6-SNAPSHOT SUCCESS [  0.677 s]
[INFO] TomEE :: Examples :: JPA with EclipseLink 10.1.6-SNAPSHOT SUCCESS [  0.292 s]
[INFO] TomEE :: Utils :: Core Hibernate 10.1.6-SNAPSHOT ... SUCCESS [  0.188 s]
[INFO] TomEE :: Examples :: JPA with Hibernate 10.1.6-SNAPSHOT SUCCESS [  0.611 s]
[INFO] TomEE :: Examples :: JPA with Hibernate and arquillian 10.1.6-SNAPSHOT SUCCESS [  0.326 s]
[INFO] TomEE :: Examples :: JPA @Enumerated 10.1.6-SNAPSHOT SUCCESS [  0.245 s]
[INFO] TomEE :: Web Examples :: JSF - CDI and EJB 10.1.6-SNAPSHOT SUCCESS [  0.103 s]
[INFO] TomEE :: Examples :: JUnit 5 :: Application Composer 10.1.6-SNAPSHOT SUCCESS [  0.372 s]
[INFO] TomEE :: Examples :: JUnit 5 :: Multiple TomEE with Arquillian 10.1.6-SNAPSHOT SUCCESS [  0.165 s]
[INFO] TomEE :: Examples :: JUnit 5 :: Simple Websockets with Arquillian 10.1.6-SNAPSHOT SUCCESS [  0.421 s]
[INFO] TomEE :: Examples :: @EJB Lookup 10.1.6-SNAPSHOT ... SUCCESS [  0.191 s]
[INFO] TomEE :: Examples :: EJB Lookup with descriptor 10.1.6-SNAPSHOT SUCCESS [  0.185 s]
[INFO] TomEE :: Examples :: Movies Complete (Meta) 10.1.6-SNAPSHOT SUCCESS [  0.233 s]
[INFO] TomEE :: Examples :: Movies Complete 10.1.6-SNAPSHOT SUCCESS [  0.231 s]
[INFO] TomEE :: Examples :: MicroProfile Config 10.1.6-SNAPSHOT SUCCESS [  0.314 s]
[INFO] TomEE :: Examples :: MicroProfile Config Source Database 10.1.6-SNAPSHOT SUCCESS [  0.592 s]
[INFO] TomEE :: Examples :: Microprofile Fault Tolerance :: Fallback 10.1.6-SNAPSHOT SUCCESS [  0.258 s]
[INFO] TomEE :: Examples :: Microprofile Fault Tolerance :: Retry 10.1.6-SNAPSHOT SUCCESS [  0.415 s]
[INFO] TomEE :: Examples :: Microprofile Fault Tolerance :: Timeout 10.1.6-SNAPSHOT SUCCESS [  0.235 s]
[INFO] TomEE :: Examples :: MicroProfile JWT Bean Validation 10.1.6-SNAPSHOT SUCCESS [  0.612 s]
[INFO] TomEE :: Examples :: MicroProfile JWT Bean Validation, Strongly-typed Annotations 10.1.6-SNAPSHOT SUCCESS [  0.430 s]
[INFO] TomEE :: Examples :: Microprofile Metrics Counted 10.1.6-SNAPSHOT SUCCESS [  0.332 s]
[INFO] TomEE :: Examples :: Microprofile Metrics Histogram 10.1.6-SNAPSHOT SUCCESS [  0.255 s]
[INFO] TomEE :: Examples :: Microprofile Metrics Timed 10.1.6-SNAPSHOT SUCCESS [  0.249 s]
[INFO] TomEE :: Examples :: MicroProfile Metrics Gauge 10.1.6-SNAPSHOT SUCCESS [  0.280 s]
[INFO] TomEE :: Examples :: MicroProfile Metrics Metered 10.1.6-SNAPSHOT SUCCESS [  0.085 s]
[INFO] TomEE :: Examples :: MP REST JWT JWK 10.1.6-SNAPSHOT SUCCESS [  0.436 s]
[INFO] TomEE :: Examples :: MP REST JWT PRINCIPAL 10.1.6-SNAPSHOT SUCCESS [  0.309 s]
[INFO] TomEE :: Examples :: MP REST JWT Public Key 10.1.6-SNAPSHOT SUCCESS [  0.397 s]
[INFO] TomEE :: Examples :: Microprofile REST Client 10.1.6-SNAPSHOT SUCCESS [  0.279 s]
[INFO] TomEE :: Examples :: Custom HealthCheck 10.1.6-SNAPSHOT SUCCESS [  0.278 s]
[INFO] TomEE :: Examples :: Microprofile OpenAPI Reader 10.1.6-SNAPSHOT SUCCESS [  0.625 s]
[INFO] TomEE :: Examples :: MTOM 10.1.6-SNAPSHOT .......... SUCCESS [  0.733 s]
[INFO] TomEE :: Examples :: Multiple JPA providers 10.1.6-SNAPSHOT SUCCESS [  0.512 s]
[INFO] TomEE :: Examples :: Multiple Arquillian Adapters 10.1.6-SNAPSHOT SUCCESS [  0.481 s]
[INFO] TomEE :: Examples :: Multiple TomEE with Arquillian 10.1.6-SNAPSHOT SUCCESS [  0.161 s]
[INFO] TomEE :: Examples :: Persistence Fragment 10.1.6-SNAPSHOT SUCCESS [  0.182 s]
[INFO] TomEE :: Web Examples :: Pojo WS 10.1.6-SNAPSHOT ... SUCCESS [  0.094 s]
[INFO] TomEE :: Examples :: Quartz 10.1.6-SNAPSHOT ........ SUCCESS [  0.003 s]
[INFO] TomEE :: Examples :: Quartz :: Quartz Resource Adapter 10.1.6-SNAPSHOT SUCCESS [  0.123 s]
[INFO] TomEE :: Examples :: Quartz :: Quartz Beans 10.1.6-SNAPSHOT SUCCESS [  0.729 s]
[INFO] TomEE :: Examples :: DataSource Realm 10.1.6-SNAPSHOT SUCCESS [  0.030 s]
[INFO] TomEE :: Examples :: Reloadable Persistence Unit Properties 10.1.6-SNAPSHOT SUCCESS [  0.204 s]
[INFO] TomEE :: Web Examples :: Resource Declared In A Webapp 10.1.6-SNAPSHOT SUCCESS [  0.115 s]
[INFO] TomEE :: Examples :: REST, Mockito and Application Composer 10.1.6-SNAPSHOT SUCCESS [  0.234 s]
[INFO] TomEE :: Examples :: REST and Application Composer 10.1.6-SNAPSHOT SUCCESS [  0.218 s]
[INFO] TomEE :: Examples :: REST CDI 10.1.6-SNAPSHOT ...... SUCCESS [  0.246 s]
[INFO] TomEE :: Examples :: JAXRS and JAAS 10.1.6-SNAPSHOT  SUCCESS [  0.093 s]
[INFO] TomEE :: Examples :: REST and EJB 10.1.6-SNAPSHOT .. SUCCESS [  0.275 s]
[INFO] TomEE :: Web Examples :: REST Example 10.1.6-SNAPSHOT SUCCESS [  1.724 s]
[INFO] TomEE :: Web Examples :: REST Example With Application 10.1.6-SNAPSHOT SUCCESS [  0.769 s]
[INFO] TomEE :: Examples :: REST XML JSON 10.1.6-SNAPSHOT . SUCCESS [  0.227 s]
[INFO] TomEE :: Examples :: Basic Scala 10.1.6-SNAPSHOT ... SUCCESS [ 13.263 s]
[INFO] TomEE :: Examples :: ScheduleExpression 10.1.6-SNAPSHOT SUCCESS [  0.291 s]
[INFO] TomEE :: Examples :: @Schedule Events 10.1.6-SNAPSHOT SUCCESS [  0.229 s]
[INFO] TomEE :: Examples :: @Schedule Methods (Meta) 10.1.6-SNAPSHOT SUCCESS [  0.245 s]
[INFO] TomEE :: Examples :: @Schedule Methods 10.1.6-SNAPSHOT SUCCESS [  0.222 s]
[INFO] TomEE :: Examples :: Server Events 10.1.6-SNAPSHOT . SUCCESS [  0.291 s]
[INFO] TomEE :: Examples :: Serverless Builder 10.1.6-SNAPSHOT SUCCESS [  0.529 s]
[INFO] TomEE :: Examples :: Serverless Apache TomEE WebProfile 10.1.6-SNAPSHOT SUCCESS [  0.531 s]
[INFO] TomEE :: Examples :: Serverless Apache TomEE MicroProfile 10.1.6-SNAPSHOT SUCCESS [  0.661 s]
[INFO] TomEE :: Examples :: Serverless Apache TomEE Plume 10.1.6-SNAPSHOT SUCCESS [  0.686 s]
[INFO] TomEE :: Examples :: Serverless Apache TomEE Plus 10.1.6-SNAPSHOT SUCCESS [  0.684 s]
[INFO] TomEE :: Examples ::  Singleton startup ordering 10.1.6-SNAPSHOT SUCCESS [  0.290 s]
[INFO] TomEE :: Examples :: Simple CDI Interceptor 10.1.6-SNAPSHOT SUCCESS [  0.189 s]
[INFO] TomEE :: Examples :: Simple EAR 10.1.6-SNAPSHOT .... SUCCESS [  0.003 s]
[INFO] TomEE :: Examples :: Simple EAR :: Business Model 10.1.6-SNAPSHOT SUCCESS [  0.076 s]
[INFO] TomEE :: Examples :: Simple EAR :: Business Logic 10.1.6-SNAPSHOT SUCCESS [  0.177 s]
[INFO] TomEE :: Examples :: Simple EAR :: Webapp 10.1.6-SNAPSHOT SUCCESS [  0.332 s]
[INFO] TomEE :: Examples :: Simple EAR :: EAR Packaging 10.1.6-SNAPSHOT SUCCESS [  0.030 s]
[INFO] TomEE :: Examples :: Simple EAR :: Functional Tests 10.1.6-SNAPSHOT SUCCESS [  0.736 s]
[INFO] TomEE :: Examples :: Simple CMP2 Entity 10.1.6-SNAPSHOT SUCCESS [  0.200 s]
[INFO] TomEE :: Examples :: Simple JMS 10.1.6-SNAPSHOT .... SUCCESS [  0.912 s]
[INFO] TomEE :: Examples :: Simple JMS Context 10.1.6-SNAPSHOT SUCCESS [  0.726 s]
[INFO] TomEE :: Examples :: Simple MDB With a CDI Injection 10.1.6-SNAPSHOT SUCCESS [  0.434 s]
[INFO] TomEE :: Examples :: Simple MDB Example 10.1.6-SNAPSHOT SUCCESS [  0.553 s]
[INFO] TomEE :: Examples :: Simple MDB Using Deployment Descriptor Example 10.1.6-SNAPSHOT SUCCESS [  0.456 s]
[INFO] TomEE :: Examples :: Simple Remote tomcat-users.xml 10.1.6-SNAPSHOT SUCCESS [  0.201 s]
[INFO] TomEE :: Examples :: Simple REST 10.1.6-SNAPSHOT ... SUCCESS [  0.213 s]
[INFO] TomEE :: Examples :: Simple Singleton 10.1.6-SNAPSHOT SUCCESS [  0.191 s]
[INFO] TomEE :: Examples :: Simple Stateful Pojo 10.1.6-SNAPSHOT SUCCESS [  0.168 s]
[INFO] TomEE :: Examples :: Simple Stateful Pojo Callbacks 10.1.6-SNAPSHOT SUCCESS [  0.201 s]
[INFO] TomEE :: Examples :: Simple Stateless Pojo 10.1.6-SNAPSHOT SUCCESS [  0.170 s]
[INFO] TomEE :: Examples :: Simple Stateless Pojo Callbacks 10.1.6-SNAPSHOT SUCCESS [  0.228 s]
[INFO] TomEE :: Examples :: Simple Stateless With Deployment Descriptor 10.1.6-SNAPSHOT SUCCESS [  0.185 s]
[INFO] TomEE :: Examples :: Simple Webservice 10.1.6-SNAPSHOT SUCCESS [  0.517 s]
[INFO] TomEE :: Examples :: Simple Webservice Without Interface 10.1.6-SNAPSHOT SUCCESS [  0.435 s]
[INFO] TomEE :: Examples :: Async Servlet 10.1.6-SNAPSHOT . SUCCESS [  0.295 s]
[INFO] TomEE :: Web Examples :: Struts 10.1.6-SNAPSHOT .... SUCCESS [  1.004 s]
[INFO] TomEE :: Examples :: Telephone Stateful Pojo 10.1.6-SNAPSHOT SUCCESS [  0.212 s]
[INFO] TomEE :: Examples :: TestCase Injection 10.1.6-SNAPSHOT SUCCESS [  0.190 s]
[INFO] TomEE :: Examples :: Testing Security (Meta) 10.1.6-SNAPSHOT SUCCESS [  0.240 s]
[INFO] TomEE :: Examples :: Testing Security 10.1.6-SNAPSHOT SUCCESS [  0.199 s]
[INFO] TomEE :: Examples :: Testing Security 10.1.6-SNAPSHOT SUCCESS [  0.235 s]
[INFO] TomEE :: Examples :: Testing Security Service Provider 10.1.6-SNAPSHOT SUCCESS [  0.251 s]
[INFO] TomEE :: Examples :: Testing Security Script Service Provider 10.1.6-SNAPSHOT SUCCESS [  0.255 s]
[INFO] TomEE :: Examples :: Testing Transactions 10.1.6-SNAPSHOT SUCCESS [  0.209 s]
[INFO] TomEE :: Examples :: Testing Transactions BMT 10.1.6-SNAPSHOT SUCCESS [  0.188 s]
[INFO] TomEE :: TomEE :: IBM MQ AMQ Portability Examples :: MDB Example 1.0 SUCCESS [  0.382 s]
[INFO] TomEE :: Examples :: Transaction Rollback 10.1.6-SNAPSHOT SUCCESS [  0.202 s]
[INFO] TomEE :: Examples :: Troubleshooting 10.1.6-SNAPSHOT SUCCESS [  0.188 s]
[INFO] TomEE :: Examples :: Webservice Attachments 10.1.6-SNAPSHOT SUCCESS [  0.326 s]
[INFO] TomEE :: Examples :: Webservice Inheritance 10.1.6-SNAPSHOT SUCCESS [  0.468 s]
[INFO] TomEE :: Web Examples :: EJB WebService with Security 10.1.6-SNAPSHOT SUCCESS [  0.443 s]
[INFO] TomEE :: Web Examples :: EJB WebService with SSL Client Certificate 10.1.6-SNAPSHOT SUCCESS [  5.045 s]
[INFO] TomEE :: Web Examples :: EJB WebService with WS-Security 10.1.6-SNAPSHOT SUCCESS [  4.965 s]
[INFO] TomEE :: Web Examples :: EJB WebService WS Security with resources.xml 10.1.6-SNAPSHOT SUCCESS [  0.671 s]
[INFO] TomEE :: Examples :: Web Service Handlers 10.1.6-SNAPSHOT SUCCESS [  0.494 s]
[INFO] TomEE :: Examples :: @WebService Holder 10.1.6-SNAPSHOT SUCCESS [  0.455 s]
[INFO] TomEE :: Web Examples :: Moviefun 10.1.6-SNAPSHOT .. SUCCESS [  0.860 s]
[INFO] TomEE :: Web Examples :: Moviefun Rest 10.1.6-SNAPSHOT SUCCESS [  3.442 s]
[INFO] TomEE :: Examples :: Resources/JMX Example 10.1.6-SNAPSHOT SUCCESS [  0.078 s]
[INFO] TomEE :: Examples :: Resources/JMX Example :: EJB Module 10.1.6-SNAPSHOT FAILURE [  2.257 s]
[INFO] TomEE :: Examples :: Resources/JMX Example :: EAR Module 10.1.6-SNAPSHOT SKIPPED
[INFO] TomEE :: Examples :: WebSocket with tls and basic auth Example 10.1.6-SNAPSHOT SKIPPED
[INFO] TomEE :: Examples :: Concurrency utilities example 10.1.6-SNAPSHOT SKIPPED
[INFO] TomEE :: Examples :: Microprofile JSONB Configuration 10.1.6-SNAPSHOT SKIPPED
[INFO] TomEE :: Examples :: Microprofile JSONB Custom Serializer/Deserializer 10.1.6-SNAPSHOT SKIPPED
[INFO] TomEE :: Examples :: Azure deployment example 10.1.6-SNAPSHOT SKIPPED
[INFO] TomEE :: Examples :: XA Datasource configuration and usage 10.1.6-SNAPSHOT SKIPPED
[INFO] TomEE :: Examples :: Websocket JMS 10.1.6-SNAPSHOT . SKIPPED
[INFO] TomEE :: Web Examples :: Multi-Broker 10.1.6-SNAPSHOT SKIPPED
[INFO] TomEE :: Examples :: Jakarta Security tomcat-user.xml Identity Store 10.1.6-SNAPSHOT SKIPPED
[INFO] TomEE :: Examples :: Jakarta Security custom Identity Store 10.1.6-SNAPSHOT SKIPPED
[INFO] TomEE :: Examples :: Jakarta Security OpenID Connect 10.1.6-SNAPSHOT SKIPPED
[INFO] TomEE :: Examples 10.1.6-SNAPSHOT .................. SKIPPED
[INFO] TomEE :: Assembly :: All In One EJB Lite jar 10.1.6-SNAPSHOT SKIPPED
[INFO] TomEE :: Utils :: TomEE Webapps-based Deployer EJB 10.1.6-SNAPSHOT SKIPPED
[INFO] TomEE :: TCK 10.1.6-SNAPSHOT ....................... SKIPPED
[INFO] TomEE :: TCK :: Common 10.1.6-SNAPSHOT ............. SKIPPED
[INFO] TomEE :: TCK :: CDI Embedded 10.1.6-SNAPSHOT ....... SKIPPED
[INFO] TomEE :: TCK :: CDI TomEE 10.1.6-SNAPSHOT .......... SKIPPED
[INFO] TomEE :: TCK :: CDI TCK Signature Tests 10.1.6-SNAPSHOT SKIPPED
[INFO] TomEE :: TCK :: Bean Validation Embedded 10.1.6-SNAPSHOT SKIPPED
[INFO] TomEE :: TCK :: Bean Validation TomEE 10.1.6-SNAPSHOT SKIPPED
[INFO] TomEE :: TCK :: Bean Validation TCK Signature tests 10.1.6-SNAPSHOT SKIPPED
[INFO] TomEE :: TCK :: JSON-P Standalone 10.1.6-SNAPSHOT .. SKIPPED
[INFO] TomEE :: TCK :: JSON-P Signature Tests 10.1.6-SNAPSHOT SKIPPED
[INFO] TomEE :: TCK :: JSON-B Standalone 10.1.6-SNAPSHOT .. SKIPPED
[INFO] TomEE :: TCK :: JSON-B Signature Tests 10.1.6-SNAPSHOT SKIPPED
[INFO] TomEE :: TCK :: Concurrency Standalone 10.1.6-SNAPSHOT SKIPPED
[INFO] TomEE :: TCK :: Concurrency Signature Tests 10.1.6-SNAPSHOT SKIPPED
[INFO] TomEE :: TCK :: MicroProfile 10.1.6-SNAPSHOT ....... SKIPPED
[INFO] TomEE :: TCK :: MicroProfile Config TCK 10.1.6-SNAPSHOT SKIPPED
[INFO] TomEE :: TCK :: MicroProfile JWT TCK 10.1.6-SNAPSHOT SKIPPED
[INFO] TomEE :: TCK :: MicroProfile Health TCK 10.1.6-SNAPSHOT SKIPPED
[INFO] TomEE :: TCK :: MicroProfile Metrics TCK 10.1.6-SNAPSHOT SKIPPED
[INFO] TomEE :: TCK :: MicroProfile Rest Client TCK 10.1.6-SNAPSHOT SKIPPED
[INFO] TomEE :: TCK :: MicroProfile Open API TCK 10.1.6-SNAPSHOT SKIPPED
[INFO] TomEE :: TCK :: MicroProfile Fault Tolerance TCK 10.1.6-SNAPSHOT SKIPPED
[INFO] TomEE :: TCK :: MicroProfile Open Telemetry TCK 10.1.6-SNAPSHOT SKIPPED
[INFO] TomEE :: TCK :: JAX-RS TCK 10.1.6-SNAPSHOT ......... SKIPPED
[INFO] TomEE :: TCK :: JAX-RS TCK :: Tests 10.1.6-SNAPSHOT  SKIPPED
[INFO] TomEE :: TCK :: JAX-RS TCK :: Tests Embedded 10.1.6-SNAPSHOT SKIPPED
[INFO] TomEE :: TCK :: JAX-RS TCK :: Signature Test 10.1.6-SNAPSHOT SKIPPED
[INFO] TomEE :: Arquillian Adaptors Parent :: Tests 10.1.6-SNAPSHOT SKIPPED
[INFO] TomEE :: Arquillian Adaptors Parent :: Tests :: Web Profile 10.1.6-SNAPSHOT SKIPPED
[INFO] TomEE :: Arquillian Adaptors Parent :: Tests :: JAXRS 10.1.6-SNAPSHOT SKIPPED
[INFO] TomEE :: Arquillian Adaptors Parent :: Tests :: JAXWS 10.1.6-SNAPSHOT SKIPPED
[INFO] TomEE :: Arquillian Adaptors Parent :: Tests :: JMS 10.1.6-SNAPSHOT SKIPPED
[INFO] TomEE :: Arquillian Adaptors Parent :: Tests :: Configuration Tests 10.1.6-SNAPSHOT SKIPPED
[INFO] TomEE :: Arquillian Adaptors Parent :: Sample :: Moviefun 10.1.6-SNAPSHOT SKIPPED
[INFO] TomEE :: Arquillian Adaptors Parent :: Arquillian TCK 10.1.6-SNAPSHOT SKIPPED
[INFO] TomEE :: Arquillian :: Functional Tests 10.1.6-SNAPSHOT SKIPPED
[INFO] TomEE :: Arquillian :: Functional Tests :: Spring CXF Test 10.1.6-SNAPSHOT SKIPPED
[INFO] TomEE :: Utils :: Provisionning 10.1.6-SNAPSHOT .... SKIPPED
[INFO] TomEE :: Utils :: Log4j2 10.1.6-SNAPSHOT ........... SKIPPED
[INFO] TomEE :: TomEE :: webaccess 10.1.6-SNAPSHOT ........ SKIPPED
[INFO] TomEE :: TomEE :: Overlay Runner 10.1.6-SNAPSHOT ... SKIPPED
[INFO] ------------------------------------------------------------------------
[INFO] BUILD FAILURE
[INFO] ------------------------------------------------------------------------
[INFO] Total time:  21:44 min
[INFO] Finished at: 2026-05-12T09:55:52Z
[INFO] ------------------------------------------------------------------------
[WARNING] 
[WARNING] Plugin validation issues were detected in 13 plugin(s)
[WARNING] 
[WARNING]  * org.apache.maven.plugins:maven-jar-plugin:3.0.2
[WARNING]  * org.apache.maven.plugins:maven-compiler-plugin:3.14.1
[WARNING]  * org.apache.maven.plugins:maven-compiler-plugin:3.10.1
[WARNING]  * org.scalatest:scalatest-maven-plugin:2.2.0
[WARNING]  * org.apache.maven.plugins:maven-resources-plugin:3.3.0
[WARNING]  * org.apache.openjpa:openjpa-maven-plugin:4.1.1
[WARNING]  * org.apache.maven.plugins:maven-surefire-plugin:3.5.3
[WARNING]  * org.apache.maven.plugins:maven-war-plugin:3.3.2
[WARNING]  * org.apache.maven.plugins:maven-assembly-plugin:2.4.1
[WARNING]  * com.googlecode.jslint4java:jslint4java-maven-plugin:2.0.5
[WARNING]  * org.apache.tomee.patch:tomee-patch-plugin:0.10
[WARNING]  * org.apache.felix:maven-bundle-plugin:6.0.2
[WARNING]  * org.apache.maven.plugins:maven-install-plugin:3.0.0-M1
[WARNING] 
[WARNING] For more or less details, use 'maven.plugin.validation' property with one of the values (case insensitive): [BRIEF, DEFAULT, VERBOSE]
[WARNING] 
[ERROR] Failed to execute goal on project resources-jmx-ejb: Could not resolve dependencies for project org.superbiz:resources-jmx-ejb:ejb:10.1.6-SNAPSHOT: The following artifacts could not be resolved: org.apache.tomee:arquillian-tomee-remote:jar:10.1.5-SNAPSHOT (absent), org.apache.tomee:openejb-provisionning:jar:10.1.5-SNAPSHOT (absent), org.apache.tomee:ziplock:jar:10.1.5-SNAPSHOT (absent): Could not find artifact org.apache.tomee:arquillian-tomee-remote:jar:10.1.5-SNAPSHOT in apache-m2-snapshot (https://repository.apache.org/snapshots) -> [Help 1]
[ERROR] 
[ERROR] To see the full stack trace of the errors, re-run Maven with the -e switch.
[ERROR] Re-run Maven using the -X switch to enable full debug logging.
[ERROR] 
[ERROR] For more information about the errors and possible solutions, please read the following articles:
[ERROR] [Help 1] http://cwiki.apache.org/confluence/display/MAVEN/DependencyResolutionException
[ERROR] 
[ERROR] After correcting the problems, you can resume the build with the command
[ERROR]   mvn <args> -rf :resources-jmx-ejb
Build step 'Execute shell' marked build as failure
INFO: Processing JUnit
INFO: [JUnit] - No test report file(s) were found with the pattern '**/target/surefire-reports/TEST-*.xml' relative to '<https://ci-builds.apache.org/job/Tomee/job/tomee-10-build-full-tck/ws/'> for the testing framework 'JUnit'.
Did you enter a pattern relative to (and within) the workspace directory?
Did you generate the result report(s) for 'JUnit'?"
WARNING: All test reports are empty.
[Checks API] No suitable checks publisher found.
INFO: Setting the build status to SUCCESS

Build failed in Jenkins: TomEE » tomee-10-build-full-tck #70

Posted by Apache Jenkins Server <je...@builds.apache.org>.
See <https://ci-builds.apache.org/job/Tomee/job/tomee-10-build-full-tck/70/display/redirect>

Changes:


------------------------------------------
[...truncated 5.00 MiB...]
[INFO] TomEE :: Connector Examples :: Connector in EAR :: Connector Impl 10.1.6-SNAPSHOT SUCCESS [  0.172 s]
[INFO] TomEE :: Connector Examples :: Connector in EAR :: RAR Packaging 10.1.6-SNAPSHOT SUCCESS [  0.704 s]
[INFO] TomEE :: Connector Examples :: Connector in EAR :: Sample WAR 10.1.6-SNAPSHOT SUCCESS [  0.107 s]
[INFO] TomEE :: Connector Examples :: Connector in EAR :: EAR Packaging 10.1.6-SNAPSHOT SUCCESS [  0.373 s]
[INFO] TomEE :: Connector Examples :: Connector in EAR :: Functional Tests 10.1.6-SNAPSHOT SUCCESS [  3.615 s]
[INFO] TomEE :: Connector Examples :: Connector in WAR 10.1.6-SNAPSHOT SUCCESS [  0.386 s]
[INFO] TomEE :: Examples :: Cucumber JVM 10.1.6-SNAPSHOT .. SUCCESS [  6.673 s]
[INFO] TomEE :: Examples :: Expanded support for Env Entries 10.1.6-SNAPSHOT SUCCESS [  0.230 s]
[INFO] TomEE :: Examples :: Datasource Ciphered Password 10.1.6-SNAPSHOT SUCCESS [  0.149 s]
[INFO] TomEE :: Examples :: Datasource Definition 10.1.6-SNAPSHOT SUCCESS [  0.628 s]
[INFO] TomEE :: Examples :: Datasource Versioning 10.1.6-SNAPSHOT SUCCESS [  1.017 s]
[INFO] TomEE :: Examples :: Decorators 10.1.6-SNAPSHOT .... SUCCESS [  0.147 s]
[INFO] TomEE :: Examples :: Dynamic DAO Implementation 10.1.6-SNAPSHOT SUCCESS [  0.139 s]
[INFO] TomEE :: Examples :: Dynamic Datasource Routing 10.1.6-SNAPSHOT SUCCESS [  0.184 s]
[INFO] TomEE :: Examples :: Dynamic Implementation 10.1.6-SNAPSHOT SUCCESS [  0.148 s]
[INFO] TomEE :: Examples :: Dynamic MBean Proxy 10.1.6-SNAPSHOT SUCCESS [  0.258 s]
[INFO] TomEE :: Examples :: Ear Testing 10.1.6-SNAPSHOT ... SUCCESS [  0.007 s]
[INFO] TomEE :: Examples :: Ear Testing :: Business Model 10.1.6-SNAPSHOT SUCCESS [  0.068 s]
[INFO] TomEE :: Examples :: Ear Testing :: Business Logic 10.1.6-SNAPSHOT SUCCESS [  0.166 s]
[INFO] TomEE :: Web Examples :: EJB Examples War 10.1.6-SNAPSHOT SUCCESS [  0.220 s]
[INFO] TomEE :: Web Examples :: EJB Remote Call 10.1.6-SNAPSHOT SUCCESS [  0.146 s]
[INFO] TomEE :: Web Examples :: EJB Remote Call 10.1.6-SNAPSHOT SUCCESS [  0.122 s]
[INFO] TomEE :: Web Examples :: EJB WebService 10.1.6-SNAPSHOT SUCCESS [  0.064 s]
[INFO] TomEE :: Arquillian Adaptors Parent :: OpenEJB Container 10.1.6-SNAPSHOT SUCCESS [  2.537 s]
[INFO] TomEE :: Examples :: Groovy CDI 10.1.6-SNAPSHOT .... SUCCESS [  1.233 s]
[INFO] TomEE :: Examples :: Groovy JPA 10.1.6-SNAPSHOT .... SUCCESS [  0.680 s]
[INFO] TomEE :: Examples :: Hello World - Weblogic 10.1.6-SNAPSHOT SUCCESS [  0.119 s]
[INFO] TomEE :: Examples :: @Resource jakarta.jms.ConnectionFactory 10.1.6-SNAPSHOT SUCCESS [  0.243 s]
[INFO] TomEE :: Examples :: @Resource DataSource Injection 10.1.6-SNAPSHOT SUCCESS [  0.139 s]
[INFO] TomEE :: Examples :: @EJB Injection 10.1.6-SNAPSHOT  SUCCESS [  0.113 s]
[INFO] TomEE :: Examples :: @PersistenceContext EntityManager Injection 10.1.6-SNAPSHOT SUCCESS [  0.118 s]
[INFO] TomEE :: Examples :: @Resource env-entry Injection 10.1.6-SNAPSHOT SUCCESS [  0.165 s]
[INFO] TomEE :: Examples :: Interceptors 10.1.6-SNAPSHOT .. SUCCESS [  0.253 s]
[INFO] TomEE :: Examples :: JakartaMail API 10.1.6-SNAPSHOT SUCCESS [  0.810 s]
[INFO] TomEE :: Examples :: Jakarta Mail API with Velocity 10.1.6-SNAPSHOT SUCCESS [  1.007 s]
[INFO] TomEE :: Web Examples :: Java Modules (Simple REST resource) 10.1.6-SNAPSHOT SUCCESS [  1.873 s]
[INFO] TomEE :: Examples :: JAXRS Filter 10.1.6-SNAPSHOT .. SUCCESS [  0.283 s]
[INFO] TomEE :: Examples :: JAXRS JSON Provider with Jettison 10.1.6-SNAPSHOT SUCCESS [  0.516 s]
[INFO] TomEE :: Examples :: JPA with EclipseLink 10.1.6-SNAPSHOT SUCCESS [  0.498 s]
[INFO] TomEE :: Utils :: Core Hibernate 10.1.6-SNAPSHOT ... SUCCESS [  1.683 s]
[INFO] TomEE :: Examples :: JPA with Hibernate 10.1.6-SNAPSHOT SUCCESS [  0.326 s]
[INFO] TomEE :: Examples :: JPA with Hibernate and arquillian 10.1.6-SNAPSHOT SUCCESS [  0.196 s]
[INFO] TomEE :: Examples :: JPA @Enumerated 10.1.6-SNAPSHOT SUCCESS [  0.177 s]
[INFO] TomEE :: Web Examples :: JSF - CDI and EJB 10.1.6-SNAPSHOT SUCCESS [  0.119 s]
[INFO] TomEE :: Examples :: JUnit 5 :: Application Composer 10.1.6-SNAPSHOT SUCCESS [  0.647 s]
[INFO] TomEE :: Examples :: JUnit 5 :: Multiple TomEE with Arquillian 10.1.6-SNAPSHOT SUCCESS [  0.093 s]
[INFO] TomEE :: Examples :: JUnit 5 :: Simple Websockets with Arquillian 10.1.6-SNAPSHOT SUCCESS [  0.790 s]
[INFO] TomEE :: Examples :: @EJB Lookup 10.1.6-SNAPSHOT ... SUCCESS [  0.116 s]
[INFO] TomEE :: Examples :: EJB Lookup with descriptor 10.1.6-SNAPSHOT SUCCESS [  0.115 s]
[INFO] TomEE :: Examples :: Movies Complete (Meta) 10.1.6-SNAPSHOT SUCCESS [  0.132 s]
[INFO] TomEE :: Examples :: Movies Complete 10.1.6-SNAPSHOT SUCCESS [  0.133 s]
[INFO] TomEE :: Examples :: MicroProfile Config 10.1.6-SNAPSHOT SUCCESS [  0.255 s]
[INFO] TomEE :: Examples :: MicroProfile Config Source Database 10.1.6-SNAPSHOT SUCCESS [  0.793 s]
[INFO] TomEE :: Examples :: Microprofile Fault Tolerance :: Fallback 10.1.6-SNAPSHOT SUCCESS [  0.174 s]
[INFO] TomEE :: Examples :: Microprofile Fault Tolerance :: Retry 10.1.6-SNAPSHOT SUCCESS [  0.316 s]
[INFO] TomEE :: Examples :: Microprofile Fault Tolerance :: Timeout 10.1.6-SNAPSHOT SUCCESS [  0.146 s]
[INFO] TomEE :: Examples :: MicroProfile JWT Bean Validation 10.1.6-SNAPSHOT SUCCESS [  0.527 s]
[INFO] TomEE :: Examples :: MicroProfile JWT Bean Validation, Strongly-typed Annotations 10.1.6-SNAPSHOT SUCCESS [  0.243 s]
[INFO] TomEE :: Examples :: Microprofile Metrics Counted 10.1.6-SNAPSHOT SUCCESS [  0.300 s]
[INFO] TomEE :: Examples :: Microprofile Metrics Histogram 10.1.6-SNAPSHOT SUCCESS [  0.256 s]
[INFO] TomEE :: Examples :: Microprofile Metrics Timed 10.1.6-SNAPSHOT SUCCESS [  0.244 s]
[INFO] TomEE :: Examples :: MicroProfile Metrics Gauge 10.1.6-SNAPSHOT SUCCESS [  0.174 s]
[INFO] TomEE :: Examples :: MicroProfile Metrics Metered 10.1.6-SNAPSHOT SUCCESS [  0.045 s]
[INFO] TomEE :: Examples :: MP REST JWT JWK 10.1.6-SNAPSHOT SUCCESS [  0.270 s]
[INFO] TomEE :: Examples :: MP REST JWT PRINCIPAL 10.1.6-SNAPSHOT SUCCESS [  0.222 s]
[INFO] TomEE :: Examples :: MP REST JWT Public Key 10.1.6-SNAPSHOT SUCCESS [  0.231 s]
[INFO] TomEE :: Examples :: Microprofile REST Client 10.1.6-SNAPSHOT SUCCESS [  0.191 s]
[INFO] TomEE :: Examples :: Custom HealthCheck 10.1.6-SNAPSHOT SUCCESS [  0.180 s]
[INFO] TomEE :: Examples :: Microprofile OpenAPI Reader 10.1.6-SNAPSHOT SUCCESS [  0.712 s]
[INFO] TomEE :: Examples :: MTOM 10.1.6-SNAPSHOT .......... SUCCESS [  0.721 s]
[INFO] TomEE :: Examples :: Multiple JPA providers 10.1.6-SNAPSHOT SUCCESS [  0.339 s]
[INFO] TomEE :: Examples :: Multiple Arquillian Adapters 10.1.6-SNAPSHOT SUCCESS [  0.319 s]
[INFO] TomEE :: Examples :: Multiple TomEE with Arquillian 10.1.6-SNAPSHOT SUCCESS [  0.106 s]
[INFO] TomEE :: Examples :: Persistence Fragment 10.1.6-SNAPSHOT SUCCESS [  0.176 s]
[INFO] TomEE :: Web Examples :: Pojo WS 10.1.6-SNAPSHOT ... SUCCESS [  0.057 s]
[INFO] TomEE :: Examples :: Quartz 10.1.6-SNAPSHOT ........ SUCCESS [  0.004 s]
[INFO] TomEE :: Examples :: Quartz :: Quartz Resource Adapter 10.1.6-SNAPSHOT SUCCESS [  0.584 s]
[INFO] TomEE :: Examples :: Quartz :: Quartz Beans 10.1.6-SNAPSHOT SUCCESS [  0.403 s]
[INFO] TomEE :: Examples :: DataSource Realm 10.1.6-SNAPSHOT SUCCESS [  0.022 s]
[INFO] TomEE :: Examples :: Reloadable Persistence Unit Properties 10.1.6-SNAPSHOT SUCCESS [  0.168 s]
[INFO] TomEE :: Web Examples :: Resource Declared In A Webapp 10.1.6-SNAPSHOT SUCCESS [  0.067 s]
[INFO] TomEE :: Examples :: REST, Mockito and Application Composer 10.1.6-SNAPSHOT SUCCESS [  0.191 s]
[INFO] TomEE :: Examples :: REST and Application Composer 10.1.6-SNAPSHOT SUCCESS [  0.155 s]
[INFO] TomEE :: Examples :: REST CDI 10.1.6-SNAPSHOT ...... SUCCESS [  0.146 s]
[INFO] TomEE :: Examples :: JAXRS and JAAS 10.1.6-SNAPSHOT  SUCCESS [  0.053 s]
[INFO] TomEE :: Examples :: REST and EJB 10.1.6-SNAPSHOT .. SUCCESS [  0.339 s]
[INFO] TomEE :: Web Examples :: REST Example 10.1.6-SNAPSHOT SUCCESS [  2.784 s]
[INFO] TomEE :: Web Examples :: REST Example With Application 10.1.6-SNAPSHOT SUCCESS [  0.542 s]
[INFO] TomEE :: Examples :: REST XML JSON 10.1.6-SNAPSHOT . SUCCESS [  0.164 s]
[INFO] TomEE :: Examples :: Basic Scala 10.1.6-SNAPSHOT ... SUCCESS [ 20.971 s]
[INFO] TomEE :: Examples :: ScheduleExpression 10.1.6-SNAPSHOT SUCCESS [  0.192 s]
[INFO] TomEE :: Examples :: @Schedule Events 10.1.6-SNAPSHOT SUCCESS [  0.223 s]
[INFO] TomEE :: Examples :: @Schedule Methods (Meta) 10.1.6-SNAPSHOT SUCCESS [  0.159 s]
[INFO] TomEE :: Examples :: @Schedule Methods 10.1.6-SNAPSHOT SUCCESS [  0.122 s]
[INFO] TomEE :: Examples :: Server Events 10.1.6-SNAPSHOT . SUCCESS [  0.211 s]
[INFO] TomEE :: Examples :: Serverless Builder 10.1.6-SNAPSHOT SUCCESS [  0.316 s]
[INFO] TomEE :: Examples :: Serverless Apache TomEE WebProfile 10.1.6-SNAPSHOT SUCCESS [  0.362 s]
[INFO] TomEE :: Examples :: Serverless Apache TomEE MicroProfile 10.1.6-SNAPSHOT SUCCESS [  0.450 s]
[INFO] TomEE :: Examples :: Serverless Apache TomEE Plume 10.1.6-SNAPSHOT SUCCESS [  0.510 s]
[INFO] TomEE :: Examples :: Serverless Apache TomEE Plus 10.1.6-SNAPSHOT SUCCESS [  0.568 s]
[INFO] TomEE :: Examples ::  Singleton startup ordering 10.1.6-SNAPSHOT SUCCESS [  0.161 s]
[INFO] TomEE :: Examples :: Simple CDI Interceptor 10.1.6-SNAPSHOT SUCCESS [  0.120 s]
[INFO] TomEE :: Examples :: Simple EAR 10.1.6-SNAPSHOT .... SUCCESS [  0.002 s]
[INFO] TomEE :: Examples :: Simple EAR :: Business Model 10.1.6-SNAPSHOT SUCCESS [  0.042 s]
[INFO] TomEE :: Examples :: Simple EAR :: Business Logic 10.1.6-SNAPSHOT SUCCESS [  0.107 s]
[INFO] TomEE :: Examples :: Simple EAR :: Webapp 10.1.6-SNAPSHOT SUCCESS [  1.683 s]
[INFO] TomEE :: Examples :: Simple EAR :: EAR Packaging 10.1.6-SNAPSHOT SUCCESS [  0.044 s]
[INFO] TomEE :: Examples :: Simple EAR :: Functional Tests 10.1.6-SNAPSHOT SUCCESS [  0.330 s]
[INFO] TomEE :: Examples :: Simple CMP2 Entity 10.1.6-SNAPSHOT SUCCESS [  0.219 s]
[INFO] TomEE :: Examples :: Simple JMS 10.1.6-SNAPSHOT .... SUCCESS [  0.547 s]
[INFO] TomEE :: Examples :: Simple JMS Context 10.1.6-SNAPSHOT SUCCESS [  0.464 s]
[INFO] TomEE :: Examples :: Simple MDB With a CDI Injection 10.1.6-SNAPSHOT SUCCESS [  0.250 s]
[INFO] TomEE :: Examples :: Simple MDB Example 10.1.6-SNAPSHOT SUCCESS [  0.327 s]
[INFO] TomEE :: Examples :: Simple MDB Using Deployment Descriptor Example 10.1.6-SNAPSHOT SUCCESS [  0.414 s]
[INFO] TomEE :: Examples :: Simple Remote tomcat-users.xml 10.1.6-SNAPSHOT SUCCESS [  0.117 s]
[INFO] TomEE :: Examples :: Simple REST 10.1.6-SNAPSHOT ... SUCCESS [  0.130 s]
[INFO] TomEE :: Examples :: Simple Singleton 10.1.6-SNAPSHOT SUCCESS [  0.120 s]
[INFO] TomEE :: Examples :: Simple Stateful Pojo 10.1.6-SNAPSHOT SUCCESS [  0.109 s]
[INFO] TomEE :: Examples :: Simple Stateful Pojo Callbacks 10.1.6-SNAPSHOT SUCCESS [  0.128 s]
[INFO] TomEE :: Examples :: Simple Stateless Pojo 10.1.6-SNAPSHOT SUCCESS [  0.111 s]
[INFO] TomEE :: Examples :: Simple Stateless Pojo Callbacks 10.1.6-SNAPSHOT SUCCESS [  0.146 s]
[INFO] TomEE :: Examples :: Simple Stateless With Deployment Descriptor 10.1.6-SNAPSHOT SUCCESS [  0.148 s]
[INFO] TomEE :: Examples :: Simple Webservice 10.1.6-SNAPSHOT SUCCESS [  0.630 s]
[INFO] TomEE :: Examples :: Simple Webservice Without Interface 10.1.6-SNAPSHOT SUCCESS [  0.252 s]
[INFO] TomEE :: Examples :: Async Servlet 10.1.6-SNAPSHOT . SUCCESS [  0.171 s]
[INFO] TomEE :: Web Examples :: Struts 10.1.6-SNAPSHOT .... SUCCESS [  1.694 s]
[INFO] TomEE :: Examples :: Telephone Stateful Pojo 10.1.6-SNAPSHOT SUCCESS [  0.159 s]
[INFO] TomEE :: Examples :: TestCase Injection 10.1.6-SNAPSHOT SUCCESS [  0.128 s]
[INFO] TomEE :: Examples :: Testing Security (Meta) 10.1.6-SNAPSHOT SUCCESS [  0.173 s]
[INFO] TomEE :: Examples :: Testing Security 10.1.6-SNAPSHOT SUCCESS [  0.140 s]
[INFO] TomEE :: Examples :: Testing Security 10.1.6-SNAPSHOT SUCCESS [  0.139 s]
[INFO] TomEE :: Examples :: Testing Security Service Provider 10.1.6-SNAPSHOT SUCCESS [  0.168 s]
[INFO] TomEE :: Examples :: Testing Security Script Service Provider 10.1.6-SNAPSHOT SUCCESS [  0.219 s]
[INFO] TomEE :: Examples :: Testing Transactions 10.1.6-SNAPSHOT SUCCESS [  0.151 s]
[INFO] TomEE :: Examples :: Testing Transactions BMT 10.1.6-SNAPSHOT SUCCESS [  0.122 s]
[INFO] TomEE :: TomEE :: IBM MQ AMQ Portability Examples :: MDB Example 1.0 SUCCESS [  0.645 s]
[INFO] TomEE :: Examples :: Transaction Rollback 10.1.6-SNAPSHOT SUCCESS [  0.147 s]
[INFO] TomEE :: Examples :: Troubleshooting 10.1.6-SNAPSHOT SUCCESS [  0.179 s]
[INFO] TomEE :: Examples :: Webservice Attachments 10.1.6-SNAPSHOT SUCCESS [  0.295 s]
[INFO] TomEE :: Examples :: Webservice Inheritance 10.1.6-SNAPSHOT SUCCESS [  0.267 s]
[INFO] TomEE :: Web Examples :: EJB WebService with Security 10.1.6-SNAPSHOT SUCCESS [  0.241 s]
[INFO] TomEE :: Web Examples :: EJB WebService with SSL Client Certificate 10.1.6-SNAPSHOT SUCCESS [  3.524 s]
[INFO] TomEE :: Web Examples :: EJB WebService with WS-Security 10.1.6-SNAPSHOT SUCCESS [  3.823 s]
[INFO] TomEE :: Web Examples :: EJB WebService WS Security with resources.xml 10.1.6-SNAPSHOT SUCCESS [  0.497 s]
[INFO] TomEE :: Examples :: Web Service Handlers 10.1.6-SNAPSHOT SUCCESS [  0.258 s]
[INFO] TomEE :: Examples :: @WebService Holder 10.1.6-SNAPSHOT SUCCESS [  0.242 s]
[INFO] TomEE :: Web Examples :: Moviefun 10.1.6-SNAPSHOT .. SUCCESS [  0.596 s]
[INFO] TomEE :: Web Examples :: Moviefun Rest 10.1.6-SNAPSHOT SUCCESS [  3.833 s]
[INFO] TomEE :: Examples :: Resources/JMX Example 10.1.6-SNAPSHOT SUCCESS [  0.027 s]
[INFO] TomEE :: Examples :: Resources/JMX Example :: EJB Module 10.1.6-SNAPSHOT FAILURE [  1.775 s]
[INFO] TomEE :: Examples :: Resources/JMX Example :: EAR Module 10.1.6-SNAPSHOT SKIPPED
[INFO] TomEE :: Examples :: WebSocket with tls and basic auth Example 10.1.6-SNAPSHOT SKIPPED
[INFO] TomEE :: Examples :: Concurrency utilities example 10.1.6-SNAPSHOT SKIPPED
[INFO] TomEE :: Examples :: Microprofile JSONB Configuration 10.1.6-SNAPSHOT SKIPPED
[INFO] TomEE :: Examples :: Microprofile JSONB Custom Serializer/Deserializer 10.1.6-SNAPSHOT SKIPPED
[INFO] TomEE :: Examples :: Azure deployment example 10.1.6-SNAPSHOT SKIPPED
[INFO] TomEE :: Examples :: XA Datasource configuration and usage 10.1.6-SNAPSHOT SKIPPED
[INFO] TomEE :: Examples :: Websocket JMS 10.1.6-SNAPSHOT . SKIPPED
[INFO] TomEE :: Web Examples :: Multi-Broker 10.1.6-SNAPSHOT SKIPPED
[INFO] TomEE :: Examples :: Jakarta Security tomcat-user.xml Identity Store 10.1.6-SNAPSHOT SKIPPED
[INFO] TomEE :: Examples :: Jakarta Security custom Identity Store 10.1.6-SNAPSHOT SKIPPED
[INFO] TomEE :: Examples :: Jakarta Security OpenID Connect 10.1.6-SNAPSHOT SKIPPED
[INFO] TomEE :: Examples 10.1.6-SNAPSHOT .................. SKIPPED
[INFO] TomEE :: Assembly :: All In One EJB Lite jar 10.1.6-SNAPSHOT SKIPPED
[INFO] TomEE :: Utils :: TomEE Webapps-based Deployer EJB 10.1.6-SNAPSHOT SKIPPED
[INFO] TomEE :: TCK 10.1.6-SNAPSHOT ....................... SKIPPED
[INFO] TomEE :: TCK :: Common 10.1.6-SNAPSHOT ............. SKIPPED
[INFO] TomEE :: TCK :: CDI Embedded 10.1.6-SNAPSHOT ....... SKIPPED
[INFO] TomEE :: TCK :: CDI TomEE 10.1.6-SNAPSHOT .......... SKIPPED
[INFO] TomEE :: TCK :: CDI TCK Signature Tests 10.1.6-SNAPSHOT SKIPPED
[INFO] TomEE :: TCK :: Bean Validation Embedded 10.1.6-SNAPSHOT SKIPPED
[INFO] TomEE :: TCK :: Bean Validation TomEE 10.1.6-SNAPSHOT SKIPPED
[INFO] TomEE :: TCK :: Bean Validation TCK Signature tests 10.1.6-SNAPSHOT SKIPPED
[INFO] TomEE :: TCK :: JSON-P Standalone 10.1.6-SNAPSHOT .. SKIPPED
[INFO] TomEE :: TCK :: JSON-P Signature Tests 10.1.6-SNAPSHOT SKIPPED
[INFO] TomEE :: TCK :: JSON-B Standalone 10.1.6-SNAPSHOT .. SKIPPED
[INFO] TomEE :: TCK :: JSON-B Signature Tests 10.1.6-SNAPSHOT SKIPPED
[INFO] TomEE :: TCK :: Concurrency Standalone 10.1.6-SNAPSHOT SKIPPED
[INFO] TomEE :: TCK :: Concurrency Signature Tests 10.1.6-SNAPSHOT SKIPPED
[INFO] TomEE :: TCK :: MicroProfile 10.1.6-SNAPSHOT ....... SKIPPED
[INFO] TomEE :: TCK :: MicroProfile Config TCK 10.1.6-SNAPSHOT SKIPPED
[INFO] TomEE :: TCK :: MicroProfile JWT TCK 10.1.6-SNAPSHOT SKIPPED
[INFO] TomEE :: TCK :: MicroProfile Health TCK 10.1.6-SNAPSHOT SKIPPED
[INFO] TomEE :: TCK :: MicroProfile Metrics TCK 10.1.6-SNAPSHOT SKIPPED
[INFO] TomEE :: TCK :: MicroProfile Rest Client TCK 10.1.6-SNAPSHOT SKIPPED
[INFO] TomEE :: TCK :: MicroProfile Open API TCK 10.1.6-SNAPSHOT SKIPPED
[INFO] TomEE :: TCK :: MicroProfile Fault Tolerance TCK 10.1.6-SNAPSHOT SKIPPED
[INFO] TomEE :: TCK :: MicroProfile Open Telemetry TCK 10.1.6-SNAPSHOT SKIPPED
[INFO] TomEE :: TCK :: JAX-RS TCK 10.1.6-SNAPSHOT ......... SKIPPED
[INFO] TomEE :: TCK :: JAX-RS TCK :: Tests 10.1.6-SNAPSHOT  SKIPPED
[INFO] TomEE :: TCK :: JAX-RS TCK :: Tests Embedded 10.1.6-SNAPSHOT SKIPPED
[INFO] TomEE :: TCK :: JAX-RS TCK :: Signature Test 10.1.6-SNAPSHOT SKIPPED
[INFO] TomEE :: Arquillian Adaptors Parent :: Tests 10.1.6-SNAPSHOT SKIPPED
[INFO] TomEE :: Arquillian Adaptors Parent :: Tests :: Web Profile 10.1.6-SNAPSHOT SKIPPED
[INFO] TomEE :: Arquillian Adaptors Parent :: Tests :: JAXRS 10.1.6-SNAPSHOT SKIPPED
[INFO] TomEE :: Arquillian Adaptors Parent :: Tests :: JAXWS 10.1.6-SNAPSHOT SKIPPED
[INFO] TomEE :: Arquillian Adaptors Parent :: Tests :: JMS 10.1.6-SNAPSHOT SKIPPED
[INFO] TomEE :: Arquillian Adaptors Parent :: Tests :: Configuration Tests 10.1.6-SNAPSHOT SKIPPED
[INFO] TomEE :: Arquillian Adaptors Parent :: Sample :: Moviefun 10.1.6-SNAPSHOT SKIPPED
[INFO] TomEE :: Arquillian Adaptors Parent :: Arquillian TCK 10.1.6-SNAPSHOT SKIPPED
[INFO] TomEE :: Arquillian :: Functional Tests 10.1.6-SNAPSHOT SKIPPED
[INFO] TomEE :: Arquillian :: Functional Tests :: Spring CXF Test 10.1.6-SNAPSHOT SKIPPED
[INFO] TomEE :: Utils :: Provisionning 10.1.6-SNAPSHOT .... SKIPPED
[INFO] TomEE :: Utils :: Log4j2 10.1.6-SNAPSHOT ........... SKIPPED
[INFO] TomEE :: TomEE :: webaccess 10.1.6-SNAPSHOT ........ SKIPPED
[INFO] TomEE :: TomEE :: Overlay Runner 10.1.6-SNAPSHOT ... SKIPPED
[INFO] ------------------------------------------------------------------------
[INFO] BUILD FAILURE
[INFO] ------------------------------------------------------------------------
[INFO] Total time:  09:57 min
[INFO] Finished at: 2026-05-12T10:40:53Z
[INFO] ------------------------------------------------------------------------
[WARNING] 
[WARNING] Plugin validation issues were detected in 13 plugin(s)
[WARNING] 
[WARNING]  * org.apache.maven.plugins:maven-jar-plugin:3.0.2
[WARNING]  * org.apache.maven.plugins:maven-compiler-plugin:3.14.1
[WARNING]  * org.apache.maven.plugins:maven-compiler-plugin:3.10.1
[WARNING]  * org.scalatest:scalatest-maven-plugin:2.2.0
[WARNING]  * org.apache.maven.plugins:maven-resources-plugin:3.3.0
[WARNING]  * org.apache.openjpa:openjpa-maven-plugin:4.1.1
[WARNING]  * org.apache.maven.plugins:maven-surefire-plugin:3.5.3
[WARNING]  * org.apache.maven.plugins:maven-war-plugin:3.3.2
[WARNING]  * org.apache.maven.plugins:maven-assembly-plugin:2.4.1
[WARNING]  * com.googlecode.jslint4java:jslint4java-maven-plugin:2.0.5
[WARNING]  * org.apache.tomee.patch:tomee-patch-plugin:0.10
[WARNING]  * org.apache.felix:maven-bundle-plugin:6.0.2
[WARNING]  * org.apache.maven.plugins:maven-install-plugin:3.0.0-M1
[WARNING] 
[WARNING] For more or less details, use 'maven.plugin.validation' property with one of the values (case insensitive): [BRIEF, DEFAULT, VERBOSE]
[WARNING] 
[ERROR] Failed to execute goal on project resources-jmx-ejb: Could not resolve dependencies for project org.superbiz:resources-jmx-ejb:ejb:10.1.6-SNAPSHOT: The following artifacts could not be resolved: org.apache.tomee:arquillian-tomee-remote:jar:10.1.5-SNAPSHOT (absent), org.apache.tomee:openejb-provisionning:jar:10.1.5-SNAPSHOT (absent), org.apache.tomee:ziplock:jar:10.1.5-SNAPSHOT (absent): Could not find artifact org.apache.tomee:arquillian-tomee-remote:jar:10.1.5-SNAPSHOT in apache-m2-snapshot (https://repository.apache.org/snapshots) -> [Help 1]
[ERROR] 
[ERROR] To see the full stack trace of the errors, re-run Maven with the -e switch.
[ERROR] Re-run Maven using the -X switch to enable full debug logging.
[ERROR] 
[ERROR] For more information about the errors and possible solutions, please read the following articles:
[ERROR] [Help 1] http://cwiki.apache.org/confluence/display/MAVEN/DependencyResolutionException
[ERROR] 
[ERROR] After correcting the problems, you can resume the build with the command
[ERROR]   mvn <args> -rf :resources-jmx-ejb
Build step 'Execute shell' marked build as failure
INFO: Processing JUnit
INFO: [JUnit] - No test report file(s) were found with the pattern '**/target/surefire-reports/TEST-*.xml' relative to '<https://ci-builds.apache.org/job/Tomee/job/tomee-10-build-full-tck/ws/'> for the testing framework 'JUnit'.
Did you enter a pattern relative to (and within) the workspace directory?
Did you generate the result report(s) for 'JUnit'?"
WARNING: All test reports are empty.
[Checks API] No suitable checks publisher found.
INFO: Setting the build status to SUCCESS

Build failed in Jenkins: TomEE » tomee-10-build-full-tck #69

Posted by Apache Jenkins Server <je...@builds.apache.org>.
See <https://ci-builds.apache.org/job/Tomee/job/tomee-10-build-full-tck/69/display/redirect?page=changes>

Changes:

[github] Minor: Regenerated BOMs for b265da5a995218900ee6743f4f2bf8ab90fc7f60 (#2661)


------------------------------------------
[...truncated 1.10 MiB...]
[INFO] TomEE :: Connector Examples :: Connector in EAR :: Connector Impl 10.1.6-SNAPSHOT SUCCESS [  0.301 s]
[INFO] TomEE :: Connector Examples :: Connector in EAR :: RAR Packaging 10.1.6-SNAPSHOT SUCCESS [  0.371 s]
[INFO] TomEE :: Connector Examples :: Connector in EAR :: Sample WAR 10.1.6-SNAPSHOT SUCCESS [  0.410 s]
[INFO] TomEE :: Connector Examples :: Connector in EAR :: EAR Packaging 10.1.6-SNAPSHOT SUCCESS [  0.261 s]
[INFO] TomEE :: Connector Examples :: Connector in EAR :: Functional Tests 10.1.6-SNAPSHOT SUCCESS [  0.395 s]
[INFO] TomEE :: Connector Examples :: Connector in WAR 10.1.6-SNAPSHOT SUCCESS [  0.439 s]
[INFO] TomEE :: Examples :: Cucumber JVM 10.1.6-SNAPSHOT .. SUCCESS [  0.291 s]
[INFO] TomEE :: Examples :: Expanded support for Env Entries 10.1.6-SNAPSHOT SUCCESS [  0.211 s]
[INFO] TomEE :: Examples :: Datasource Ciphered Password 10.1.6-SNAPSHOT SUCCESS [  0.184 s]
[INFO] TomEE :: Examples :: Datasource Definition 10.1.6-SNAPSHOT SUCCESS [  0.275 s]
[INFO] TomEE :: Examples :: Datasource Versioning 10.1.6-SNAPSHOT SUCCESS [  0.521 s]
[INFO] TomEE :: Examples :: Decorators 10.1.6-SNAPSHOT .... SUCCESS [  0.220 s]
[INFO] TomEE :: Examples :: Dynamic DAO Implementation 10.1.6-SNAPSHOT SUCCESS [  0.218 s]
[INFO] TomEE :: Examples :: Dynamic Datasource Routing 10.1.6-SNAPSHOT SUCCESS [  0.265 s]
[INFO] TomEE :: Examples :: Dynamic Implementation 10.1.6-SNAPSHOT SUCCESS [  0.193 s]
[INFO] TomEE :: Examples :: Dynamic MBean Proxy 10.1.6-SNAPSHOT SUCCESS [  0.204 s]
[INFO] TomEE :: Examples :: Ear Testing 10.1.6-SNAPSHOT ... SUCCESS [  0.004 s]
[INFO] TomEE :: Examples :: Ear Testing :: Business Model 10.1.6-SNAPSHOT SUCCESS [  0.049 s]
[INFO] TomEE :: Examples :: Ear Testing :: Business Logic 10.1.6-SNAPSHOT SUCCESS [  0.151 s]
[INFO] TomEE :: Web Examples :: EJB Examples War 10.1.6-SNAPSHOT SUCCESS [  0.182 s]
[INFO] TomEE :: Web Examples :: EJB Remote Call 10.1.6-SNAPSHOT SUCCESS [  0.140 s]
[INFO] TomEE :: Web Examples :: EJB Remote Call 10.1.6-SNAPSHOT SUCCESS [  0.140 s]
[INFO] TomEE :: Web Examples :: EJB WebService 10.1.6-SNAPSHOT SUCCESS [  0.071 s]
[INFO] TomEE :: Arquillian Adaptors Parent :: OpenEJB Container 10.1.6-SNAPSHOT SUCCESS [  1.218 s]
[INFO] TomEE :: Examples :: Groovy CDI 10.1.6-SNAPSHOT .... SUCCESS [  0.883 s]
[INFO] TomEE :: Examples :: Groovy JPA 10.1.6-SNAPSHOT .... SUCCESS [  0.788 s]
[INFO] TomEE :: Examples :: Hello World - Weblogic 10.1.6-SNAPSHOT SUCCESS [  0.185 s]
[INFO] TomEE :: Examples :: @Resource jakarta.jms.ConnectionFactory 10.1.6-SNAPSHOT SUCCESS [  0.414 s]
[INFO] TomEE :: Examples :: @Resource DataSource Injection 10.1.6-SNAPSHOT SUCCESS [  0.203 s]
[INFO] TomEE :: Examples :: @EJB Injection 10.1.6-SNAPSHOT  SUCCESS [  0.196 s]
[INFO] TomEE :: Examples :: @PersistenceContext EntityManager Injection 10.1.6-SNAPSHOT SUCCESS [  0.163 s]
[INFO] TomEE :: Examples :: @Resource env-entry Injection 10.1.6-SNAPSHOT SUCCESS [  0.269 s]
[INFO] TomEE :: Examples :: Interceptors 10.1.6-SNAPSHOT .. SUCCESS [  0.258 s]
[INFO] TomEE :: Examples :: JakartaMail API 10.1.6-SNAPSHOT SUCCESS [  0.445 s]
[INFO] TomEE :: Examples :: Jakarta Mail API with Velocity 10.1.6-SNAPSHOT SUCCESS [  1.134 s]
[INFO] TomEE :: Web Examples :: Java Modules (Simple REST resource) 10.1.6-SNAPSHOT SUCCESS [  1.076 s]
[INFO] TomEE :: Examples :: JAXRS Filter 10.1.6-SNAPSHOT .. SUCCESS [  0.433 s]
[INFO] TomEE :: Examples :: JAXRS JSON Provider with Jettison 10.1.6-SNAPSHOT SUCCESS [  0.506 s]
[INFO] TomEE :: Examples :: JPA with EclipseLink 10.1.6-SNAPSHOT SUCCESS [  0.191 s]
[INFO] TomEE :: Utils :: Core Hibernate 10.1.6-SNAPSHOT ... SUCCESS [  0.087 s]
[INFO] TomEE :: Examples :: JPA with Hibernate 10.1.6-SNAPSHOT SUCCESS [  0.472 s]
[INFO] TomEE :: Examples :: JPA with Hibernate and arquillian 10.1.6-SNAPSHOT SUCCESS [  0.280 s]
[INFO] TomEE :: Examples :: JPA @Enumerated 10.1.6-SNAPSHOT SUCCESS [  0.212 s]
[INFO] TomEE :: Web Examples :: JSF - CDI and EJB 10.1.6-SNAPSHOT SUCCESS [  0.105 s]
[INFO] TomEE :: Examples :: JUnit 5 :: Application Composer 10.1.6-SNAPSHOT SUCCESS [  0.191 s]
[INFO] TomEE :: Examples :: JUnit 5 :: Multiple TomEE with Arquillian 10.1.6-SNAPSHOT SUCCESS [  0.167 s]
[INFO] TomEE :: Examples :: JUnit 5 :: Simple Websockets with Arquillian 10.1.6-SNAPSHOT SUCCESS [  0.216 s]
[INFO] TomEE :: Examples :: @EJB Lookup 10.1.6-SNAPSHOT ... SUCCESS [  0.197 s]
[INFO] TomEE :: Examples :: EJB Lookup with descriptor 10.1.6-SNAPSHOT SUCCESS [  0.227 s]
[INFO] TomEE :: Examples :: Movies Complete (Meta) 10.1.6-SNAPSHOT SUCCESS [  0.447 s]
[INFO] TomEE :: Examples :: Movies Complete 10.1.6-SNAPSHOT SUCCESS [  0.445 s]
[INFO] TomEE :: Examples :: MicroProfile Config 10.1.6-SNAPSHOT SUCCESS [  0.268 s]
[INFO] TomEE :: Examples :: MicroProfile Config Source Database 10.1.6-SNAPSHOT SUCCESS [  0.342 s]
[INFO] TomEE :: Examples :: Microprofile Fault Tolerance :: Fallback 10.1.6-SNAPSHOT SUCCESS [  0.240 s]
[INFO] TomEE :: Examples :: Microprofile Fault Tolerance :: Retry 10.1.6-SNAPSHOT SUCCESS [  0.407 s]
[INFO] TomEE :: Examples :: Microprofile Fault Tolerance :: Timeout 10.1.6-SNAPSHOT SUCCESS [  0.222 s]
[INFO] TomEE :: Examples :: MicroProfile JWT Bean Validation 10.1.6-SNAPSHOT SUCCESS [  0.394 s]
[INFO] TomEE :: Examples :: MicroProfile JWT Bean Validation, Strongly-typed Annotations 10.1.6-SNAPSHOT SUCCESS [  0.419 s]
[INFO] TomEE :: Examples :: Microprofile Metrics Counted 10.1.6-SNAPSHOT SUCCESS [  0.260 s]
[INFO] TomEE :: Examples :: Microprofile Metrics Histogram 10.1.6-SNAPSHOT SUCCESS [  0.273 s]
[INFO] TomEE :: Examples :: Microprofile Metrics Timed 10.1.6-SNAPSHOT SUCCESS [  0.238 s]
[INFO] TomEE :: Examples :: MicroProfile Metrics Gauge 10.1.6-SNAPSHOT SUCCESS [  0.284 s]
[INFO] TomEE :: Examples :: MicroProfile Metrics Metered 10.1.6-SNAPSHOT SUCCESS [  0.084 s]
[INFO] TomEE :: Examples :: MP REST JWT JWK 10.1.6-SNAPSHOT SUCCESS [  0.341 s]
[INFO] TomEE :: Examples :: MP REST JWT PRINCIPAL 10.1.6-SNAPSHOT SUCCESS [  0.315 s]
[INFO] TomEE :: Examples :: MP REST JWT Public Key 10.1.6-SNAPSHOT SUCCESS [  0.384 s]
[INFO] TomEE :: Examples :: Microprofile REST Client 10.1.6-SNAPSHOT SUCCESS [  0.278 s]
[INFO] TomEE :: Examples :: Custom HealthCheck 10.1.6-SNAPSHOT SUCCESS [  0.245 s]
[INFO] TomEE :: Examples :: Microprofile OpenAPI Reader 10.1.6-SNAPSHOT SUCCESS [  0.375 s]
[INFO] TomEE :: Examples :: MTOM 10.1.6-SNAPSHOT .......... SUCCESS [  0.665 s]
[INFO] TomEE :: Examples :: Multiple JPA providers 10.1.6-SNAPSHOT SUCCESS [  0.478 s]
[INFO] TomEE :: Examples :: Multiple Arquillian Adapters 10.1.6-SNAPSHOT SUCCESS [  0.452 s]
[INFO] TomEE :: Examples :: Multiple TomEE with Arquillian 10.1.6-SNAPSHOT SUCCESS [  0.196 s]
[INFO] TomEE :: Examples :: Persistence Fragment 10.1.6-SNAPSHOT SUCCESS [  0.181 s]
[INFO] TomEE :: Web Examples :: Pojo WS 10.1.6-SNAPSHOT ... SUCCESS [  0.084 s]
[INFO] TomEE :: Examples :: Quartz 10.1.6-SNAPSHOT ........ SUCCESS [  0.004 s]
[INFO] TomEE :: Examples :: Quartz :: Quartz Resource Adapter 10.1.6-SNAPSHOT SUCCESS [  0.053 s]
[INFO] TomEE :: Examples :: Quartz :: Quartz Beans 10.1.6-SNAPSHOT SUCCESS [  0.656 s]
[INFO] TomEE :: Examples :: DataSource Realm 10.1.6-SNAPSHOT SUCCESS [  0.026 s]
[INFO] TomEE :: Examples :: Reloadable Persistence Unit Properties 10.1.6-SNAPSHOT SUCCESS [  0.201 s]
[INFO] TomEE :: Web Examples :: Resource Declared In A Webapp 10.1.6-SNAPSHOT SUCCESS [  0.110 s]
[INFO] TomEE :: Examples :: REST, Mockito and Application Composer 10.1.6-SNAPSHOT SUCCESS [  0.237 s]
[INFO] TomEE :: Examples :: REST and Application Composer 10.1.6-SNAPSHOT SUCCESS [  0.228 s]
[INFO] TomEE :: Examples :: REST CDI 10.1.6-SNAPSHOT ...... SUCCESS [  0.233 s]
[INFO] TomEE :: Examples :: JAXRS and JAAS 10.1.6-SNAPSHOT  SUCCESS [  0.090 s]
[INFO] TomEE :: Examples :: REST and EJB 10.1.6-SNAPSHOT .. SUCCESS [  0.253 s]
[INFO] TomEE :: Web Examples :: REST Example 10.1.6-SNAPSHOT SUCCESS [  1.238 s]
[INFO] TomEE :: Web Examples :: REST Example With Application 10.1.6-SNAPSHOT SUCCESS [  0.788 s]
[INFO] TomEE :: Examples :: REST XML JSON 10.1.6-SNAPSHOT . SUCCESS [  0.232 s]
[INFO] TomEE :: Examples :: Basic Scala 10.1.6-SNAPSHOT ... SUCCESS [  9.070 s]
[INFO] TomEE :: Examples :: ScheduleExpression 10.1.6-SNAPSHOT SUCCESS [  0.260 s]
[INFO] TomEE :: Examples :: @Schedule Events 10.1.6-SNAPSHOT SUCCESS [  0.211 s]
[INFO] TomEE :: Examples :: @Schedule Methods (Meta) 10.1.6-SNAPSHOT SUCCESS [  0.236 s]
[INFO] TomEE :: Examples :: @Schedule Methods 10.1.6-SNAPSHOT SUCCESS [  0.212 s]
[INFO] TomEE :: Examples :: Server Events 10.1.6-SNAPSHOT . SUCCESS [  0.352 s]
[INFO] TomEE :: Examples :: Serverless Builder 10.1.6-SNAPSHOT SUCCESS [  0.508 s]
[INFO] TomEE :: Examples :: Serverless Apache TomEE WebProfile 10.1.6-SNAPSHOT SUCCESS [  0.582 s]
[INFO] TomEE :: Examples :: Serverless Apache TomEE MicroProfile 10.1.6-SNAPSHOT SUCCESS [  0.708 s]
[INFO] TomEE :: Examples :: Serverless Apache TomEE Plume 10.1.6-SNAPSHOT SUCCESS [  0.869 s]
[INFO] TomEE :: Examples :: Serverless Apache TomEE Plus 10.1.6-SNAPSHOT SUCCESS [  0.960 s]
[INFO] TomEE :: Examples ::  Singleton startup ordering 10.1.6-SNAPSHOT SUCCESS [  0.598 s]
[INFO] TomEE :: Examples :: Simple CDI Interceptor 10.1.6-SNAPSHOT SUCCESS [  0.243 s]
[INFO] TomEE :: Examples :: Simple EAR 10.1.6-SNAPSHOT .... SUCCESS [  0.006 s]
[INFO] TomEE :: Examples :: Simple EAR :: Business Model 10.1.6-SNAPSHOT SUCCESS [  0.121 s]
[INFO] TomEE :: Examples :: Simple EAR :: Business Logic 10.1.6-SNAPSHOT SUCCESS [  0.180 s]
[INFO] TomEE :: Examples :: Simple EAR :: Webapp 10.1.6-SNAPSHOT SUCCESS [  0.169 s]
[INFO] TomEE :: Examples :: Simple EAR :: EAR Packaging 10.1.6-SNAPSHOT SUCCESS [  0.031 s]
[INFO] TomEE :: Examples :: Simple EAR :: Functional Tests 10.1.6-SNAPSHOT SUCCESS [  0.478 s]
[INFO] TomEE :: Examples :: Simple CMP2 Entity 10.1.6-SNAPSHOT SUCCESS [  0.204 s]
[INFO] TomEE :: Examples :: Simple JMS 10.1.6-SNAPSHOT .... SUCCESS [  0.879 s]
[INFO] TomEE :: Examples :: Simple JMS Context 10.1.6-SNAPSHOT SUCCESS [  0.775 s]
[INFO] TomEE :: Examples :: Simple MDB With a CDI Injection 10.1.6-SNAPSHOT SUCCESS [  0.430 s]
[INFO] TomEE :: Examples :: Simple MDB Example 10.1.6-SNAPSHOT SUCCESS [  0.421 s]
[INFO] TomEE :: Examples :: Simple MDB Using Deployment Descriptor Example 10.1.6-SNAPSHOT SUCCESS [  0.485 s]
[INFO] TomEE :: Examples :: Simple Remote tomcat-users.xml 10.1.6-SNAPSHOT SUCCESS [  0.199 s]
[INFO] TomEE :: Examples :: Simple REST 10.1.6-SNAPSHOT ... SUCCESS [  0.221 s]
[INFO] TomEE :: Examples :: Simple Singleton 10.1.6-SNAPSHOT SUCCESS [  0.198 s]
[INFO] TomEE :: Examples :: Simple Stateful Pojo 10.1.6-SNAPSHOT SUCCESS [  0.280 s]
[INFO] TomEE :: Examples :: Simple Stateful Pojo Callbacks 10.1.6-SNAPSHOT SUCCESS [  0.237 s]
[INFO] TomEE :: Examples :: Simple Stateless Pojo 10.1.6-SNAPSHOT SUCCESS [  0.227 s]
[INFO] TomEE :: Examples :: Simple Stateless Pojo Callbacks 10.1.6-SNAPSHOT SUCCESS [  0.202 s]
[INFO] TomEE :: Examples :: Simple Stateless With Deployment Descriptor 10.1.6-SNAPSHOT SUCCESS [  0.183 s]
[INFO] TomEE :: Examples :: Simple Webservice 10.1.6-SNAPSHOT SUCCESS [  0.425 s]
[INFO] TomEE :: Examples :: Simple Webservice Without Interface 10.1.6-SNAPSHOT SUCCESS [  0.451 s]
[INFO] TomEE :: Examples :: Async Servlet 10.1.6-SNAPSHOT . SUCCESS [  0.274 s]
[INFO] TomEE :: Web Examples :: Struts 10.1.6-SNAPSHOT .... SUCCESS [  0.567 s]
[INFO] TomEE :: Examples :: Telephone Stateful Pojo 10.1.6-SNAPSHOT SUCCESS [  0.209 s]
[INFO] TomEE :: Examples :: TestCase Injection 10.1.6-SNAPSHOT SUCCESS [  0.198 s]
[INFO] TomEE :: Examples :: Testing Security (Meta) 10.1.6-SNAPSHOT SUCCESS [  0.214 s]
[INFO] TomEE :: Examples :: Testing Security 10.1.6-SNAPSHOT SUCCESS [  0.203 s]
[INFO] TomEE :: Examples :: Testing Security 10.1.6-SNAPSHOT SUCCESS [  0.206 s]
[INFO] TomEE :: Examples :: Testing Security Service Provider 10.1.6-SNAPSHOT SUCCESS [  0.282 s]
[INFO] TomEE :: Examples :: Testing Security Script Service Provider 10.1.6-SNAPSHOT SUCCESS [  0.388 s]
[INFO] TomEE :: Examples :: Testing Transactions 10.1.6-SNAPSHOT SUCCESS [  0.210 s]
[INFO] TomEE :: Examples :: Testing Transactions BMT 10.1.6-SNAPSHOT SUCCESS [  0.193 s]
[INFO] TomEE :: TomEE :: IBM MQ AMQ Portability Examples :: MDB Example 1.0 SUCCESS [  0.207 s]
[INFO] TomEE :: Examples :: Transaction Rollback 10.1.6-SNAPSHOT SUCCESS [  0.208 s]
[INFO] TomEE :: Examples :: Troubleshooting 10.1.6-SNAPSHOT SUCCESS [  0.195 s]
[INFO] TomEE :: Examples :: Webservice Attachments 10.1.6-SNAPSHOT SUCCESS [  0.331 s]
[INFO] TomEE :: Examples :: Webservice Inheritance 10.1.6-SNAPSHOT SUCCESS [  0.515 s]
[INFO] TomEE :: Web Examples :: EJB WebService with Security 10.1.6-SNAPSHOT SUCCESS [  0.425 s]
[INFO] TomEE :: Web Examples :: EJB WebService with SSL Client Certificate 10.1.6-SNAPSHOT SUCCESS [  4.962 s]
[INFO] TomEE :: Web Examples :: EJB WebService with WS-Security 10.1.6-SNAPSHOT SUCCESS [  4.954 s]
[INFO] TomEE :: Web Examples :: EJB WebService WS Security with resources.xml 10.1.6-SNAPSHOT SUCCESS [  0.776 s]
[INFO] TomEE :: Examples :: Web Service Handlers 10.1.6-SNAPSHOT SUCCESS [  0.466 s]
[INFO] TomEE :: Examples :: @WebService Holder 10.1.6-SNAPSHOT SUCCESS [  0.431 s]
[INFO] TomEE :: Web Examples :: Moviefun 10.1.6-SNAPSHOT .. SUCCESS [  0.720 s]
[INFO] TomEE :: Web Examples :: Moviefun Rest 10.1.6-SNAPSHOT SUCCESS [  1.625 s]
[INFO] TomEE :: Examples :: Resources/JMX Example 10.1.6-SNAPSHOT SUCCESS [  0.046 s]
[INFO] TomEE :: Examples :: Resources/JMX Example :: EJB Module 10.1.6-SNAPSHOT FAILURE [  0.064 s]
[INFO] TomEE :: Examples :: Resources/JMX Example :: EAR Module 10.1.6-SNAPSHOT SKIPPED
[INFO] TomEE :: Examples :: WebSocket with tls and basic auth Example 10.1.6-SNAPSHOT SKIPPED
[INFO] TomEE :: Examples :: Concurrency utilities example 10.1.6-SNAPSHOT SKIPPED
[INFO] TomEE :: Examples :: Microprofile JSONB Configuration 10.1.6-SNAPSHOT SKIPPED
[INFO] TomEE :: Examples :: Microprofile JSONB Custom Serializer/Deserializer 10.1.6-SNAPSHOT SKIPPED
[INFO] TomEE :: Examples :: Azure deployment example 10.1.6-SNAPSHOT SKIPPED
[INFO] TomEE :: Examples :: XA Datasource configuration and usage 10.1.6-SNAPSHOT SKIPPED
[INFO] TomEE :: Examples :: Websocket JMS 10.1.6-SNAPSHOT . SKIPPED
[INFO] TomEE :: Web Examples :: Multi-Broker 10.1.6-SNAPSHOT SKIPPED
[INFO] TomEE :: Examples :: Jakarta Security tomcat-user.xml Identity Store 10.1.6-SNAPSHOT SKIPPED
[INFO] TomEE :: Examples :: Jakarta Security custom Identity Store 10.1.6-SNAPSHOT SKIPPED
[INFO] TomEE :: Examples :: Jakarta Security OpenID Connect 10.1.6-SNAPSHOT SKIPPED
[INFO] TomEE :: Examples 10.1.6-SNAPSHOT .................. SKIPPED
[INFO] TomEE :: Assembly :: All In One EJB Lite jar 10.1.6-SNAPSHOT SKIPPED
[INFO] TomEE :: Utils :: TomEE Webapps-based Deployer EJB 10.1.6-SNAPSHOT SKIPPED
[INFO] TomEE :: TCK 10.1.6-SNAPSHOT ....................... SKIPPED
[INFO] TomEE :: TCK :: Common 10.1.6-SNAPSHOT ............. SKIPPED
[INFO] TomEE :: TCK :: CDI Embedded 10.1.6-SNAPSHOT ....... SKIPPED
[INFO] TomEE :: TCK :: CDI TomEE 10.1.6-SNAPSHOT .......... SKIPPED
[INFO] TomEE :: TCK :: CDI TCK Signature Tests 10.1.6-SNAPSHOT SKIPPED
[INFO] TomEE :: TCK :: Bean Validation Embedded 10.1.6-SNAPSHOT SKIPPED
[INFO] TomEE :: TCK :: Bean Validation TomEE 10.1.6-SNAPSHOT SKIPPED
[INFO] TomEE :: TCK :: Bean Validation TCK Signature tests 10.1.6-SNAPSHOT SKIPPED
[INFO] TomEE :: TCK :: JSON-P Standalone 10.1.6-SNAPSHOT .. SKIPPED
[INFO] TomEE :: TCK :: JSON-P Signature Tests 10.1.6-SNAPSHOT SKIPPED
[INFO] TomEE :: TCK :: JSON-B Standalone 10.1.6-SNAPSHOT .. SKIPPED
[INFO] TomEE :: TCK :: JSON-B Signature Tests 10.1.6-SNAPSHOT SKIPPED
[INFO] TomEE :: TCK :: Concurrency Standalone 10.1.6-SNAPSHOT SKIPPED
[INFO] TomEE :: TCK :: Concurrency Signature Tests 10.1.6-SNAPSHOT SKIPPED
[INFO] TomEE :: TCK :: MicroProfile 10.1.6-SNAPSHOT ....... SKIPPED
[INFO] TomEE :: TCK :: MicroProfile Config TCK 10.1.6-SNAPSHOT SKIPPED
[INFO] TomEE :: TCK :: MicroProfile JWT TCK 10.1.6-SNAPSHOT SKIPPED
[INFO] TomEE :: TCK :: MicroProfile Health TCK 10.1.6-SNAPSHOT SKIPPED
[INFO] TomEE :: TCK :: MicroProfile Metrics TCK 10.1.6-SNAPSHOT SKIPPED
[INFO] TomEE :: TCK :: MicroProfile Rest Client TCK 10.1.6-SNAPSHOT SKIPPED
[INFO] TomEE :: TCK :: MicroProfile Open API TCK 10.1.6-SNAPSHOT SKIPPED
[INFO] TomEE :: TCK :: MicroProfile Fault Tolerance TCK 10.1.6-SNAPSHOT SKIPPED
[INFO] TomEE :: TCK :: MicroProfile Open Telemetry TCK 10.1.6-SNAPSHOT SKIPPED
[INFO] TomEE :: TCK :: JAX-RS TCK 10.1.6-SNAPSHOT ......... SKIPPED
[INFO] TomEE :: TCK :: JAX-RS TCK :: Tests 10.1.6-SNAPSHOT  SKIPPED
[INFO] TomEE :: TCK :: JAX-RS TCK :: Tests Embedded 10.1.6-SNAPSHOT SKIPPED
[INFO] TomEE :: TCK :: JAX-RS TCK :: Signature Test 10.1.6-SNAPSHOT SKIPPED
[INFO] TomEE :: Arquillian Adaptors Parent :: Tests 10.1.6-SNAPSHOT SKIPPED
[INFO] TomEE :: Arquillian Adaptors Parent :: Tests :: Web Profile 10.1.6-SNAPSHOT SKIPPED
[INFO] TomEE :: Arquillian Adaptors Parent :: Tests :: JAXRS 10.1.6-SNAPSHOT SKIPPED
[INFO] TomEE :: Arquillian Adaptors Parent :: Tests :: JAXWS 10.1.6-SNAPSHOT SKIPPED
[INFO] TomEE :: Arquillian Adaptors Parent :: Tests :: JMS 10.1.6-SNAPSHOT SKIPPED
[INFO] TomEE :: Arquillian Adaptors Parent :: Tests :: Configuration Tests 10.1.6-SNAPSHOT SKIPPED
[INFO] TomEE :: Arquillian Adaptors Parent :: Sample :: Moviefun 10.1.6-SNAPSHOT SKIPPED
[INFO] TomEE :: Arquillian Adaptors Parent :: Arquillian TCK 10.1.6-SNAPSHOT SKIPPED
[INFO] TomEE :: Arquillian :: Functional Tests 10.1.6-SNAPSHOT SKIPPED
[INFO] TomEE :: Arquillian :: Functional Tests :: Spring CXF Test 10.1.6-SNAPSHOT SKIPPED
[INFO] TomEE :: Utils :: Provisionning 10.1.6-SNAPSHOT .... SKIPPED
[INFO] TomEE :: Utils :: Log4j2 10.1.6-SNAPSHOT ........... SKIPPED
[INFO] TomEE :: TomEE :: webaccess 10.1.6-SNAPSHOT ........ SKIPPED
[INFO] TomEE :: TomEE :: Overlay Runner 10.1.6-SNAPSHOT ... SKIPPED
[INFO] ------------------------------------------------------------------------
[INFO] BUILD FAILURE
[INFO] ------------------------------------------------------------------------
[INFO] Total time:  08:41 min
[INFO] Finished at: 2026-05-12T10:08:58Z
[INFO] ------------------------------------------------------------------------
[WARNING] 
[WARNING] Plugin validation issues were detected in 13 plugin(s)
[WARNING] 
[WARNING]  * org.apache.maven.plugins:maven-jar-plugin:3.0.2
[WARNING]  * org.apache.maven.plugins:maven-compiler-plugin:3.14.1
[WARNING]  * org.apache.maven.plugins:maven-compiler-plugin:3.10.1
[WARNING]  * org.scalatest:scalatest-maven-plugin:2.2.0
[WARNING]  * org.apache.maven.plugins:maven-resources-plugin:3.3.0
[WARNING]  * org.apache.openjpa:openjpa-maven-plugin:4.1.1
[WARNING]  * org.apache.maven.plugins:maven-surefire-plugin:3.5.3
[WARNING]  * org.apache.maven.plugins:maven-war-plugin:3.3.2
[WARNING]  * org.apache.maven.plugins:maven-assembly-plugin:2.4.1
[WARNING]  * com.googlecode.jslint4java:jslint4java-maven-plugin:2.0.5
[WARNING]  * org.apache.tomee.patch:tomee-patch-plugin:0.10
[WARNING]  * org.apache.felix:maven-bundle-plugin:6.0.2
[WARNING]  * org.apache.maven.plugins:maven-install-plugin:3.0.0-M1
[WARNING] 
[WARNING] For more or less details, use 'maven.plugin.validation' property with one of the values (case insensitive): [BRIEF, DEFAULT, VERBOSE]
[WARNING] 
[ERROR] Failed to execute goal on project resources-jmx-ejb: Could not resolve dependencies for project org.superbiz:resources-jmx-ejb:ejb:10.1.6-SNAPSHOT: The following artifacts could not be resolved: org.apache.tomee:arquillian-tomee-remote:jar:10.1.5-SNAPSHOT (absent), org.apache.tomee:openejb-provisionning:jar:10.1.5-SNAPSHOT (absent), org.apache.tomee:ziplock:jar:10.1.5-SNAPSHOT (absent): org.apache.tomee:arquillian-tomee-remote:jar:10.1.5-SNAPSHOT was not found in https://repository.apache.org/snapshots during a previous attempt. This failure was cached in the local repository and resolution is not reattempted until the update interval of apache-m2-snapshot has elapsed or updates are forced -> [Help 1]
[ERROR] 
[ERROR] To see the full stack trace of the errors, re-run Maven with the -e switch.
[ERROR] Re-run Maven using the -X switch to enable full debug logging.
[ERROR] 
[ERROR] For more information about the errors and possible solutions, please read the following articles:
[ERROR] [Help 1] http://cwiki.apache.org/confluence/display/MAVEN/DependencyResolutionException
[ERROR] 
[ERROR] After correcting the problems, you can resume the build with the command
[ERROR]   mvn <args> -rf :resources-jmx-ejb
Build step 'Execute shell' marked build as failure
INFO: Processing JUnit
INFO: [JUnit] - No test report file(s) were found with the pattern '**/target/surefire-reports/TEST-*.xml' relative to '<https://ci-builds.apache.org/job/Tomee/job/tomee-10-build-full-tck/ws/'> for the testing framework 'JUnit'.
Did you enter a pattern relative to (and within) the workspace directory?
Did you generate the result report(s) for 'JUnit'?"
WARNING: All test reports are empty.
[Checks API] No suitable checks publisher found.
INFO: Setting the build status to SUCCESS