You are viewing a plain text version of this content. The canonical link for it is here.
Posted to builds@solr.apache.org by Policeman Jenkins Server <je...@thetaphi.de> on 2021/03/21 16:33:07 UTC
[JENKINS] Solr-main-MacOSX (64bit/jdk-11.0.6) - Build # 9 -
Unstable!
Build: https://jenkins.thetaphi.de/job/Solr-main-MacOSX/9/
Java: 64bit/jdk-11.0.6 -XX:-UseCompressedOops -XX:+UseConcMarkSweepGC
3 tests failed.
FAILED: org.apache.solr.cloud.DocValuesNotIndexedTest.testGroupingDVOnlySortLast
Error Message:
java.lang.AssertionError: Unexpected number of elements in the group for 'intGSL' size: '4' GroupValue: '397511465' rsp: {responseHeader={zkConnected=true, status=0, QTime=44, params={q=*:*, group.sort=id asc, _stateVer_=dv_coll:13, group.limit=100, rows=100, wt=javabin, version=2, group.field=intGSL, group=true}}, grouped={intGSL={matches=45, groups=[{groupValue=397502102, doclist={numFound=7,numFoundExact=true,start=0,maxScore=1.0,docs=[SolrDocument{id=0, intGSL=397502102, longGSL=3566001668284452664, doubleGSL=6257.121652998122, floatGSL=1176.142, dateGSL=Fri Apr 06 05:59:02 MMT 143208694, stringGSL=base_string_637578__00000614, boolGSL=true, sortableGSL=base_string_468869__00007102, _version_=1694841933436813312, _root_=0}, SolrDocument{id=1, intGSL=397502102, longGSL=3566001668284452664, doubleGSL=6257.121652998122, floatGSL=1176.142, dateGSL=Fri Apr 06 05:59:02 MMT 143208694, stringGSL=base_string_637578__00000614, boolGSL=false, sortableGSL=base_string_468869__00007102, _version_=1694841933438910464, _root_=1}, SolrDocument{id=2, intGSL=397502102, longGSL=3566001668284452664, doubleGSL=6257.121652998122, floatGSL=1176.142, dateGSL=Fri Apr 06 05:59:02 MMT 143208694, stringGSL=base_string_637578__00000614, boolGSL=true, sortableGSL=base_string_468869__00007102, _version_=1694841933436813312, _root_=2}, SolrDocument{id=3, intGSL=397502102, longGSL=3566001668284452664, doubleGSL=6257.121652998122, floatGSL=1176.142, dateGSL=Fri Apr 06 05:59:02 MMT 143208694, stringGSL=base_string_637578__00000614, boolGSL=false, sortableGSL=base_string_468869__00007102, _version_=1694841933439959040, _root_=3}, SolrDocument{id=4, intGSL=397502102, longGSL=3566001668284452664, doubleGSL=6257.121652998122, floatGSL=1176.142, dateGSL=Fri Apr 06 05:59:02 MMT 143208694, stringGSL=base_string_637578__00000614, boolGSL=true, sortableGSL=base_string_468869__00007102, _version_=1694841933439959040, _root_=4}, SolrDocument{id=5, intGSL=397502102, longGSL=3566001668284452664, doubleGSL=6257.121652998122, floatGSL=1176.142, dateGSL=Fri Apr 06 05:59:02 MMT 143208694, stringGSL=base_string_637578__00000614, boolGSL=false, sortableGSL=base_string_468869__00007102, _version_=1694841933439959040, _root_=5}, SolrDocument{id=6, intGSL=397502102, longGSL=3566001668284452664, doubleGSL=6257.121652998122, floatGSL=1176.142, dateGSL=Fri Apr 06 05:59:02 MMT 143208694, stringGSL=base_string_637578__00000614, boolGSL=true, sortableGSL=base_string_468869__00007102, _version_=1694841933439959041, _root_=6}]}}, {groupValue=397511465, doclist={numFound=4,numFoundExact=true,start=0,maxScore=1.0,docs=[SolrDocument{id=12, intGSL=397511465, longGSL=3566001668284457446, doubleGSL=9144.121652998123, floatGSL=10548.142, dateGSL=Fri Apr 06 05:59:07 MMT 143208694, stringGSL=base_string_637578__00007087, boolGSL=true, sortableGSL=base_string_468869__00010744, _version_=1694841933441007617, _root_=12}, SolrDocument{id=7, intGSL=397511465, longGSL=3566001668284457446, doubleGSL=9144.121652998123, floatGSL=10548.142, dateGSL=Fri Apr 06 05:59:07 MMT 143208694, stringGSL=base_string_637578__00007087, boolGSL=false, sortableGSL=base_string_468869__00010744, _version_=1694841933441007616, _root_=7}, SolrDocument{id=8, intGSL=397511465, longGSL=3566001668284457446, doubleGSL=9144.121652998123, floatGSL=10548.142, dateGSL=Fri Apr 06 05:59:07 MMT 143208694, stringGSL=base_string_637578__00007087, boolGSL=true, sortableGSL=base_string_468869__00010744, _version_=1694841933439959040, _root_=8}, SolrDocument{id=9, intGSL=397511465, longGSL=3566001668284457446, doubleGSL=9144.121652998123, floatGSL=10548.142, dateGSL=Fri Apr 06 05:59:07 MMT 143208694, stringGSL=base_string_637578__00007087, boolGSL=false, sortableGSL=base_string_468869__00010744, _version_=1694841933441007617, _root_=9}]}}, {groupValue=null, doclist={numFound=8,numFoundExact=true,start=0,maxScore=1.0,docs=[SolrDocument{id=10000, _version_=1694841933437861888, _root_=10000}, SolrDocument{id=10005, _version_=1694841933441007616, _root_=10005}, SolrDocument{id=10010, _version_=1694841933441007618, _root_=10010}, SolrDocument{id=10025, _version_=1694841933441007620, _root_=10025}, SolrDocument{id=10030, _version_=1694841933442056193, _root_=10030}, SolrDocument{id=10035, _version_=1694841933442056192, _root_=10035}, SolrDocument{id=10040, _version_=1694841933442056196, _root_=10040}, SolrDocument{id=10045, _version_=1694841933442056194, _root_=10045}]}}, {groupValue=397517840, doclist={numFound=6,numFoundExact=true,start=0,maxScore=1.0,docs=[SolrDocument{id=15, intGSL=397517840, longGSL=3566001668284464522, doubleGSL=17702.12165299812, floatGSL=18679.143, dateGSL=Fri Apr 06 05:59:12 MMT 143208694, stringGSL=base_string_637578__00016743, boolGSL=false, sortableGSL=base_string_468869__00019850, _version_=1694841933441007618, _root_=15}, SolrDocument{id=16, intGSL=397517840, longGSL=3566001668284464522, doubleGSL=17702.12165299812, floatGSL=18679.143, dateGSL=Fri Apr 06 05:59:12 MMT 143208694, stringGSL=base_string_637578__00016743, boolGSL=true, sortableGSL=base_string_468869__00019850, _version_=1694841933441007619, _root_=16}, SolrDocument{id=17, intGSL=397517840, longGSL=3566001668284464522, doubleGSL=17702.12165299812, floatGSL=18679.143, dateGSL=Fri Apr 06 05:59:12 MMT 143208694, stringGSL=base_string_637578__00016743, boolGSL=false, sortableGSL=base_string_468869__00019850, _version_=1694841933439959041, _root_=17}, SolrDocument{id=18, intGSL=397517840, longGSL=3566001668284464522, doubleGSL=17702.12165299812, floatGSL=18679.143, dateGSL=Fri Apr 06 05:59:12 MMT 143208694, stringGSL=base_string_637578__00016743, boolGSL=true, sortableGSL=base_string_468869__00019850, _version_=1694841933441007619, _root_=18}, SolrDocument{id=19, intGSL=397517840, longGSL=3566001668284464522, doubleGSL=17702.12165299812, floatGSL=18679.143, dateGSL=Fri Apr 06 05:59:12 MMT 143208694, stringGSL=base_string_637578__00016743, boolGSL=false, sortableGSL=base_string_468869__00019850, _version_=1694841933441007616, _root_=19}, SolrDocument{id=20, intGSL=397517840, longGSL=3566001668284464522, doubleGSL=17702.12165299812, floatGSL=18679.143, dateGSL=Fri Apr 06 05:59:12 MMT 143208694, stringGSL=base_string_637578__00016743, boolGSL=true, sortableGSL=base_string_468869__00019850, _version_=1694841933441007620, _root_=20}]}}, {groupValue=397526304, doclist={numFound=5,numFoundExact=true,start=0,maxScore=1.0,docs=[SolrDocument{id=21, intGSL=397526304, longGSL=3566001668284469692, doubleGSL=25639.12165299812, floatGSL=22145.143, dateGSL=Fri Apr 06 05:59:18 MMT 143208694, stringGSL=base_string_637578__00017150, boolGSL=false, sortableGSL=base_string_468869__00021504, _version_=1694841933441007617, _root_=21}, SolrDocument{id=22, intGSL=397526304, longGSL=3566001668284469692, doubleGSL=25639.12165299812, floatGSL=22145.143, dateGSL=Fri Apr 06 05:59:18 MMT 143208694, stringGSL=base_string_637578__00017150, boolGSL=true, sortableGSL=base_string_468869__00021504, _version_=1694841933441007621, _root_=22}, SolrDocument{id=23, intGSL=397526304, longGSL=3566001668284469692, doubleGSL=25639.12165299812, floatGSL=22145.143, dateGSL=Fri Apr 06 05:59:18 MMT 143208694, stringGSL=base_string_637578__00017150, boolGSL=false, sortableGSL=base_string_468869__00021504, _version_=1694841933441007618, _root_=23}, SolrDocument{id=25, intGSL=397526304, longGSL=3566001668284469692, doubleGSL=25639.12165299812, floatGSL=22145.143, dateGSL=Fri Apr 06 05:59:18 MMT 143208694, stringGSL=base_string_637578__00017150, boolGSL=false, sortableGSL=base_string_468869__00021504, _version_=1694841933441007619, _root_=25}, SolrDocument{id=26, intGSL=397526304, longGSL=3566001668284469692, doubleGSL=25639.12165299812, floatGSL=22145.143, dateGSL=Fri Apr 06 05:59:18 MMT 143208694, stringGSL=base_string_637578__00017150, boolGSL=true, sortableGSL=base_string_468869__00021504, _version_=1694841933441007621, _root_=26}]}}, {groupValue=397529778, doclist={numFound=5,numFoundExact=true,start=0,maxScore=1.0,docs=[SolrDocument{id=29, intGSL=397529778, longGSL=3566001668284479388, doubleGSL=26088.12165299812, floatGSL=27502.143, dateGSL=Fri Apr 06 05:59:24 MMT 143208694, stringGSL=base_string_637578__00023239, boolGSL=false, sortableGSL=base_string_468869__00023706, _version_=1694841933442056192, _root_=29}, SolrDocument{id=30, intGSL=397529778, longGSL=3566001668284479388, doubleGSL=26088.12165299812, floatGSL=27502.143, dateGSL=Fri Apr 06 05:59:24 MMT 143208694, stringGSL=base_string_637578__00023239, boolGSL=true, sortableGSL=base_string_468869__00023706, _version_=1694841933441007622, _root_=30}, SolrDocument{id=31, intGSL=397529778, longGSL=3566001668284479388, doubleGSL=26088.12165299812, floatGSL=27502.143, dateGSL=Fri Apr 06 05:59:24 MMT 143208694, stringGSL=base_string_637578__00023239, boolGSL=false, sortableGSL=base_string_468869__00023706, _version_=1694841933441007623, _root_=31}, SolrDocument{id=33, intGSL=397529778, longGSL=3566001668284479388, doubleGSL=26088.12165299812, floatGSL=27502.143, dateGSL=Fri Apr 06 05:59:24 MMT 143208694, stringGSL=base_string_637578__00023239, boolGSL=false, sortableGSL=base_string_468869__00023706, _version_=1694841933442056194, _root_=33}, SolrDocument{id=34, intGSL=397529778, longGSL=3566001668284479388, doubleGSL=26088.12165299812, floatGSL=27502.143, dateGSL=Fri Apr 06 05:59:24 MMT 143208694, stringGSL=base_string_637578__00023239, boolGSL=true, sortableGSL=base_string_468869__00023706, _version_=1694841933441007622, _root_=34}]}}, {groupValue=397533612, doclist={numFound=5,numFoundExact=true,start=0,maxScore=1.0,docs=[SolrDocument{id=35, intGSL=397533612, longGSL=3566001668284480253, doubleGSL=27892.12165299812, floatGSL=31531.143, dateGSL=Fri Apr 06 05:59:24 MMT 143208694, stringGSL=base_string_637578__00027769, boolGSL=false, sortableGSL=base_string_468869__00024469, _version_=1694841933441007623, _root_=35}, SolrDocument{id=36, intGSL=397533612, longGSL=3566001668284480253, doubleGSL=27892.12165299812, floatGSL=31531.143, dateGSL=Fri Apr 06 05:59:24 MMT 143208694, stringGSL=base_string_637578__00027769, boolGSL=true, sortableGSL=base_string_468869__00024469, _version_=1694841933442056192, _root_=36}, SolrDocument{id=37, intGSL=397533612, longGSL=3566001668284480253, doubleGSL=27892.12165299812, floatGSL=31531.143, dateGSL=Fri Apr 06 05:59:24 MMT 143208694, stringGSL=base_string_637578__00027769, boolGSL=false, sortableGSL=base_string_468869__00024469, _version_=1694841933442056195, _root_=37}, SolrDocument{id=39, intGSL=397533612, longGSL=3566001668284480253, doubleGSL=27892.12165299812, floatGSL=31531.143, dateGSL=Fri Apr 06 05:59:24 MMT 143208694, stringGSL=base_string_637578__00027769, boolGSL=false, sortableGSL=base_string_468869__00024469, _version_=1694841933442056193, _root_=39}, SolrDocument{id=41, intGSL=397533612, longGSL=3566001668284480253, doubleGSL=27892.12165299812, floatGSL=31531.143, dateGSL=Fri Apr 06 05:59:24 MMT 143208694, stringGSL=base_string_637578__00027769, boolGSL=false, sortableGSL=base_string_468869__00024469, _version_=1694841933442056193, _root_=41}]}}, {groupValue=397534305, doclist={numFound=5,numFoundExact=true,start=0,maxScore=1.0,docs=[SolrDocument{id=43, intGSL=397534305, longGSL=3566001668284482861, doubleGSL=35691.121652998125, floatGSL=39477.14, dateGSL=Fri Apr 06 05:59:28 MMT 143208694, stringGSL=base_string_637578__00029873, boolGSL=false, sortableGSL=base_string_468869__00024472, _version_=1694841933442056194, _root_=43}, SolrDocument{id=44, intGSL=397534305, longGSL=3566001668284482861, doubleGSL=35691.121652998125, floatGSL=39477.14, dateGSL=Fri Apr 06 05:59:28 MMT 143208694, stringGSL=base_string_637578__00029873, boolGSL=true, sortableGSL=base_string_468869__00024472, _version_=1694841933442056195, _root_=44}, SolrDocument{id=45, intGSL=397534305, longGSL=3566001668284482861, doubleGSL=35691.121652998125, floatGSL=39477.14, dateGSL=Fri Apr 06 05:59:28 MMT 143208694, stringGSL=base_string_637578__00029873, boolGSL=false, sortableGSL=base_string_468869__00024472, _version_=1694841933442056197, _root_=45}, SolrDocument{id=46, intGSL=397534305, longGSL=3566001668284482861, doubleGSL=35691.121652998125, floatGSL=39477.14, dateGSL=Fri Apr 06 05:59:28 MMT 143208694, stringGSL=base_string_637578__00029873, boolGSL=true, sortableGSL=base_string_468869__00024472, _version_=1694841933442056196, _root_=46}, SolrDocument{id=47, intGSL=397534305, longGSL=3566001668284482861, doubleGSL=35691.121652998125, floatGSL=39477.14, dateGSL=Fri Apr 06 05:59:28 MMT 143208694, stringGSL=base_string_637578__00029873, boolGSL=false, sortableGSL=base_string_468869__00024472, _version_=1694841933442056197, _root_=47}]}}]}}}
Stack Trace:
java.lang.AssertionError: Unexpected number of elements in the group for 'intGSL' size: '4' GroupValue: '397511465' rsp: {responseHeader={zkConnected=true, status=0, QTime=44, params={q=*:*, group.sort=id asc, _stateVer_=dv_coll:13, group.limit=100, rows=100, wt=javabin, version=2, group.field=intGSL, group=true}}, grouped={intGSL={matches=45, groups=[{groupValue=397502102, doclist={numFound=7,numFoundExact=true,start=0,maxScore=1.0,docs=[SolrDocument{id=0, intGSL=397502102, longGSL=3566001668284452664, doubleGSL=6257.121652998122, floatGSL=1176.142, dateGSL=Fri Apr 06 05:59:02 MMT 143208694, stringGSL=base_string_637578__00000614, boolGSL=true, sortableGSL=base_string_468869__00007102, _version_=1694841933436813312, _root_=0}, SolrDocument{id=1, intGSL=397502102, longGSL=3566001668284452664, doubleGSL=6257.121652998122, floatGSL=1176.142, dateGSL=Fri Apr 06 05:59:02 MMT 143208694, stringGSL=base_string_637578__00000614, boolGSL=false, sortableGSL=base_string_468869__00007102, _version_=1694841933438910464, _root_=1}, SolrDocument{id=2, intGSL=397502102, longGSL=3566001668284452664, doubleGSL=6257.121652998122, floatGSL=1176.142, dateGSL=Fri Apr 06 05:59:02 MMT 143208694, stringGSL=base_string_637578__00000614, boolGSL=true, sortableGSL=base_string_468869__00007102, _version_=1694841933436813312, _root_=2}, SolrDocument{id=3, intGSL=397502102, longGSL=3566001668284452664, doubleGSL=6257.121652998122, floatGSL=1176.142, dateGSL=Fri Apr 06 05:59:02 MMT 143208694, stringGSL=base_string_637578__00000614, boolGSL=false, sortableGSL=base_string_468869__00007102, _version_=1694841933439959040, _root_=3}, SolrDocument{id=4, intGSL=397502102, longGSL=3566001668284452664, doubleGSL=6257.121652998122, floatGSL=1176.142, dateGSL=Fri Apr 06 05:59:02 MMT 143208694, stringGSL=base_string_637578__00000614, boolGSL=true, sortableGSL=base_string_468869__00007102, _version_=1694841933439959040, _root_=4}, SolrDocument{id=5, intGSL=397502102, longGSL=3566001668284452664, doubleGSL=6257.121652998122, floatGSL=1176.142, dateGSL=Fri Apr 06 05:59:02 MMT 143208694, stringGSL=base_string_637578__00000614, boolGSL=false, sortableGSL=base_string_468869__00007102, _version_=1694841933439959040, _root_=5}, SolrDocument{id=6, intGSL=397502102, longGSL=3566001668284452664, doubleGSL=6257.121652998122, floatGSL=1176.142, dateGSL=Fri Apr 06 05:59:02 MMT 143208694, stringGSL=base_string_637578__00000614, boolGSL=true, sortableGSL=base_string_468869__00007102, _version_=1694841933439959041, _root_=6}]}}, {groupValue=397511465, doclist={numFound=4,numFoundExact=true,start=0,maxScore=1.0,docs=[SolrDocument{id=12, intGSL=397511465, longGSL=3566001668284457446, doubleGSL=9144.121652998123, floatGSL=10548.142, dateGSL=Fri Apr 06 05:59:07 MMT 143208694, stringGSL=base_string_637578__00007087, boolGSL=true, sortableGSL=base_string_468869__00010744, _version_=1694841933441007617, _root_=12}, SolrDocument{id=7, intGSL=397511465, longGSL=3566001668284457446, doubleGSL=9144.121652998123, floatGSL=10548.142, dateGSL=Fri Apr 06 05:59:07 MMT 143208694, stringGSL=base_string_637578__00007087, boolGSL=false, sortableGSL=base_string_468869__00010744, _version_=1694841933441007616, _root_=7}, SolrDocument{id=8, intGSL=397511465, longGSL=3566001668284457446, doubleGSL=9144.121652998123, floatGSL=10548.142, dateGSL=Fri Apr 06 05:59:07 MMT 143208694, stringGSL=base_string_637578__00007087, boolGSL=true, sortableGSL=base_string_468869__00010744, _version_=1694841933439959040, _root_=8}, SolrDocument{id=9, intGSL=397511465, longGSL=3566001668284457446, doubleGSL=9144.121652998123, floatGSL=10548.142, dateGSL=Fri Apr 06 05:59:07 MMT 143208694, stringGSL=base_string_637578__00007087, boolGSL=false, sortableGSL=base_string_468869__00010744, _version_=1694841933441007617, _root_=9}]}}, {groupValue=null, doclist={numFound=8,numFoundExact=true,start=0,maxScore=1.0,docs=[SolrDocument{id=10000, _version_=1694841933437861888, _root_=10000}, SolrDocument{id=10005, _version_=1694841933441007616, _root_=10005}, SolrDocument{id=10010, _version_=1694841933441007618, _root_=10010}, SolrDocument{id=10025, _version_=1694841933441007620, _root_=10025}, SolrDocument{id=10030, _version_=1694841933442056193, _root_=10030}, SolrDocument{id=10035, _version_=1694841933442056192, _root_=10035}, SolrDocument{id=10040, _version_=1694841933442056196, _root_=10040}, SolrDocument{id=10045, _version_=1694841933442056194, _root_=10045}]}}, {groupValue=397517840, doclist={numFound=6,numFoundExact=true,start=0,maxScore=1.0,docs=[SolrDocument{id=15, intGSL=397517840, longGSL=3566001668284464522, doubleGSL=17702.12165299812, floatGSL=18679.143, dateGSL=Fri Apr 06 05:59:12 MMT 143208694, stringGSL=base_string_637578__00016743, boolGSL=false, sortableGSL=base_string_468869__00019850, _version_=1694841933441007618, _root_=15}, SolrDocument{id=16, intGSL=397517840, longGSL=3566001668284464522, doubleGSL=17702.12165299812, floatGSL=18679.143, dateGSL=Fri Apr 06 05:59:12 MMT 143208694, stringGSL=base_string_637578__00016743, boolGSL=true, sortableGSL=base_string_468869__00019850, _version_=1694841933441007619, _root_=16}, SolrDocument{id=17, intGSL=397517840, longGSL=3566001668284464522, doubleGSL=17702.12165299812, floatGSL=18679.143, dateGSL=Fri Apr 06 05:59:12 MMT 143208694, stringGSL=base_string_637578__00016743, boolGSL=false, sortableGSL=base_string_468869__00019850, _version_=1694841933439959041, _root_=17}, SolrDocument{id=18, intGSL=397517840, longGSL=3566001668284464522, doubleGSL=17702.12165299812, floatGSL=18679.143, dateGSL=Fri Apr 06 05:59:12 MMT 143208694, stringGSL=base_string_637578__00016743, boolGSL=true, sortableGSL=base_string_468869__00019850, _version_=1694841933441007619, _root_=18}, SolrDocument{id=19, intGSL=397517840, longGSL=3566001668284464522, doubleGSL=17702.12165299812, floatGSL=18679.143, dateGSL=Fri Apr 06 05:59:12 MMT 143208694, stringGSL=base_string_637578__00016743, boolGSL=false, sortableGSL=base_string_468869__00019850, _version_=1694841933441007616, _root_=19}, SolrDocument{id=20, intGSL=397517840, longGSL=3566001668284464522, doubleGSL=17702.12165299812, floatGSL=18679.143, dateGSL=Fri Apr 06 05:59:12 MMT 143208694, stringGSL=base_string_637578__00016743, boolGSL=true, sortableGSL=base_string_468869__00019850, _version_=1694841933441007620, _root_=20}]}}, {groupValue=397526304, doclist={numFound=5,numFoundExact=true,start=0,maxScore=1.0,docs=[SolrDocument{id=21, intGSL=397526304, longGSL=3566001668284469692, doubleGSL=25639.12165299812, floatGSL=22145.143, dateGSL=Fri Apr 06 05:59:18 MMT 143208694, stringGSL=base_string_637578__00017150, boolGSL=false, sortableGSL=base_string_468869__00021504, _version_=1694841933441007617, _root_=21}, SolrDocument{id=22, intGSL=397526304, longGSL=3566001668284469692, doubleGSL=25639.12165299812, floatGSL=22145.143, dateGSL=Fri Apr 06 05:59:18 MMT 143208694, stringGSL=base_string_637578__00017150, boolGSL=true, sortableGSL=base_string_468869__00021504, _version_=1694841933441007621, _root_=22}, SolrDocument{id=23, intGSL=397526304, longGSL=3566001668284469692, doubleGSL=25639.12165299812, floatGSL=22145.143, dateGSL=Fri Apr 06 05:59:18 MMT 143208694, stringGSL=base_string_637578__00017150, boolGSL=false, sortableGSL=base_string_468869__00021504, _version_=1694841933441007618, _root_=23}, SolrDocument{id=25, intGSL=397526304, longGSL=3566001668284469692, doubleGSL=25639.12165299812, floatGSL=22145.143, dateGSL=Fri Apr 06 05:59:18 MMT 143208694, stringGSL=base_string_637578__00017150, boolGSL=false, sortableGSL=base_string_468869__00021504, _version_=1694841933441007619, _root_=25}, SolrDocument{id=26, intGSL=397526304, longGSL=3566001668284469692, doubleGSL=25639.12165299812, floatGSL=22145.143, dateGSL=Fri Apr 06 05:59:18 MMT 143208694, stringGSL=base_string_637578__00017150, boolGSL=true, sortableGSL=base_string_468869__00021504, _version_=1694841933441007621, _root_=26}]}}, {groupValue=397529778, doclist={numFound=5,numFoundExact=true,start=0,maxScore=1.0,docs=[SolrDocument{id=29, intGSL=397529778, longGSL=3566001668284479388, doubleGSL=26088.12165299812, floatGSL=27502.143, dateGSL=Fri Apr 06 05:59:24 MMT 143208694, stringGSL=base_string_637578__00023239, boolGSL=false, sortableGSL=base_string_468869__00023706, _version_=1694841933442056192, _root_=29}, SolrDocument{id=30, intGSL=397529778, longGSL=3566001668284479388, doubleGSL=26088.12165299812, floatGSL=27502.143, dateGSL=Fri Apr 06 05:59:24 MMT 143208694, stringGSL=base_string_637578__00023239, boolGSL=true, sortableGSL=base_string_468869__00023706, _version_=1694841933441007622, _root_=30}, SolrDocument{id=31, intGSL=397529778, longGSL=3566001668284479388, doubleGSL=26088.12165299812, floatGSL=27502.143, dateGSL=Fri Apr 06 05:59:24 MMT 143208694, stringGSL=base_string_637578__00023239, boolGSL=false, sortableGSL=base_string_468869__00023706, _version_=1694841933441007623, _root_=31}, SolrDocument{id=33, intGSL=397529778, longGSL=3566001668284479388, doubleGSL=26088.12165299812, floatGSL=27502.143, dateGSL=Fri Apr 06 05:59:24 MMT 143208694, stringGSL=base_string_637578__00023239, boolGSL=false, sortableGSL=base_string_468869__00023706, _version_=1694841933442056194, _root_=33}, SolrDocument{id=34, intGSL=397529778, longGSL=3566001668284479388, doubleGSL=26088.12165299812, floatGSL=27502.143, dateGSL=Fri Apr 06 05:59:24 MMT 143208694, stringGSL=base_string_637578__00023239, boolGSL=true, sortableGSL=base_string_468869__00023706, _version_=1694841933441007622, _root_=34}]}}, {groupValue=397533612, doclist={numFound=5,numFoundExact=true,start=0,maxScore=1.0,docs=[SolrDocument{id=35, intGSL=397533612, longGSL=3566001668284480253, doubleGSL=27892.12165299812, floatGSL=31531.143, dateGSL=Fri Apr 06 05:59:24 MMT 143208694, stringGSL=base_string_637578__00027769, boolGSL=false, sortableGSL=base_string_468869__00024469, _version_=1694841933441007623, _root_=35}, SolrDocument{id=36, intGSL=397533612, longGSL=3566001668284480253, doubleGSL=27892.12165299812, floatGSL=31531.143, dateGSL=Fri Apr 06 05:59:24 MMT 143208694, stringGSL=base_string_637578__00027769, boolGSL=true, sortableGSL=base_string_468869__00024469, _version_=1694841933442056192, _root_=36}, SolrDocument{id=37, intGSL=397533612, longGSL=3566001668284480253, doubleGSL=27892.12165299812, floatGSL=31531.143, dateGSL=Fri Apr 06 05:59:24 MMT 143208694, stringGSL=base_string_637578__00027769, boolGSL=false, sortableGSL=base_string_468869__00024469, _version_=1694841933442056195, _root_=37}, SolrDocument{id=39, intGSL=397533612, longGSL=3566001668284480253, doubleGSL=27892.12165299812, floatGSL=31531.143, dateGSL=Fri Apr 06 05:59:24 MMT 143208694, stringGSL=base_string_637578__00027769, boolGSL=false, sortableGSL=base_string_468869__00024469, _version_=1694841933442056193, _root_=39}, SolrDocument{id=41, intGSL=397533612, longGSL=3566001668284480253, doubleGSL=27892.12165299812, floatGSL=31531.143, dateGSL=Fri Apr 06 05:59:24 MMT 143208694, stringGSL=base_string_637578__00027769, boolGSL=false, sortableGSL=base_string_468869__00024469, _version_=1694841933442056193, _root_=41}]}}, {groupValue=397534305, doclist={numFound=5,numFoundExact=true,start=0,maxScore=1.0,docs=[SolrDocument{id=43, intGSL=397534305, longGSL=3566001668284482861, doubleGSL=35691.121652998125, floatGSL=39477.14, dateGSL=Fri Apr 06 05:59:28 MMT 143208694, stringGSL=base_string_637578__00029873, boolGSL=false, sortableGSL=base_string_468869__00024472, _version_=1694841933442056194, _root_=43}, SolrDocument{id=44, intGSL=397534305, longGSL=3566001668284482861, doubleGSL=35691.121652998125, floatGSL=39477.14, dateGSL=Fri Apr 06 05:59:28 MMT 143208694, stringGSL=base_string_637578__00029873, boolGSL=true, sortableGSL=base_string_468869__00024472, _version_=1694841933442056195, _root_=44}, SolrDocument{id=45, intGSL=397534305, longGSL=3566001668284482861, doubleGSL=35691.121652998125, floatGSL=39477.14, dateGSL=Fri Apr 06 05:59:28 MMT 143208694, stringGSL=base_string_637578__00029873, boolGSL=false, sortableGSL=base_string_468869__00024472, _version_=1694841933442056197, _root_=45}, SolrDocument{id=46, intGSL=397534305, longGSL=3566001668284482861, doubleGSL=35691.121652998125, floatGSL=39477.14, dateGSL=Fri Apr 06 05:59:28 MMT 143208694, stringGSL=base_string_637578__00029873, boolGSL=true, sortableGSL=base_string_468869__00024472, _version_=1694841933442056196, _root_=46}, SolrDocument{id=47, intGSL=397534305, longGSL=3566001668284482861, doubleGSL=35691.121652998125, floatGSL=39477.14, dateGSL=Fri Apr 06 05:59:28 MMT 143208694, stringGSL=base_string_637578__00029873, boolGSL=false, sortableGSL=base_string_468869__00024472, _version_=1694841933442056197, _root_=47}]}}]}}}
at __randomizedtesting.SeedInfo.seed([C463749806E94CFD:719030AB674E29A3]:0)
at org.junit.Assert.fail(Assert.java:89)
at org.apache.solr.cloud.DocValuesNotIndexedTest.doGroupingDvOnly(DocValuesNotIndexedTest.java:403)
at org.apache.solr.cloud.DocValuesNotIndexedTest.testGroupingDVOnlySortLast(DocValuesNotIndexedTest.java:331)
at java.base/jdk.internal.reflect.NativeMethodAccessorImpl.invoke0(Native Method)
at java.base/jdk.internal.reflect.NativeMethodAccessorImpl.invoke(NativeMethodAccessorImpl.java:62)
at java.base/jdk.internal.reflect.DelegatingMethodAccessorImpl.invoke(DelegatingMethodAccessorImpl.java:43)
at java.base/java.lang.reflect.Method.invoke(Method.java:566)
at com.carrotsearch.randomizedtesting.RandomizedRunner.invoke(RandomizedRunner.java:1754)
at com.carrotsearch.randomizedtesting.RandomizedRunner$8.evaluate(RandomizedRunner.java:942)
at com.carrotsearch.randomizedtesting.RandomizedRunner$9.evaluate(RandomizedRunner.java:978)
at com.carrotsearch.randomizedtesting.RandomizedRunner$10.evaluate(RandomizedRunner.java:992)
at com.carrotsearch.randomizedtesting.rules.SystemPropertiesRestoreRule$1.evaluate(SystemPropertiesRestoreRule.java:57)
at org.junit.rules.RunRules.evaluate(RunRules.java:20)
at org.apache.lucene.util.TestRuleSetupTeardownChained$1.evaluate(TestRuleSetupTeardownChained.java:44)
at org.apache.lucene.util.AbstractBeforeAfterRule$1.evaluate(AbstractBeforeAfterRule.java:43)
at org.apache.lucene.util.TestRuleThreadAndTestName$1.evaluate(TestRuleThreadAndTestName.java:45)
at org.apache.lucene.util.TestRuleIgnoreAfterMaxFailures$1.evaluate(TestRuleIgnoreAfterMaxFailures.java:60)
at org.apache.lucene.util.TestRuleMarkFailure$1.evaluate(TestRuleMarkFailure.java:44)
at org.junit.rules.RunRules.evaluate(RunRules.java:20)
at com.carrotsearch.randomizedtesting.rules.StatementAdapter.evaluate(StatementAdapter.java:36)
at com.carrotsearch.randomizedtesting.ThreadLeakControl$StatementRunner.run(ThreadLeakControl.java:370)
at com.carrotsearch.randomizedtesting.ThreadLeakControl.forkTimeoutingTask(ThreadLeakControl.java:819)
at com.carrotsearch.randomizedtesting.ThreadLeakControl$3.evaluate(ThreadLeakControl.java:470)
at com.carrotsearch.randomizedtesting.RandomizedRunner.runSingleTest(RandomizedRunner.java:951)
at com.carrotsearch.randomizedtesting.RandomizedRunner$5.evaluate(RandomizedRunner.java:836)
at com.carrotsearch.randomizedtesting.RandomizedRunner$6.evaluate(RandomizedRunner.java:887)
at com.carrotsearch.randomizedtesting.RandomizedRunner$7.evaluate(RandomizedRunner.java:898)
at com.carrotsearch.randomizedtesting.rules.StatementAdapter.evaluate(StatementAdapter.java:36)
at com.carrotsearch.randomizedtesting.rules.SystemPropertiesRestoreRule$1.evaluate(SystemPropertiesRestoreRule.java:57)
at org.junit.rules.RunRules.evaluate(RunRules.java:20)
at org.apache.lucene.util.AbstractBeforeAfterRule$1.evaluate(AbstractBeforeAfterRule.java:43)
at com.carrotsearch.randomizedtesting.rules.StatementAdapter.evaluate(StatementAdapter.java:36)
at org.apache.lucene.util.TestRuleStoreClassName$1.evaluate(TestRuleStoreClassName.java:38)
at com.carrotsearch.randomizedtesting.rules.NoShadowingOrOverridesOnMethodsRule$1.evaluate(NoShadowingOrOverridesOnMethodsRule.java:40)
at com.carrotsearch.randomizedtesting.rules.NoShadowingOrOverridesOnMethodsRule$1.evaluate(NoShadowingOrOverridesOnMethodsRule.java:40)
at com.carrotsearch.randomizedtesting.rules.StatementAdapter.evaluate(StatementAdapter.java:36)
at com.carrotsearch.randomizedtesting.rules.StatementAdapter.evaluate(StatementAdapter.java:36)
at org.apache.lucene.util.TestRuleAssertionsRequired$1.evaluate(TestRuleAssertionsRequired.java:51)
at org.apache.lucene.util.AbstractBeforeAfterRule$1.evaluate(AbstractBeforeAfterRule.java:43)
at org.apache.lucene.util.TestRuleMarkFailure$1.evaluate(TestRuleMarkFailure.java:44)
at org.apache.lucene.util.TestRuleIgnoreAfterMaxFailures$1.evaluate(TestRuleIgnoreAfterMaxFailures.java:60)
at org.apache.lucene.util.TestRuleIgnoreTestSuites$1.evaluate(TestRuleIgnoreTestSuites.java:47)
at org.junit.rules.RunRules.evaluate(RunRules.java:20)
at com.carrotsearch.randomizedtesting.rules.StatementAdapter.evaluate(StatementAdapter.java:36)
at com.carrotsearch.randomizedtesting.ThreadLeakControl$StatementRunner.run(ThreadLeakControl.java:370)
at com.carrotsearch.randomizedtesting.ThreadLeakControl.lambda$forkTimeoutingTask$0(ThreadLeakControl.java:826)
at java.base/java.lang.Thread.run(Thread.java:834)
FAILED: org.apache.solr.cloud.ReindexCollectionTest.testSameTargetReindexing
Error Message:
java.lang.Exception: Test abandoned because suite timeout was reached.
Stack Trace:
java.lang.Exception: Test abandoned because suite timeout was reached.
at __randomizedtesting.SeedInfo.seed([C463749806E94CFD]:0)
FAILED: org.apache.solr.cloud.ReindexCollectionTest.classMethod
Error Message:
java.lang.Exception: Suite timeout exceeded (>= 7200000 msec).
Stack Trace:
java.lang.Exception: Suite timeout exceeded (>= 7200000 msec).
at __randomizedtesting.SeedInfo.seed([C463749806E94CFD]:0)
[JENKINS] Solr-main-MacOSX (64bit/jdk-11.0.6) - Build # 13 - Still
Unstable!
Posted by Policeman Jenkins Server <je...@thetaphi.de>.
Build: https://jenkins.thetaphi.de/job/Solr-main-MacOSX/13/
Java: 64bit/jdk-11.0.6 -XX:+UseCompressedOops -XX:+UseSerialGC
2 tests failed.
FAILED: org.apache.solr.cloud.HttpPartitionTest.test
Error Message:
org.apache.solr.client.solrj.impl.BaseHttpSolrClient$RemoteSolrException: Error from server at http://127.0.0.1:64185/lo_v/vk: Underlying core creation failed while creating collection: collDoRecoveryOnRestart
Stack Trace:
org.apache.solr.client.solrj.impl.BaseHttpSolrClient$RemoteSolrException: Error from server at http://127.0.0.1:64185/lo_v/vk: Underlying core creation failed while creating collection: collDoRecoveryOnRestart
at __randomizedtesting.SeedInfo.seed([672B8B476FD0AD49:EF7FB49DC12CC0B1]:0)
at org.apache.solr.client.solrj.impl.HttpSolrClient.executeMethod(HttpSolrClient.java:698)
at org.apache.solr.client.solrj.impl.HttpSolrClient.request(HttpSolrClient.java:269)
at org.apache.solr.client.solrj.impl.HttpSolrClient.request(HttpSolrClient.java:251)
at org.apache.solr.client.solrj.SolrClient.request(SolrClient.java:1290)
at org.apache.solr.cloud.AbstractFullDistribZkTestBase.createCollection(AbstractFullDistribZkTestBase.java:1817)
at org.apache.solr.cloud.AbstractFullDistribZkTestBase.createCollection(AbstractFullDistribZkTestBase.java:1838)
at org.apache.solr.cloud.AbstractFullDistribZkTestBase.createCollection(AbstractFullDistribZkTestBase.java:1758)
at org.apache.solr.cloud.HttpPartitionTest.testDoRecoveryOnRestart(HttpPartitionTest.java:162)
at org.apache.solr.cloud.HttpPartitionTest.test(HttpPartitionTest.java:132)
at java.base/jdk.internal.reflect.NativeMethodAccessorImpl.invoke0(Native Method)
at java.base/jdk.internal.reflect.NativeMethodAccessorImpl.invoke(NativeMethodAccessorImpl.java:62)
at java.base/jdk.internal.reflect.DelegatingMethodAccessorImpl.invoke(DelegatingMethodAccessorImpl.java:43)
at java.base/java.lang.reflect.Method.invoke(Method.java:566)
at com.carrotsearch.randomizedtesting.RandomizedRunner.invoke(RandomizedRunner.java:1754)
at com.carrotsearch.randomizedtesting.RandomizedRunner$8.evaluate(RandomizedRunner.java:942)
at com.carrotsearch.randomizedtesting.RandomizedRunner$9.evaluate(RandomizedRunner.java:978)
at com.carrotsearch.randomizedtesting.RandomizedRunner$10.evaluate(RandomizedRunner.java:992)
at org.apache.solr.BaseDistributedSearchTestCase$ShardsRepeatRule$ShardsFixedStatement.callStatement(BaseDistributedSearchTestCase.java:1087)
at org.apache.solr.BaseDistributedSearchTestCase$ShardsRepeatRule$ShardsStatement.evaluate(BaseDistributedSearchTestCase.java:1058)
at com.carrotsearch.randomizedtesting.rules.SystemPropertiesRestoreRule$1.evaluate(SystemPropertiesRestoreRule.java:57)
at org.junit.rules.RunRules.evaluate(RunRules.java:20)
at org.apache.lucene.util.TestRuleSetupTeardownChained$1.evaluate(TestRuleSetupTeardownChained.java:44)
at org.apache.lucene.util.AbstractBeforeAfterRule$1.evaluate(AbstractBeforeAfterRule.java:43)
at org.apache.lucene.util.TestRuleThreadAndTestName$1.evaluate(TestRuleThreadAndTestName.java:45)
at org.apache.lucene.util.TestRuleIgnoreAfterMaxFailures$1.evaluate(TestRuleIgnoreAfterMaxFailures.java:60)
at org.apache.lucene.util.TestRuleMarkFailure$1.evaluate(TestRuleMarkFailure.java:44)
at org.junit.rules.RunRules.evaluate(RunRules.java:20)
at com.carrotsearch.randomizedtesting.rules.StatementAdapter.evaluate(StatementAdapter.java:36)
at com.carrotsearch.randomizedtesting.ThreadLeakControl$StatementRunner.run(ThreadLeakControl.java:370)
at com.carrotsearch.randomizedtesting.ThreadLeakControl.forkTimeoutingTask(ThreadLeakControl.java:819)
at com.carrotsearch.randomizedtesting.ThreadLeakControl$3.evaluate(ThreadLeakControl.java:470)
at com.carrotsearch.randomizedtesting.RandomizedRunner.runSingleTest(RandomizedRunner.java:951)
at com.carrotsearch.randomizedtesting.RandomizedRunner$5.evaluate(RandomizedRunner.java:836)
at com.carrotsearch.randomizedtesting.RandomizedRunner$6.evaluate(RandomizedRunner.java:887)
at com.carrotsearch.randomizedtesting.RandomizedRunner$7.evaluate(RandomizedRunner.java:898)
at com.carrotsearch.randomizedtesting.rules.StatementAdapter.evaluate(StatementAdapter.java:36)
at com.carrotsearch.randomizedtesting.rules.SystemPropertiesRestoreRule$1.evaluate(SystemPropertiesRestoreRule.java:57)
at org.junit.rules.RunRules.evaluate(RunRules.java:20)
at org.apache.lucene.util.AbstractBeforeAfterRule$1.evaluate(AbstractBeforeAfterRule.java:43)
at com.carrotsearch.randomizedtesting.rules.StatementAdapter.evaluate(StatementAdapter.java:36)
at org.apache.lucene.util.TestRuleStoreClassName$1.evaluate(TestRuleStoreClassName.java:38)
at com.carrotsearch.randomizedtesting.rules.NoShadowingOrOverridesOnMethodsRule$1.evaluate(NoShadowingOrOverridesOnMethodsRule.java:40)
at com.carrotsearch.randomizedtesting.rules.NoShadowingOrOverridesOnMethodsRule$1.evaluate(NoShadowingOrOverridesOnMethodsRule.java:40)
at com.carrotsearch.randomizedtesting.rules.StatementAdapter.evaluate(StatementAdapter.java:36)
at com.carrotsearch.randomizedtesting.rules.StatementAdapter.evaluate(StatementAdapter.java:36)
at org.apache.lucene.util.TestRuleAssertionsRequired$1.evaluate(TestRuleAssertionsRequired.java:51)
at org.apache.lucene.util.AbstractBeforeAfterRule$1.evaluate(AbstractBeforeAfterRule.java:43)
at org.apache.lucene.util.TestRuleMarkFailure$1.evaluate(TestRuleMarkFailure.java:44)
at org.apache.lucene.util.TestRuleIgnoreAfterMaxFailures$1.evaluate(TestRuleIgnoreAfterMaxFailures.java:60)
at org.apache.lucene.util.TestRuleIgnoreTestSuites$1.evaluate(TestRuleIgnoreTestSuites.java:47)
at org.junit.rules.RunRules.evaluate(RunRules.java:20)
at com.carrotsearch.randomizedtesting.rules.StatementAdapter.evaluate(StatementAdapter.java:36)
at com.carrotsearch.randomizedtesting.ThreadLeakControl$StatementRunner.run(ThreadLeakControl.java:370)
at com.carrotsearch.randomizedtesting.ThreadLeakControl.lambda$forkTimeoutingTask$0(ThreadLeakControl.java:826)
at java.base/java.lang.Thread.run(Thread.java:834)
FAILED: org.apache.solr.cloud.LeaderFailoverAfterPartitionTest.test
Error Message:
org.apache.solr.client.solrj.SolrServerException: Timeout occurred while waiting response from server at: http://127.0.0.1:64319/bom/hn
Stack Trace:
org.apache.solr.client.solrj.SolrServerException: Timeout occurred while waiting response from server at: http://127.0.0.1:64319/bom/hn
at __randomizedtesting.SeedInfo.seed([672B8B476FD0AD49:EF7FB49DC12CC0B1]:0)
at org.apache.solr.client.solrj.impl.HttpSolrClient.executeMethod(HttpSolrClient.java:709)
at org.apache.solr.client.solrj.impl.HttpSolrClient.request(HttpSolrClient.java:269)
at org.apache.solr.client.solrj.impl.HttpSolrClient.request(HttpSolrClient.java:251)
at org.apache.solr.client.solrj.impl.LBSolrClient.doRequest(LBSolrClient.java:390)
at org.apache.solr.client.solrj.impl.LBSolrClient.request(LBSolrClient.java:360)
at org.apache.solr.client.solrj.impl.BaseCloudSolrClient.sendRequest(BaseCloudSolrClient.java:1164)
at org.apache.solr.client.solrj.impl.BaseCloudSolrClient.requestWithRetryOnStaleState(BaseCloudSolrClient.java:927)
at org.apache.solr.client.solrj.impl.BaseCloudSolrClient.request(BaseCloudSolrClient.java:861)
at org.apache.solr.client.solrj.SolrRequest.process(SolrRequest.java:229)
at org.apache.solr.client.solrj.SolrRequest.process(SolrRequest.java:246)
at org.apache.solr.cloud.AbstractFullDistribZkTestBase.createServers(AbstractFullDistribZkTestBase.java:340)
at org.apache.solr.BaseDistributedSearchTestCase$ShardsRepeatRule$ShardsFixedStatement.callStatement(BaseDistributedSearchTestCase.java:1085)
at org.apache.solr.BaseDistributedSearchTestCase$ShardsRepeatRule$ShardsStatement.evaluate(BaseDistributedSearchTestCase.java:1058)
at com.carrotsearch.randomizedtesting.rules.SystemPropertiesRestoreRule$1.evaluate(SystemPropertiesRestoreRule.java:57)
at org.junit.rules.RunRules.evaluate(RunRules.java:20)
at org.apache.lucene.util.TestRuleSetupTeardownChained$1.evaluate(TestRuleSetupTeardownChained.java:44)
at org.apache.lucene.util.AbstractBeforeAfterRule$1.evaluate(AbstractBeforeAfterRule.java:43)
at org.apache.lucene.util.TestRuleThreadAndTestName$1.evaluate(TestRuleThreadAndTestName.java:45)
at org.apache.lucene.util.TestRuleIgnoreAfterMaxFailures$1.evaluate(TestRuleIgnoreAfterMaxFailures.java:60)
at org.apache.lucene.util.TestRuleMarkFailure$1.evaluate(TestRuleMarkFailure.java:44)
at org.junit.rules.RunRules.evaluate(RunRules.java:20)
at com.carrotsearch.randomizedtesting.rules.StatementAdapter.evaluate(StatementAdapter.java:36)
at com.carrotsearch.randomizedtesting.ThreadLeakControl$StatementRunner.run(ThreadLeakControl.java:370)
at com.carrotsearch.randomizedtesting.ThreadLeakControl.forkTimeoutingTask(ThreadLeakControl.java:819)
at com.carrotsearch.randomizedtesting.ThreadLeakControl$3.evaluate(ThreadLeakControl.java:470)
at com.carrotsearch.randomizedtesting.RandomizedRunner.runSingleTest(RandomizedRunner.java:951)
at com.carrotsearch.randomizedtesting.RandomizedRunner$5.evaluate(RandomizedRunner.java:836)
at com.carrotsearch.randomizedtesting.RandomizedRunner$6.evaluate(RandomizedRunner.java:887)
at com.carrotsearch.randomizedtesting.RandomizedRunner$7.evaluate(RandomizedRunner.java:898)
at com.carrotsearch.randomizedtesting.rules.StatementAdapter.evaluate(StatementAdapter.java:36)
at com.carrotsearch.randomizedtesting.rules.SystemPropertiesRestoreRule$1.evaluate(SystemPropertiesRestoreRule.java:57)
at org.junit.rules.RunRules.evaluate(RunRules.java:20)
at org.apache.lucene.util.AbstractBeforeAfterRule$1.evaluate(AbstractBeforeAfterRule.java:43)
at com.carrotsearch.randomizedtesting.rules.StatementAdapter.evaluate(StatementAdapter.java:36)
at org.apache.lucene.util.TestRuleStoreClassName$1.evaluate(TestRuleStoreClassName.java:38)
at com.carrotsearch.randomizedtesting.rules.NoShadowingOrOverridesOnMethodsRule$1.evaluate(NoShadowingOrOverridesOnMethodsRule.java:40)
at com.carrotsearch.randomizedtesting.rules.NoShadowingOrOverridesOnMethodsRule$1.evaluate(NoShadowingOrOverridesOnMethodsRule.java:40)
at com.carrotsearch.randomizedtesting.rules.StatementAdapter.evaluate(StatementAdapter.java:36)
at com.carrotsearch.randomizedtesting.rules.StatementAdapter.evaluate(StatementAdapter.java:36)
at org.apache.lucene.util.TestRuleAssertionsRequired$1.evaluate(TestRuleAssertionsRequired.java:51)
at org.apache.lucene.util.AbstractBeforeAfterRule$1.evaluate(AbstractBeforeAfterRule.java:43)
at org.apache.lucene.util.TestRuleMarkFailure$1.evaluate(TestRuleMarkFailure.java:44)
at org.apache.lucene.util.TestRuleIgnoreAfterMaxFailures$1.evaluate(TestRuleIgnoreAfterMaxFailures.java:60)
at org.apache.lucene.util.TestRuleIgnoreTestSuites$1.evaluate(TestRuleIgnoreTestSuites.java:47)
at org.junit.rules.RunRules.evaluate(RunRules.java:20)
at com.carrotsearch.randomizedtesting.rules.StatementAdapter.evaluate(StatementAdapter.java:36)
at com.carrotsearch.randomizedtesting.ThreadLeakControl$StatementRunner.run(ThreadLeakControl.java:370)
at com.carrotsearch.randomizedtesting.ThreadLeakControl.lambda$forkTimeoutingTask$0(ThreadLeakControl.java:826)
at java.base/java.lang.Thread.run(Thread.java:834)
Caused by: java.net.SocketTimeoutException: Read timed out
at java.base/java.net.SocketInputStream.socketRead0(Native Method)
at java.base/java.net.SocketInputStream.socketRead(SocketInputStream.java:115)
at java.base/java.net.SocketInputStream.read(SocketInputStream.java:168)
at java.base/java.net.SocketInputStream.read(SocketInputStream.java:140)
at org.apache.http.impl.io.SessionInputBufferImpl.streamRead(SessionInputBufferImpl.java:137)
at org.apache.http.impl.io.SessionInputBufferImpl.fillBuffer(SessionInputBufferImpl.java:153)
at org.apache.http.impl.io.SessionInputBufferImpl.readLine(SessionInputBufferImpl.java:280)
at org.apache.http.impl.conn.DefaultHttpResponseParser.parseHead(DefaultHttpResponseParser.java:138)
at org.apache.http.impl.conn.DefaultHttpResponseParser.parseHead(DefaultHttpResponseParser.java:56)
at org.apache.http.impl.io.AbstractMessageParser.parse(AbstractMessageParser.java:259)
at org.apache.http.impl.DefaultBHttpClientConnection.receiveResponseHeader(DefaultBHttpClientConnection.java:163)
at org.apache.http.impl.conn.CPoolProxy.receiveResponseHeader(CPoolProxy.java:157)
at org.apache.http.protocol.HttpRequestExecutor.doReceiveResponse(HttpRequestExecutor.java:273)
at org.apache.http.protocol.HttpRequestExecutor.execute(HttpRequestExecutor.java:125)
at org.apache.http.impl.execchain.MainClientExec.execute(MainClientExec.java:272)
at org.apache.http.impl.execchain.ProtocolExec.execute(ProtocolExec.java:186)
at org.apache.http.impl.execchain.RetryExec.execute(RetryExec.java:89)
at org.apache.http.impl.execchain.RedirectExec.execute(RedirectExec.java:110)
at org.apache.http.impl.client.InternalHttpClient.doExecute(InternalHttpClient.java:185)
at org.apache.http.impl.client.CloseableHttpClient.execute(CloseableHttpClient.java:83)
at org.apache.http.impl.client.CloseableHttpClient.execute(CloseableHttpClient.java:56)
at org.apache.solr.client.solrj.impl.HttpSolrClient.executeMethod(HttpSolrClient.java:582)
... 48 more
[JENKINS] Solr-main-MacOSX (64bit/jdk-11.0.6) - Build # 12 - Still
Unstable!
Posted by Policeman Jenkins Server <je...@thetaphi.de>.
Build: https://jenkins.thetaphi.de/job/Solr-main-MacOSX/12/
Java: 64bit/jdk-11.0.6 -XX:+UseCompressedOops -XX:+UseConcMarkSweepGC
1 tests failed.
FAILED: org.apache.solr.cloud.PeerSyncReplicationTest.test
Error Message:
java.lang.AssertionError: expected:<188> but was:<189>
Stack Trace:
java.lang.AssertionError: expected:<188> but was:<189>
at __randomizedtesting.SeedInfo.seed([BB7AE3002D472191:332EDCDA83BB4C69]:0)
at org.junit.Assert.fail(Assert.java:89)
at org.junit.Assert.failNotEquals(Assert.java:835)
at org.junit.Assert.assertEquals(Assert.java:647)
at org.junit.Assert.assertEquals(Assert.java:633)
at org.apache.solr.cloud.PeerSyncReplicationTest.bringUpDeadNodeAndEnsureNoReplication(PeerSyncReplicationTest.java:327)
at org.apache.solr.cloud.PeerSyncReplicationTest.test(PeerSyncReplicationTest.java:171)
at java.base/jdk.internal.reflect.NativeMethodAccessorImpl.invoke0(Native Method)
at java.base/jdk.internal.reflect.NativeMethodAccessorImpl.invoke(NativeMethodAccessorImpl.java:62)
at java.base/jdk.internal.reflect.DelegatingMethodAccessorImpl.invoke(DelegatingMethodAccessorImpl.java:43)
at java.base/java.lang.reflect.Method.invoke(Method.java:566)
at com.carrotsearch.randomizedtesting.RandomizedRunner.invoke(RandomizedRunner.java:1754)
at com.carrotsearch.randomizedtesting.RandomizedRunner$8.evaluate(RandomizedRunner.java:942)
at com.carrotsearch.randomizedtesting.RandomizedRunner$9.evaluate(RandomizedRunner.java:978)
at com.carrotsearch.randomizedtesting.RandomizedRunner$10.evaluate(RandomizedRunner.java:992)
at org.apache.solr.BaseDistributedSearchTestCase$ShardsRepeatRule$ShardsFixedStatement.callStatement(BaseDistributedSearchTestCase.java:1087)
at org.apache.solr.BaseDistributedSearchTestCase$ShardsRepeatRule$ShardsStatement.evaluate(BaseDistributedSearchTestCase.java:1058)
at com.carrotsearch.randomizedtesting.rules.SystemPropertiesRestoreRule$1.evaluate(SystemPropertiesRestoreRule.java:57)
at org.junit.rules.RunRules.evaluate(RunRules.java:20)
at org.apache.lucene.util.TestRuleSetupTeardownChained$1.evaluate(TestRuleSetupTeardownChained.java:44)
at org.apache.lucene.util.AbstractBeforeAfterRule$1.evaluate(AbstractBeforeAfterRule.java:43)
at org.apache.lucene.util.TestRuleThreadAndTestName$1.evaluate(TestRuleThreadAndTestName.java:45)
at org.apache.lucene.util.TestRuleIgnoreAfterMaxFailures$1.evaluate(TestRuleIgnoreAfterMaxFailures.java:60)
at org.apache.lucene.util.TestRuleMarkFailure$1.evaluate(TestRuleMarkFailure.java:44)
at org.junit.rules.RunRules.evaluate(RunRules.java:20)
at com.carrotsearch.randomizedtesting.rules.StatementAdapter.evaluate(StatementAdapter.java:36)
at com.carrotsearch.randomizedtesting.ThreadLeakControl$StatementRunner.run(ThreadLeakControl.java:370)
at com.carrotsearch.randomizedtesting.ThreadLeakControl.forkTimeoutingTask(ThreadLeakControl.java:819)
at com.carrotsearch.randomizedtesting.ThreadLeakControl$3.evaluate(ThreadLeakControl.java:470)
at com.carrotsearch.randomizedtesting.RandomizedRunner.runSingleTest(RandomizedRunner.java:951)
at com.carrotsearch.randomizedtesting.RandomizedRunner$5.evaluate(RandomizedRunner.java:836)
at com.carrotsearch.randomizedtesting.RandomizedRunner$6.evaluate(RandomizedRunner.java:887)
at com.carrotsearch.randomizedtesting.RandomizedRunner$7.evaluate(RandomizedRunner.java:898)
at com.carrotsearch.randomizedtesting.rules.StatementAdapter.evaluate(StatementAdapter.java:36)
at com.carrotsearch.randomizedtesting.rules.SystemPropertiesRestoreRule$1.evaluate(SystemPropertiesRestoreRule.java:57)
at org.junit.rules.RunRules.evaluate(RunRules.java:20)
at org.apache.lucene.util.AbstractBeforeAfterRule$1.evaluate(AbstractBeforeAfterRule.java:43)
at com.carrotsearch.randomizedtesting.rules.StatementAdapter.evaluate(StatementAdapter.java:36)
at org.apache.lucene.util.TestRuleStoreClassName$1.evaluate(TestRuleStoreClassName.java:38)
at com.carrotsearch.randomizedtesting.rules.NoShadowingOrOverridesOnMethodsRule$1.evaluate(NoShadowingOrOverridesOnMethodsRule.java:40)
at com.carrotsearch.randomizedtesting.rules.NoShadowingOrOverridesOnMethodsRule$1.evaluate(NoShadowingOrOverridesOnMethodsRule.java:40)
at com.carrotsearch.randomizedtesting.rules.StatementAdapter.evaluate(StatementAdapter.java:36)
at com.carrotsearch.randomizedtesting.rules.StatementAdapter.evaluate(StatementAdapter.java:36)
at org.apache.lucene.util.TestRuleAssertionsRequired$1.evaluate(TestRuleAssertionsRequired.java:51)
at org.apache.lucene.util.AbstractBeforeAfterRule$1.evaluate(AbstractBeforeAfterRule.java:43)
at org.apache.lucene.util.TestRuleMarkFailure$1.evaluate(TestRuleMarkFailure.java:44)
at org.apache.lucene.util.TestRuleIgnoreAfterMaxFailures$1.evaluate(TestRuleIgnoreAfterMaxFailures.java:60)
at org.apache.lucene.util.TestRuleIgnoreTestSuites$1.evaluate(TestRuleIgnoreTestSuites.java:47)
at org.junit.rules.RunRules.evaluate(RunRules.java:20)
at com.carrotsearch.randomizedtesting.rules.StatementAdapter.evaluate(StatementAdapter.java:36)
at com.carrotsearch.randomizedtesting.ThreadLeakControl$StatementRunner.run(ThreadLeakControl.java:370)
at com.carrotsearch.randomizedtesting.ThreadLeakControl.lambda$forkTimeoutingTask$0(ThreadLeakControl.java:826)
at java.base/java.lang.Thread.run(Thread.java:834)
[JENKINS] Solr-main-MacOSX (64bit/jdk-14.0.1) - Build # 11 - Still
Unstable!
Posted by Policeman Jenkins Server <je...@thetaphi.de>.
Build: https://jenkins.thetaphi.de/job/Solr-main-MacOSX/11/
Java: 64bit/jdk-14.0.1 -XX:+UseCompressedOops -XX:+UseParallelGC
1 tests failed.
FAILED: org.apache.solr.cloud.HttpPartitionTest.test
Error Message:
org.apache.solr.client.solrj.SolrServerException: Timeout occurred while waiting response from server at: http://127.0.0.1:59722/_q/yp
Stack Trace:
org.apache.solr.client.solrj.SolrServerException: Timeout occurred while waiting response from server at: http://127.0.0.1:59722/_q/yp
at __randomizedtesting.SeedInfo.seed([D296FFB69DC51777:5AC2C06C33397A8F]:0)
at org.apache.solr.client.solrj.impl.HttpSolrClient.executeMethod(HttpSolrClient.java:709)
at org.apache.solr.client.solrj.impl.HttpSolrClient.request(HttpSolrClient.java:269)
at org.apache.solr.client.solrj.impl.HttpSolrClient.request(HttpSolrClient.java:251)
at org.apache.solr.client.solrj.impl.LBSolrClient.doRequest(LBSolrClient.java:390)
at org.apache.solr.client.solrj.impl.LBSolrClient.request(LBSolrClient.java:360)
at org.apache.solr.client.solrj.impl.BaseCloudSolrClient.sendRequest(BaseCloudSolrClient.java:1164)
at org.apache.solr.client.solrj.impl.BaseCloudSolrClient.requestWithRetryOnStaleState(BaseCloudSolrClient.java:927)
at org.apache.solr.client.solrj.impl.BaseCloudSolrClient.request(BaseCloudSolrClient.java:861)
at org.apache.solr.client.solrj.SolrRequest.process(SolrRequest.java:229)
at org.apache.solr.client.solrj.SolrRequest.process(SolrRequest.java:246)
at org.apache.solr.cloud.AbstractFullDistribZkTestBase.createServers(AbstractFullDistribZkTestBase.java:340)
at org.apache.solr.BaseDistributedSearchTestCase$ShardsRepeatRule$ShardsFixedStatement.callStatement(BaseDistributedSearchTestCase.java:1085)
at org.apache.solr.BaseDistributedSearchTestCase$ShardsRepeatRule$ShardsStatement.evaluate(BaseDistributedSearchTestCase.java:1058)
at com.carrotsearch.randomizedtesting.rules.SystemPropertiesRestoreRule$1.evaluate(SystemPropertiesRestoreRule.java:57)
at org.junit.rules.RunRules.evaluate(RunRules.java:20)
at org.apache.lucene.util.TestRuleSetupTeardownChained$1.evaluate(TestRuleSetupTeardownChained.java:44)
at org.apache.lucene.util.AbstractBeforeAfterRule$1.evaluate(AbstractBeforeAfterRule.java:43)
at org.apache.lucene.util.TestRuleThreadAndTestName$1.evaluate(TestRuleThreadAndTestName.java:45)
at org.apache.lucene.util.TestRuleIgnoreAfterMaxFailures$1.evaluate(TestRuleIgnoreAfterMaxFailures.java:60)
at org.apache.lucene.util.TestRuleMarkFailure$1.evaluate(TestRuleMarkFailure.java:44)
at org.junit.rules.RunRules.evaluate(RunRules.java:20)
at com.carrotsearch.randomizedtesting.rules.StatementAdapter.evaluate(StatementAdapter.java:36)
at com.carrotsearch.randomizedtesting.ThreadLeakControl$StatementRunner.run(ThreadLeakControl.java:370)
at com.carrotsearch.randomizedtesting.ThreadLeakControl.forkTimeoutingTask(ThreadLeakControl.java:819)
at com.carrotsearch.randomizedtesting.ThreadLeakControl$3.evaluate(ThreadLeakControl.java:470)
at com.carrotsearch.randomizedtesting.RandomizedRunner.runSingleTest(RandomizedRunner.java:951)
at com.carrotsearch.randomizedtesting.RandomizedRunner$5.evaluate(RandomizedRunner.java:836)
at com.carrotsearch.randomizedtesting.RandomizedRunner$6.evaluate(RandomizedRunner.java:887)
at com.carrotsearch.randomizedtesting.RandomizedRunner$7.evaluate(RandomizedRunner.java:898)
at com.carrotsearch.randomizedtesting.rules.StatementAdapter.evaluate(StatementAdapter.java:36)
at com.carrotsearch.randomizedtesting.rules.SystemPropertiesRestoreRule$1.evaluate(SystemPropertiesRestoreRule.java:57)
at org.junit.rules.RunRules.evaluate(RunRules.java:20)
at org.apache.lucene.util.AbstractBeforeAfterRule$1.evaluate(AbstractBeforeAfterRule.java:43)
at com.carrotsearch.randomizedtesting.rules.StatementAdapter.evaluate(StatementAdapter.java:36)
at org.apache.lucene.util.TestRuleStoreClassName$1.evaluate(TestRuleStoreClassName.java:38)
at com.carrotsearch.randomizedtesting.rules.NoShadowingOrOverridesOnMethodsRule$1.evaluate(NoShadowingOrOverridesOnMethodsRule.java:40)
at com.carrotsearch.randomizedtesting.rules.NoShadowingOrOverridesOnMethodsRule$1.evaluate(NoShadowingOrOverridesOnMethodsRule.java:40)
at com.carrotsearch.randomizedtesting.rules.StatementAdapter.evaluate(StatementAdapter.java:36)
at com.carrotsearch.randomizedtesting.rules.StatementAdapter.evaluate(StatementAdapter.java:36)
at org.apache.lucene.util.TestRuleAssertionsRequired$1.evaluate(TestRuleAssertionsRequired.java:51)
at org.apache.lucene.util.AbstractBeforeAfterRule$1.evaluate(AbstractBeforeAfterRule.java:43)
at org.apache.lucene.util.TestRuleMarkFailure$1.evaluate(TestRuleMarkFailure.java:44)
at org.apache.lucene.util.TestRuleIgnoreAfterMaxFailures$1.evaluate(TestRuleIgnoreAfterMaxFailures.java:60)
at org.apache.lucene.util.TestRuleIgnoreTestSuites$1.evaluate(TestRuleIgnoreTestSuites.java:47)
at org.junit.rules.RunRules.evaluate(RunRules.java:20)
at com.carrotsearch.randomizedtesting.rules.StatementAdapter.evaluate(StatementAdapter.java:36)
at com.carrotsearch.randomizedtesting.ThreadLeakControl$StatementRunner.run(ThreadLeakControl.java:370)
at com.carrotsearch.randomizedtesting.ThreadLeakControl.lambda$forkTimeoutingTask$0(ThreadLeakControl.java:826)
at java.base/java.lang.Thread.run(Thread.java:832)
Caused by: java.net.SocketTimeoutException: Read timed out
at java.base/sun.nio.ch.NioSocketImpl.timedRead(NioSocketImpl.java:283)
at java.base/sun.nio.ch.NioSocketImpl.implRead(NioSocketImpl.java:309)
at java.base/sun.nio.ch.NioSocketImpl.read(NioSocketImpl.java:350)
at java.base/sun.nio.ch.NioSocketImpl$1.read(NioSocketImpl.java:803)
at java.base/java.net.Socket$SocketInputStream.read(Socket.java:982)
at org.apache.http.impl.io.SessionInputBufferImpl.streamRead(SessionInputBufferImpl.java:137)
at org.apache.http.impl.io.SessionInputBufferImpl.fillBuffer(SessionInputBufferImpl.java:153)
at org.apache.http.impl.io.SessionInputBufferImpl.readLine(SessionInputBufferImpl.java:280)
at org.apache.http.impl.conn.DefaultHttpResponseParser.parseHead(DefaultHttpResponseParser.java:138)
at org.apache.http.impl.conn.DefaultHttpResponseParser.parseHead(DefaultHttpResponseParser.java:56)
at org.apache.http.impl.io.AbstractMessageParser.parse(AbstractMessageParser.java:259)
at org.apache.http.impl.DefaultBHttpClientConnection.receiveResponseHeader(DefaultBHttpClientConnection.java:163)
at org.apache.http.impl.conn.CPoolProxy.receiveResponseHeader(CPoolProxy.java:157)
at org.apache.http.protocol.HttpRequestExecutor.doReceiveResponse(HttpRequestExecutor.java:273)
at org.apache.http.protocol.HttpRequestExecutor.execute(HttpRequestExecutor.java:125)
at org.apache.http.impl.execchain.MainClientExec.execute(MainClientExec.java:272)
at org.apache.http.impl.execchain.ProtocolExec.execute(ProtocolExec.java:186)
at org.apache.http.impl.execchain.RetryExec.execute(RetryExec.java:89)
at org.apache.http.impl.execchain.RedirectExec.execute(RedirectExec.java:110)
at org.apache.http.impl.client.InternalHttpClient.doExecute(InternalHttpClient.java:185)
at org.apache.http.impl.client.CloseableHttpClient.execute(CloseableHttpClient.java:83)
at org.apache.http.impl.client.CloseableHttpClient.execute(CloseableHttpClient.java:56)
at org.apache.solr.client.solrj.impl.HttpSolrClient.executeMethod(HttpSolrClient.java:582)
... 48 more
[JENKINS] Solr-main-MacOSX (64bit/jdk-15) - Build # 10 - Still
Unstable!
Posted by Policeman Jenkins Server <je...@thetaphi.de>.
Build: https://jenkins.thetaphi.de/job/Solr-main-MacOSX/10/
Java: 64bit/jdk-15 -XX:+UseCompressedOops -XX:+UseSerialGC
1 tests failed.
FAILED: org.apache.solr.cloud.DeleteReplicaTest.deleteReplicaAndVerifyDirectoryCleanup
Error Message:
org.apache.solr.common.SolrException: No registered leader was found after waiting for 4000ms , collection: deletereplica_test slice: shard1 saw state=DocCollection(deletereplica_test//collections/deletereplica_test/state.json/10 )={
"pullReplicas":"0",
"replicationFactor":"2",
"shards":{"shard1":{
"range":"80000000-7fffffff",
"state":"active",
"replicas":{"core_node3":{
"core":"deletereplica_test_shard1_replica_n1",
"leader":"true",
"core_node_name":"core_node3",
"node_name":"127.0.0.1:56683_solr",
"state":"active",
"collection":"deletereplica_test",
"shard":"shard1",
"type":"NRT",
"force_set_state":"false"}}}},
"router":{"name":"compositeId"},
"nrtReplicas":"2",
"tlogReplicas":"0"} with live_nodes=[127.0.0.1:56683_solr, 127.0.0.1:56684_solr, 127.0.0.1:56682_solr, 127.0.0.1:56685_solr]
Stack Trace:
org.apache.solr.common.SolrException: No registered leader was found after waiting for 4000ms , collection: deletereplica_test slice: shard1 saw state=DocCollection(deletereplica_test//collections/deletereplica_test/state.json/10 )={
"pullReplicas":"0",
"replicationFactor":"2",
"shards":{"shard1":{
"range":"80000000-7fffffff",
"state":"active",
"replicas":{"core_node3":{
"core":"deletereplica_test_shard1_replica_n1",
"leader":"true",
"core_node_name":"core_node3",
"node_name":"127.0.0.1:56683_solr",
"state":"active",
"collection":"deletereplica_test",
"shard":"shard1",
"type":"NRT",
"force_set_state":"false"}}}},
"router":{"name":"compositeId"},
"nrtReplicas":"2",
"tlogReplicas":"0"} with live_nodes=[127.0.0.1:56683_solr, 127.0.0.1:56684_solr, 127.0.0.1:56682_solr, 127.0.0.1:56685_solr]
at __randomizedtesting.SeedInfo.seed([152E948800FA29C8:65CE103284B580C3]:0)
at org.apache.solr.common.cloud.ZkStateReader.getLeaderRetry(ZkStateReader.java:874)
at org.apache.solr.common.cloud.ZkStateReader.getLeaderRetry(ZkStateReader.java:849)
at org.apache.solr.cloud.DeleteReplicaTest.deleteReplicaAndVerifyDirectoryCleanup(DeleteReplicaTest.java:165)
at java.base/jdk.internal.reflect.NativeMethodAccessorImpl.invoke0(Native Method)
at java.base/jdk.internal.reflect.NativeMethodAccessorImpl.invoke(NativeMethodAccessorImpl.java:64)
at java.base/jdk.internal.reflect.DelegatingMethodAccessorImpl.invoke(DelegatingMethodAccessorImpl.java:43)
at java.base/java.lang.reflect.Method.invoke(Method.java:564)
at com.carrotsearch.randomizedtesting.RandomizedRunner.invoke(RandomizedRunner.java:1754)
at com.carrotsearch.randomizedtesting.RandomizedRunner$8.evaluate(RandomizedRunner.java:942)
at com.carrotsearch.randomizedtesting.RandomizedRunner$9.evaluate(RandomizedRunner.java:978)
at com.carrotsearch.randomizedtesting.RandomizedRunner$10.evaluate(RandomizedRunner.java:992)
at com.carrotsearch.randomizedtesting.rules.SystemPropertiesRestoreRule$1.evaluate(SystemPropertiesRestoreRule.java:57)
at org.junit.rules.RunRules.evaluate(RunRules.java:20)
at org.apache.lucene.util.TestRuleSetupTeardownChained$1.evaluate(TestRuleSetupTeardownChained.java:44)
at org.apache.lucene.util.AbstractBeforeAfterRule$1.evaluate(AbstractBeforeAfterRule.java:43)
at org.apache.lucene.util.TestRuleThreadAndTestName$1.evaluate(TestRuleThreadAndTestName.java:45)
at org.apache.lucene.util.TestRuleIgnoreAfterMaxFailures$1.evaluate(TestRuleIgnoreAfterMaxFailures.java:60)
at org.apache.lucene.util.TestRuleMarkFailure$1.evaluate(TestRuleMarkFailure.java:44)
at org.junit.rules.RunRules.evaluate(RunRules.java:20)
at com.carrotsearch.randomizedtesting.rules.StatementAdapter.evaluate(StatementAdapter.java:36)
at com.carrotsearch.randomizedtesting.ThreadLeakControl$StatementRunner.run(ThreadLeakControl.java:370)
at com.carrotsearch.randomizedtesting.ThreadLeakControl.forkTimeoutingTask(ThreadLeakControl.java:819)
at com.carrotsearch.randomizedtesting.ThreadLeakControl$3.evaluate(ThreadLeakControl.java:470)
at com.carrotsearch.randomizedtesting.RandomizedRunner.runSingleTest(RandomizedRunner.java:951)
at com.carrotsearch.randomizedtesting.RandomizedRunner$5.evaluate(RandomizedRunner.java:836)
at com.carrotsearch.randomizedtesting.RandomizedRunner$6.evaluate(RandomizedRunner.java:887)
at com.carrotsearch.randomizedtesting.RandomizedRunner$7.evaluate(RandomizedRunner.java:898)
at com.carrotsearch.randomizedtesting.rules.StatementAdapter.evaluate(StatementAdapter.java:36)
at com.carrotsearch.randomizedtesting.rules.SystemPropertiesRestoreRule$1.evaluate(SystemPropertiesRestoreRule.java:57)
at org.junit.rules.RunRules.evaluate(RunRules.java:20)
at org.apache.lucene.util.AbstractBeforeAfterRule$1.evaluate(AbstractBeforeAfterRule.java:43)
at com.carrotsearch.randomizedtesting.rules.StatementAdapter.evaluate(StatementAdapter.java:36)
at org.apache.lucene.util.TestRuleStoreClassName$1.evaluate(TestRuleStoreClassName.java:38)
at com.carrotsearch.randomizedtesting.rules.NoShadowingOrOverridesOnMethodsRule$1.evaluate(NoShadowingOrOverridesOnMethodsRule.java:40)
at com.carrotsearch.randomizedtesting.rules.NoShadowingOrOverridesOnMethodsRule$1.evaluate(NoShadowingOrOverridesOnMethodsRule.java:40)
at com.carrotsearch.randomizedtesting.rules.StatementAdapter.evaluate(StatementAdapter.java:36)
at com.carrotsearch.randomizedtesting.rules.StatementAdapter.evaluate(StatementAdapter.java:36)
at org.apache.lucene.util.TestRuleAssertionsRequired$1.evaluate(TestRuleAssertionsRequired.java:51)
at org.apache.lucene.util.AbstractBeforeAfterRule$1.evaluate(AbstractBeforeAfterRule.java:43)
at org.apache.lucene.util.TestRuleMarkFailure$1.evaluate(TestRuleMarkFailure.java:44)
at org.apache.lucene.util.TestRuleIgnoreAfterMaxFailures$1.evaluate(TestRuleIgnoreAfterMaxFailures.java:60)
at org.apache.lucene.util.TestRuleIgnoreTestSuites$1.evaluate(TestRuleIgnoreTestSuites.java:47)
at org.junit.rules.RunRules.evaluate(RunRules.java:20)
at com.carrotsearch.randomizedtesting.rules.StatementAdapter.evaluate(StatementAdapter.java:36)
at com.carrotsearch.randomizedtesting.ThreadLeakControl$StatementRunner.run(ThreadLeakControl.java:370)
at com.carrotsearch.randomizedtesting.ThreadLeakControl.lambda$forkTimeoutingTask$0(ThreadLeakControl.java:826)
at java.base/java.lang.Thread.run(Thread.java:832)