You are viewing a plain text version of this content. The canonical link for it is here.
Posted to dev@zookeeper.apache.org by Apache Jenkins Server <je...@builds.apache.org> on 2016/03/21 14:08:59 UTC

ZooKeeper_branch35_jdk8 - Build # 22 - Failure

See https://builds.apache.org/job/ZooKeeper_branch35_jdk8/22/

###################################################################################
########################## LAST 60 LINES OF THE CONSOLE ###########################
[...truncated 413270 lines...]
    [junit] 	at org.apache.zookeeper.server.NettyServerCnxnFactory$CnxnChannelHandler.messageReceived(NettyServerCnxnFactory.java:165)
    [junit] 	at org.jboss.netty.channel.SimpleChannelHandler.handleUpstream(SimpleChannelHandler.java:88)
    [junit] 	at org.jboss.netty.channel.DefaultChannelPipeline.sendUpstream(DefaultChannelPipeline.java:564)
    [junit] 	at org.jboss.netty.channel.DefaultChannelPipeline.sendUpstream(DefaultChannelPipeline.java:559)
    [junit] 	at org.jboss.netty.channel.Channels.fireMessageReceived(Channels.java:268)
    [junit] 	at org.jboss.netty.channel.Channels.fireMessageReceived(Channels.java:255)
    [junit] 	at org.jboss.netty.channel.socket.nio.NioWorker.read(NioWorker.java:88)
    [junit] 	at org.jboss.netty.channel.socket.nio.AbstractNioWorker.process(AbstractNioWorker.java:109)
    [junit] 	at org.jboss.netty.channel.socket.nio.AbstractNioSelector.run(AbstractNioSelector.java:312)
    [junit] 	at org.jboss.netty.channel.socket.nio.AbstractNioWorker.run(AbstractNioWorker.java:90)
    [junit] 	at org.jboss.netty.channel.socket.nio.NioWorker.run(NioWorker.java:178)
    [junit] 	at org.jboss.netty.util.ThreadRenamingRunnable.run(ThreadRenamingRunnable.java:108)
    [junit] 	at org.jboss.netty.util.internal.DeadLockProofWorker$1.run(DeadLockProofWorker.java:42)
    [junit] 	at java.util.concurrent.ThreadPoolExecutor.runWorker(ThreadPoolExecutor.java:1142)
    [junit] 	at java.util.concurrent.ThreadPoolExecutor$Worker.run(ThreadPoolExecutor.java:617)
    [junit] 	at java.lang.Thread.run(Thread.java:745)
    [junit] 2016-03-21 13:08:53,536 [myid:] - INFO  [New I/O worker #3769:ClientCnxnSocketNetty$ZKClientHandler@377] - channel is disconnected: [id: 0x05403b90, /127.0.0.1:58659 :> 127.0.0.1/127.0.0.1:16623]
    [junit] 2016-03-21 13:08:53,536 [myid:] - INFO  [New I/O worker #3769:ClientCnxnSocketNetty@201] - channel is told closing
    [junit] 2016-03-21 13:08:53,537 [myid:127.0.0.1:16623] - INFO  [main-SendThread(127.0.0.1:16623):ClientCnxn$SendThread@1258] - channel for sessionid 0x0 is lost, closing socket connection and attempting reconnect
    [junit] 2016-03-21 13:08:54,271 [myid:127.0.0.1:16623] - INFO  [main-SendThread(127.0.0.1:16623):ClientCnxn$SendThread@1140] - Opening socket connection to server 127.0.0.1/127.0.0.1:16623. Will not attempt to authenticate using SASL (unknown error)
    [junit] 2016-03-21 13:08:54,272 [myid:] - INFO  [New I/O worker #3620:ClientCnxn$SendThread@981] - Socket connection established, initiating session, client: /127.0.0.1:58664, server: 127.0.0.1/127.0.0.1:16623
    [junit] 2016-03-21 13:08:54,272 [myid:] - INFO  [New I/O worker #3620:ClientCnxnSocketNetty$1@146] - channel is connected: [id: 0xe4077fa5, /127.0.0.1:58664 => 127.0.0.1/127.0.0.1:16623]
    [junit] 2016-03-21 13:08:54,273 [myid:] - WARN  [New I/O worker #143:NettyServerCnxn@399] - Closing connection to /127.0.0.1:58664
    [junit] java.io.IOException: ZK down
    [junit] 	at org.apache.zookeeper.server.NettyServerCnxn.receiveMessage(NettyServerCnxn.java:336)
    [junit] 	at org.apache.zookeeper.server.NettyServerCnxnFactory$CnxnChannelHandler.processMessage(NettyServerCnxnFactory.java:243)
    [junit] 	at org.apache.zookeeper.server.NettyServerCnxnFactory$CnxnChannelHandler.messageReceived(NettyServerCnxnFactory.java:165)
    [junit] 	at org.jboss.netty.channel.SimpleChannelHandler.handleUpstream(SimpleChannelHandler.java:88)
    [junit] 	at org.jboss.netty.channel.DefaultChannelPipeline.sendUpstream(DefaultChannelPipeline.java:564)
    [junit] 	at org.jboss.netty.channel.DefaultChannelPipeline.sendUpstream(DefaultChannelPipeline.java:559)
    [junit] 	at org.jboss.netty.channel.Channels.fireMessageReceived(Channels.java:268)
    [junit] 	at org.jboss.netty.channel.Channels.fireMessageReceived(Channels.java:255)
    [junit] 	at org.jboss.netty.channel.socket.nio.NioWorker.read(NioWorker.java:88)
    [junit] 	at org.jboss.netty.channel.socket.nio.AbstractNioWorker.process(AbstractNioWorker.java:109)
    [junit] 	at org.jboss.netty.channel.socket.nio.AbstractNioSelector.run(AbstractNioSelector.java:312)
    [junit] 	at org.jboss.netty.channel.socket.nio.AbstractNioWorker.run(AbstractNioWorker.java:90)
    [junit] 	at org.jboss.netty.channel.socket.nio.NioWorker.run(NioWorker.java:178)
    [junit] 	at org.jboss.netty.util.ThreadRenamingRunnable.run(ThreadRenamingRunnable.java:108)
    [junit] 	at org.jboss.netty.util.internal.DeadLockProofWorker$1.run(DeadLockProofWorker.java:42)
    [junit] 	at java.util.concurrent.ThreadPoolExecutor.runWorker(ThreadPoolExecutor.java:1142)
    [junit] 	at java.util.concurrent.ThreadPoolExecutor$Worker.run(ThreadPoolExecutor.java:617)
    [junit] 	at java.lang.Thread.run(Thread.java:745)
    [junit] 2016-03-21 13:08:54,274 [myid:] - INFO  [New I/O worker #3620:ClientCnxnSocketNetty$ZKClientHandler@377] - channel is disconnected: [id: 0xe4077fa5, /127.0.0.1:58664 :> 127.0.0.1/127.0.0.1:16623]
    [junit] 2016-03-21 13:08:54,274 [myid:] - INFO  [New I/O worker #3620:ClientCnxnSocketNetty@201] - channel is told closing
    [junit] 2016-03-21 13:08:54,274 [myid:127.0.0.1:16623] - INFO  [main-SendThread(127.0.0.1:16623):ClientCnxn$SendThread@1258] - channel for sessionid 0x0 is lost, closing socket connection and attempting reconnect
    [junit] Running org.apache.zookeeper.test.NettyNettySuiteHammerTest in thread 3
    [junit] Tests run: 1, Failures: 0, Errors: 1, Skipped: 0, Time elapsed: 0 sec, Thread: 3, Class: org.apache.zookeeper.test.NettyNettySuiteHammerTest
    [junit] Test org.apache.zookeeper.test.NettyNettySuiteHammerTest FAILED (timeout)

BUILD FAILED
/home/jenkins/jenkins-slave/workspace/ZooKeeper_branch35_jdk8/branch-3.5/build.xml:1322: The following error occurred while executing this line:
/home/jenkins/jenkins-slave/workspace/ZooKeeper_branch35_jdk8/branch-3.5/build.xml:1207: Tests failed!

Total time: 20 minutes 34 seconds
Build step 'Invoke Ant' marked build as failure
Archiving artifacts
Recording test results
Email was triggered for: Failure - Any
Sending email for trigger: Failure - Any



###################################################################################
############################## FAILED TESTS (if any) ##############################
1 tests failed.
FAILED:  org.apache.zookeeper.test.NettyNettySuiteHammerTest.testHammer

Error Message:
Timeout occurred. Please note the time in the report does not reflect the time until the timeout.

Stack Trace:
junit.framework.AssertionFailedError: Timeout occurred. Please note the time in the report does not reflect the time until the timeout.
	at java.lang.Thread.run(Thread.java:745)



ZooKeeper_branch35_jdk8 - Build # 24 - Still Failing

Posted by Apache Jenkins Server <je...@builds.apache.org>.
See https://builds.apache.org/job/ZooKeeper_branch35_jdk8/24/

###################################################################################
########################## LAST 60 LINES OF THE CONSOLE ###########################
[...truncated 383744 lines...]
    [junit] 2016-03-22 13:00:11,188 [myid:] - INFO  [main:SessionTrackerImpl@232] - Shutting down
    [junit] 2016-03-22 13:00:11,188 [myid:] - INFO  [main:PrepRequestProcessor@967] - Shutting down
    [junit] 2016-03-22 13:00:11,188 [myid:] - INFO  [main:SyncRequestProcessor@191] - Shutting down
    [junit] 2016-03-22 13:00:11,188 [myid:] - INFO  [ProcessThread(sid:0 cport:24693)::PrepRequestProcessor@154] - PrepRequestProcessor exited loop!
    [junit] 2016-03-22 13:00:11,188 [myid:] - INFO  [SyncThread:0:SyncRequestProcessor@169] - SyncRequestProcessor exited!
    [junit] 2016-03-22 13:00:11,188 [myid:] - INFO  [main:FinalRequestProcessor@492] - shutdown of request processor complete
    [junit] 2016-03-22 13:00:11,189 [myid:] - INFO  [main:MBeanRegistry@128] - Unregister MBean [org.apache.ZooKeeperService:name0=StandaloneServer_port24693,name1=InMemoryDataTree]
    [junit] 2016-03-22 13:00:11,189 [myid:] - INFO  [main:MBeanRegistry@128] - Unregister MBean [org.apache.ZooKeeperService:name0=StandaloneServer_port24693]
    [junit] 2016-03-22 13:00:11,190 [myid:] - INFO  [main:FourLetterWordMain@85] - connecting to 127.0.0.1 24693
    [junit] 2016-03-22 13:00:11,190 [myid:] - INFO  [main:JMXEnv@146] - ensureOnly:[]
    [junit] 2016-03-22 13:00:11,193 [myid:] - INFO  [main:ClientBase@562] - fdcount after test is: 49 at start it was 49
    [junit] 2016-03-22 13:00:11,193 [myid:] - INFO  [main:ZKTestCase$1@65] - SUCCEEDED testWatcherAutoResetWithLocal
    [junit] 2016-03-22 13:00:11,193 [myid:] - INFO  [main:ZKTestCase$1@60] - FINISHED testWatcherAutoResetWithLocal
    [junit] Tests run: 7, Failures: 0, Errors: 0, Skipped: 0, Time elapsed: 29.649 sec, Thread: 6, Class: org.apache.zookeeper.test.WatcherTest
    [junit] 2016-03-22 13:02:50,611 [myid:] - INFO  [main:JUnit4ZKTestRunner$LoggedInvokeMethod@82] - Memory used 133635
    [junit] 2016-03-22 13:02:50,612 [myid:] - INFO  [main:JUnit4ZKTestRunner$LoggedInvokeMethod@87] - Number of threads 55
    [junit] 2016-03-22 13:02:50,612 [myid:] - INFO  [main:JUnit4ZKTestRunner$LoggedInvokeMethod@102] - FINISHED TEST METHOD testManyChildWatchersAutoReset
    [junit] 2016-03-22 13:02:50,612 [myid:] - INFO  [main:ClientBase@537] - tearDown starting
    [junit] 2016-03-22 13:02:50,613 [myid:] - INFO  [ProcessThread(sid:0 cport:27383)::PrepRequestProcessor@649] - Processed session termination for sessionid: 0x100f74365470000
    [junit] 2016-03-22 13:02:50,628 [myid:] - INFO  [main:ZooKeeper@1110] - Session: 0x100f74365470000 closed
    [junit] 2016-03-22 13:02:50,628 [myid:] - INFO  [NIOWorkerThread-29:MBeanRegistry@128] - Unregister MBean [org.apache.ZooKeeperService:name0=StandaloneServer_port27383,name1=Connections,name2=127.0.0.1,name3=0x100f74365470000]
    [junit] 2016-03-22 13:02:50,628 [myid:] - INFO  [main-EventThread:ClientCnxn$EventThread@543] - EventThread shut down for session: 0x100f74365470000
    [junit] 2016-03-22 13:02:50,629 [myid:] - INFO  [ProcessThread(sid:0 cport:27383)::PrepRequestProcessor@649] - Processed session termination for sessionid: 0x100f74365470001
    [junit] 2016-03-22 13:02:50,631 [myid:] - INFO  [NIOWorkerThread-29:NIOServerCnxn@607] - Closed socket connection for client /127.0.0.1:46846 which had sessionid 0x100f74365470000
    [junit] 2016-03-22 13:02:50,636 [myid:] - INFO  [main:ZooKeeper@1110] - Session: 0x100f74365470001 closed
    [junit] 2016-03-22 13:02:50,636 [myid:] - INFO  [NIOWorkerThread-14:MBeanRegistry@128] - Unregister MBean [org.apache.ZooKeeperService:name0=StandaloneServer_port27383,name1=Connections,name2=127.0.0.1,name3=0x100f74365470001]
    [junit] 2016-03-22 13:02:50,636 [myid:] - INFO  [main:ClientBase@507] - STOPPING server
    [junit] 2016-03-22 13:02:50,636 [myid:] - INFO  [main-EventThread:ClientCnxn$EventThread@543] - EventThread shut down for session: 0x100f74365470001
    [junit] 2016-03-22 13:02:50,637 [myid:] - INFO  [NIOWorkerThread-14:NIOServerCnxn@607] - Closed socket connection for client /127.0.0.1:46847 which had sessionid 0x100f74365470001
    [junit] 2016-03-22 13:02:50,638 [myid:] - INFO  [ConnnectionExpirer:NIOServerCnxnFactory$ConnectionExpirerThread@583] - ConnnectionExpirerThread interrupted
    [junit] 2016-03-22 13:02:50,640 [myid:] - INFO  [NIOServerCxnFactory.AcceptThread:0.0.0.0/0.0.0.0:27383:NIOServerCnxnFactory$AcceptThread@219] - accept thread exitted run method
    [junit] 2016-03-22 13:02:50,646 [myid:] - INFO  [NIOServerCxnFactory.SelectorThread-1:NIOServerCnxnFactory$SelectorThread@420] - selector thread exitted run method
    [junit] 2016-03-22 13:02:50,646 [myid:] - INFO  [NIOServerCxnFactory.SelectorThread-0:NIOServerCnxnFactory$SelectorThread@420] - selector thread exitted run method
    [junit] 2016-03-22 13:02:50,647 [myid:] - INFO  [main:ZooKeeperServer@498] - shutting down
    [junit] 2016-03-22 13:02:50,647 [myid:] - INFO  [main:SessionTrackerImpl@232] - Shutting down
    [junit] 2016-03-22 13:02:50,647 [myid:] - INFO  [main:PrepRequestProcessor@967] - Shutting down
    [junit] 2016-03-22 13:02:50,647 [myid:] - INFO  [main:SyncRequestProcessor@191] - Shutting down
    [junit] 2016-03-22 13:02:50,647 [myid:] - INFO  [ProcessThread(sid:0 cport:27383)::PrepRequestProcessor@154] - PrepRequestProcessor exited loop!
    [junit] 2016-03-22 13:02:50,647 [myid:] - INFO  [SyncThread:0:SyncRequestProcessor@169] - SyncRequestProcessor exited!
    [junit] 2016-03-22 13:02:50,648 [myid:] - INFO  [main:FinalRequestProcessor@492] - shutdown of request processor complete
    [junit] 2016-03-22 13:02:50,648 [myid:] - INFO  [main:MBeanRegistry@128] - Unregister MBean [org.apache.ZooKeeperService:name0=StandaloneServer_port27383,name1=InMemoryDataTree]
    [junit] 2016-03-22 13:02:50,648 [myid:] - INFO  [main:MBeanRegistry@128] - Unregister MBean [org.apache.ZooKeeperService:name0=StandaloneServer_port27383]
    [junit] 2016-03-22 13:02:50,649 [myid:] - INFO  [main:FourLetterWordMain@85] - connecting to 127.0.0.1 27383
    [junit] 2016-03-22 13:02:50,650 [myid:] - INFO  [main:JMXEnv@146] - ensureOnly:[]
    [junit] 2016-03-22 13:02:50,657 [myid:] - INFO  [main:ClientBase@562] - fdcount after test is: 53 at start it was 53
    [junit] 2016-03-22 13:02:50,657 [myid:] - INFO  [main:ZKTestCase$1@65] - SUCCEEDED testManyChildWatchersAutoReset
    [junit] 2016-03-22 13:02:50,657 [myid:] - INFO  [main:ZKTestCase$1@60] - FINISHED testManyChildWatchersAutoReset
    [junit] Tests run: 4, Failures: 0, Errors: 0, Skipped: 0, Time elapsed: 516.485 sec, Thread: 7, Class: org.apache.zookeeper.test.DisconnectedWatcherTest

BUILD FAILED
/home/jenkins/jenkins-slave/workspace/ZooKeeper_branch35_jdk8/branch-3.5/build.xml:1322: The following error occurred while executing this line:
/home/jenkins/jenkins-slave/workspace/ZooKeeper_branch35_jdk8/branch-3.5/build.xml:1207: Tests failed!

Total time: 11 minutes 40 seconds
Build step 'Invoke Ant' marked build as failure
Archiving artifacts
Recording test results
Email was triggered for: Failure - Any
Sending email for trigger: Failure - Any



###################################################################################
############################## FAILED TESTS (if any) ##############################
2 tests failed.
FAILED:  org.apache.zookeeper.test.ReconfigTest.testPortChange

Error Message:
expected:<test[1]> but was:<test[0]>

Stack Trace:
junit.framework.AssertionFailedError: expected:<test[1]> but was:<test[0]>
	at org.apache.zookeeper.test.ReconfigTest.testNormalOperation(ReconfigTest.java:150)
	at org.apache.zookeeper.test.ReconfigTest.testPortChange(ReconfigTest.java:598)
	at org.apache.zookeeper.JUnit4ZKTestRunner$LoggedInvokeMethod.evaluate(JUnit4ZKTestRunner.java:79)


FAILED:  org.apache.zookeeper.test.SSLTest.testSecureQuorumServer

Error Message:
waiting for server 0 being up

Stack Trace:
junit.framework.AssertionFailedError: waiting for server 0 being up
	at org.apache.zookeeper.test.SSLTest.testSecureQuorumServer(SSLTest.java:99)
	at org.apache.zookeeper.JUnit4ZKTestRunner$LoggedInvokeMethod.evaluate(JUnit4ZKTestRunner.java:79)



ZooKeeper_branch35_jdk8 - Build # 23 - Still Failing

Posted by Apache Jenkins Server <je...@builds.apache.org>.
See https://builds.apache.org/job/ZooKeeper_branch35_jdk8/23/

###################################################################################
########################## LAST 60 LINES OF THE CONSOLE ###########################
[...truncated 375448 lines...]
    [junit] 2016-03-21 22:10:56,221 [myid:] - INFO  [ConnnectionExpirer:NIOServerCnxnFactory$ConnectionExpirerThread@583] - ConnnectionExpirerThread interrupted
    [junit] 2016-03-21 22:10:56,221 [myid:] - WARN  [LearnerHandler-/127.0.0.1:58510:LearnerHandler@903] - Ignoring unexpected exception
    [junit] java.lang.InterruptedException
    [junit] 	at java.util.concurrent.locks.AbstractQueuedSynchronizer.acquireInterruptibly(AbstractQueuedSynchronizer.java:1220)
    [junit] 	at java.util.concurrent.locks.ReentrantLock.lockInterruptibly(ReentrantLock.java:335)
    [junit] 	at java.util.concurrent.LinkedBlockingQueue.put(LinkedBlockingQueue.java:339)
    [junit] 	at org.apache.zookeeper.server.quorum.LearnerHandler.shutdown(LearnerHandler.java:901)
    [junit] 	at org.apache.zookeeper.server.quorum.LearnerHandler.run(LearnerHandler.java:622)
    [junit] 2016-03-21 22:10:56,222 [myid:] - INFO  [NIOServerCxnFactory.AcceptThread:/127.0.0.1:11363:NIOServerCnxnFactory$AcceptThread@219] - accept thread exitted run method
    [junit] 2016-03-21 22:10:56,221 [myid:] - WARN  [LearnerHandler-/127.0.0.1:58512:LearnerHandler@619] - ******* GOODBYE /127.0.0.1:58512 ********
    [junit] 2016-03-21 22:10:56,223 [myid:] - WARN  [LearnerHandler-/127.0.0.1:58512:LearnerHandler@903] - Ignoring unexpected exception
    [junit] java.lang.InterruptedException
    [junit] 	at java.util.concurrent.locks.AbstractQueuedSynchronizer.acquireInterruptibly(AbstractQueuedSynchronizer.java:1220)
    [junit] 	at java.util.concurrent.locks.ReentrantLock.lockInterruptibly(ReentrantLock.java:335)
    [junit] 	at java.util.concurrent.LinkedBlockingQueue.put(LinkedBlockingQueue.java:339)
    [junit] 	at org.apache.zookeeper.server.quorum.LearnerHandler.shutdown(LearnerHandler.java:901)
    [junit] 	at org.apache.zookeeper.server.quorum.LearnerHandler.run(LearnerHandler.java:622)
    [junit] 2016-03-21 22:10:56,223 [myid:] - INFO  [QuorumPeer[myid=5](plain=/127.0.0.1:11363)(secure=disabled):MBeanRegistry@128] - Unregister MBean [org.apache.ZooKeeperService:name0=ReplicatedServer_id5,name1=replica.5,name2=Leader]
    [junit] 2016-03-21 22:10:56,223 [myid:] - WARN  [QuorumPeer[myid=5](plain=/127.0.0.1:11363)(secure=disabled):QuorumPeer@1126] - Unexpected exception
    [junit] java.lang.InterruptedException
    [junit] 	at java.lang.Object.wait(Native Method)
    [junit] 	at org.apache.zookeeper.server.quorum.Leader.lead(Leader.java:559)
    [junit] 	at org.apache.zookeeper.server.quorum.QuorumPeer.run(QuorumPeer.java:1123)
    [junit] 2016-03-21 22:10:56,223 [myid:] - INFO  [QuorumPeer[myid=5](plain=/127.0.0.1:11363)(secure=disabled):Leader@613] - Shutting down
    [junit] 2016-03-21 22:10:56,223 [myid:] - WARN  [QuorumPeer[myid=5](plain=/127.0.0.1:11363)(secure=disabled):QuorumPeer@1157] - PeerState set to LOOKING
    [junit] 2016-03-21 22:10:56,223 [myid:] - WARN  [QuorumPeer[myid=5](plain=/127.0.0.1:11363)(secure=disabled):QuorumPeer@1139] - QuorumPeer main thread exited
    [junit] 2016-03-21 22:10:56,223 [myid:] - INFO  [QuorumPeer[myid=5](plain=/127.0.0.1:11363)(secure=disabled):MBeanRegistry@128] - Unregister MBean [org.apache.ZooKeeperService:name0=ReplicatedServer_id5]
    [junit] 2016-03-21 22:10:56,223 [myid:] - INFO  [QuorumPeer[myid=5](plain=/127.0.0.1:11363)(secure=disabled):MBeanRegistry@128] - Unregister MBean [org.apache.ZooKeeperService:name0=ReplicatedServer_id5,name1=replica.5]
    [junit] 2016-03-21 22:10:56,223 [myid:] - INFO  [QuorumPeer[myid=5](plain=/127.0.0.1:11363)(secure=disabled):MBeanRegistry@128] - Unregister MBean [org.apache.ZooKeeperService:name0=ReplicatedServer_id5,name1=replica.1]
    [junit] 2016-03-21 22:10:56,223 [myid:] - INFO  [QuorumPeer[myid=5](plain=/127.0.0.1:11363)(secure=disabled):MBeanRegistry@128] - Unregister MBean [org.apache.ZooKeeperService:name0=ReplicatedServer_id5,name1=replica.2]
    [junit] 2016-03-21 22:10:56,223 [myid:] - INFO  [QuorumPeer[myid=5](plain=/127.0.0.1:11363)(secure=disabled):MBeanRegistry@128] - Unregister MBean [org.apache.ZooKeeperService:name0=ReplicatedServer_id5,name1=replica.3]
    [junit] 2016-03-21 22:10:56,224 [myid:] - INFO  [/127.0.0.1:11365:QuorumCnxManager$Listener@659] - Leaving listener
    [junit] 2016-03-21 22:10:56,225 [myid:] - INFO  [main:QuorumUtil@254] - Shutting down leader election QuorumPeer[myid=5](plain=/127.0.0.1:11363)(secure=disabled)
    [junit] 2016-03-21 22:10:56,225 [myid:] - INFO  [main:QuorumUtil@259] - Waiting for QuorumPeer[myid=5](plain=/127.0.0.1:11363)(secure=disabled) to exit thread
    [junit] 2016-03-21 22:10:56,225 [myid:] - INFO  [main:FourLetterWordMain@85] - connecting to 127.0.0.1 11351
    [junit] 2016-03-21 22:10:56,226 [myid:] - INFO  [main:QuorumUtil@243] - 127.0.0.1:11351 is no longer accepting client connections
    [junit] 2016-03-21 22:10:56,226 [myid:] - INFO  [main:FourLetterWordMain@85] - connecting to 127.0.0.1 11354
    [junit] 2016-03-21 22:10:56,226 [myid:] - INFO  [main:QuorumUtil@243] - 127.0.0.1:11354 is no longer accepting client connections
    [junit] 2016-03-21 22:10:56,226 [myid:] - INFO  [main:FourLetterWordMain@85] - connecting to 127.0.0.1 11357
    [junit] 2016-03-21 22:10:56,227 [myid:] - INFO  [main:QuorumUtil@243] - 127.0.0.1:11357 is no longer accepting client connections
    [junit] 2016-03-21 22:10:56,227 [myid:] - INFO  [main:FourLetterWordMain@85] - connecting to 127.0.0.1 11360
    [junit] 2016-03-21 22:10:56,227 [myid:] - INFO  [main:QuorumUtil@243] - 127.0.0.1:11360 is no longer accepting client connections
    [junit] 2016-03-21 22:10:56,227 [myid:] - INFO  [main:FourLetterWordMain@85] - connecting to 127.0.0.1 11363
    [junit] 2016-03-21 22:10:56,227 [myid:] - INFO  [main:QuorumUtil@243] - 127.0.0.1:11363 is no longer accepting client connections
    [junit] 2016-03-21 22:10:56,228 [myid:] - INFO  [main:ZKTestCase$1@65] - SUCCEEDED testRemoveOneAsynchronous
    [junit] 2016-03-21 22:10:56,229 [myid:] - INFO  [main:ZKTestCase$1@60] - FINISHED testRemoveOneAsynchronous
    [junit] Tests run: 11, Failures: 0, Errors: 0, Skipped: 0, Time elapsed: 109.919 sec, Thread: 1, Class: org.apache.zookeeper.test.ReconfigTest
    [junit] 2016-03-21 22:10:56,401 [myid:] - INFO  [SessionTracker:SessionTrackerImpl@158] - SessionTrackerImpl exited loop!

BUILD FAILED
/home/jenkins/jenkins-slave/workspace/ZooKeeper_branch35_jdk8/branch-3.5/build.xml:1322: The following error occurred while executing this line:
/home/jenkins/jenkins-slave/workspace/ZooKeeper_branch35_jdk8/branch-3.5/build.xml:1207: Tests failed!

Total time: 6 minutes 42 seconds
Build step 'Invoke Ant' marked build as failure
Archiving artifacts
Recording test results
Email was triggered for: Failure - Any
Sending email for trigger: Failure - Any



###################################################################################
############################## FAILED TESTS (if any) ##############################
1 tests failed.
FAILED:  org.apache.zookeeper.server.ZxidRolloverTest.testRolloverThenFollowerRestart

Error Message:
Did not connect

Stack Trace:
java.util.concurrent.TimeoutException: Did not connect
	at org.apache.zookeeper.test.ClientBase$CountdownWatcher.waitForConnected(ClientBase.java:132)
	at org.apache.zookeeper.server.ZxidRolloverTest.waitForClientsConnected(ZxidRolloverTest.java:80)
	at org.apache.zookeeper.server.ZxidRolloverTest.createNodes(ZxidRolloverTest.java:237)
	at org.apache.zookeeper.server.ZxidRolloverTest.testRolloverThenFollowerRestart(ZxidRolloverTest.java:336)
	at org.apache.zookeeper.JUnit4ZKTestRunner$LoggedInvokeMethod.evaluate(JUnit4ZKTestRunner.java:79)