You are viewing a plain text version of this content. The canonical link for it is here.
Posted to dev@sling.apache.org by Apache Jenkins Server <je...@builds.apache.org> on 2021/04/24 11:22:26 UTC
[Jenkins] Sling » Modules » sling-org-apache-sling-launchpad-testing » master #440 is BROKEN
Please see https://ci-builds.apache.org/job/Sling/job/modules/job/sling-org-apache-sling-launchpad-testing/job/master/440/ for details.
No further emails will be sent until the status of the build is changed.
Build log follows below:
[...truncated 410 lines...]
[INFO] Tests run: 10, Failures: 0, Errors: 0, Skipped: 0, Time elapsed: 0.389 s - in org.apache.sling.launchpad.webapp.integrationtest.servlets.post.PostServletAtCopyTest
[INFO] Running org.apache.sling.launchpad.webapp.integrationtest.servlets.resolution.PutMethodServletTest
[INFO] Tests run: 2, Failures: 0, Errors: 0, Skipped: 0, Time elapsed: 0.207 s - in org.apache.sling.launchpad.webapp.integrationtest.servlets.resolution.PutMethodServletTest
[INFO] Running org.apache.sling.launchpad.webapp.integrationtest.scripting.StandaloneScriptExecutionTest
[INFO] Tests run: 1, Failures: 0, Errors: 0, Skipped: 0, Time elapsed: 0.074 s - in org.apache.sling.launchpad.webapp.integrationtest.scripting.StandaloneScriptExecutionTest
[INFO] Running org.apache.sling.launchpad.webapp.integrationtest.login.RedirectOnLogoutTest
[INFO] Tests run: 1, Failures: 0, Errors: 0, Skipped: 0, Time elapsed: 0.023 s - in org.apache.sling.launchpad.webapp.integrationtest.login.RedirectOnLogoutTest
[INFO] Running org.apache.sling.launchpad.webapp.integrationtest.servlets.post.PostServletNopTest
[INFO] Tests run: 6, Failures: 0, Errors: 0, Skipped: 0, Time elapsed: 0.039 s - in org.apache.sling.launchpad.webapp.integrationtest.servlets.post.PostServletNopTest
[INFO] Running org.apache.sling.launchpad.webapp.integrationtest.servlets.R6WhiteboardServletTest
[INFO] Tests run: 1, Failures: 0, Errors: 0, Skipped: 0, Time elapsed: 0.002 s - in org.apache.sling.launchpad.webapp.integrationtest.servlets.R6WhiteboardServletTest
[INFO] Running org.apache.sling.launchpad.webapp.integrationtest.SlingWebDavServletTest
[INFO] Tests run: 2, Failures: 0, Errors: 0, Skipped: 0, Time elapsed: 0.17 s - in org.apache.sling.launchpad.webapp.integrationtest.SlingWebDavServletTest
[INFO] Running org.apache.sling.launchpad.webapp.integrationtest.RangeStreamingTest
[INFO] Tests run: 4, Failures: 0, Errors: 0, Skipped: 0, Time elapsed: 0.324 s - in org.apache.sling.launchpad.webapp.integrationtest.RangeStreamingTest
[INFO] Running org.apache.sling.launchpad.webapp.integrationtest.userManager.RemoveAuthorizablesTest
[INFO] Tests run: 11, Failures: 0, Errors: 0, Skipped: 0, Time elapsed: 0.756 s - in org.apache.sling.launchpad.webapp.integrationtest.userManager.RemoveAuthorizablesTest
[INFO] Running org.apache.sling.launchpad.webapp.integrationtest.RequestAttributeTest
[INFO] Tests run: 1, Failures: 0, Errors: 0, Skipped: 0, Time elapsed: 0.18 s - in org.apache.sling.launchpad.webapp.integrationtest.RequestAttributeTest
[INFO] Running org.apache.sling.launchpad.webapp.integrationtest.auth.AuthenticationResponseCodeTest
[INFO] Tests run: 10, Failures: 0, Errors: 0, Skipped: 0, Time elapsed: 0.072 s - in org.apache.sling.launchpad.webapp.integrationtest.auth.AuthenticationResponseCodeTest
[INFO] Running org.apache.sling.launchpad.webapp.integrationtest.teleporter.ServicesPresentTest
[INFO] Tests run: 1, Failures: 0, Errors: 0, Skipped: 0, Time elapsed: 0.143 s - in org.apache.sling.launchpad.webapp.integrationtest.teleporter.ServicesPresentTest
[INFO] Running org.apache.sling.launchpad.webapp.integrationtest.servlets.post.PostServletAtMoveTest
[INFO] Tests run: 9, Failures: 0, Errors: 0, Skipped: 0, Time elapsed: 0.377 s - in org.apache.sling.launchpad.webapp.integrationtest.servlets.post.PostServletAtMoveTest
[INFO] Running org.apache.sling.launchpad.webapp.integrationtest.HttpPingTest
[INFO] Tests run: 2, Failures: 0, Errors: 0, Skipped: 0, Time elapsed: 0.006 s - in org.apache.sling.launchpad.webapp.integrationtest.HttpPingTest
[INFO] Running org.apache.sling.launchpad.webapp.integrationtest.repository.RepositoryNameTest
[INFO] Tests run: 1, Failures: 0, Errors: 0, Skipped: 0, Time elapsed: 0.016 s - in org.apache.sling.launchpad.webapp.integrationtest.repository.RepositoryNameTest
[INFO] Running org.apache.sling.launchpad.webapp.integrationtest.scripting.SlingJSPTaglibTest
[INFO] Tests run: 1, Failures: 0, Errors: 0, Skipped: 0, Time elapsed: 0.855 s - in org.apache.sling.launchpad.webapp.integrationtest.scripting.SlingJSPTaglibTest
[INFO] Running org.apache.sling.launchpad.webapp.integrationtest.WriteableResourcesProxyTest
[INFO] Tests run: 1, Failures: 0, Errors: 0, Skipped: 0, Time elapsed: 0.018 s - in org.apache.sling.launchpad.webapp.integrationtest.WriteableResourcesProxyTest
[INFO] Running org.apache.sling.launchpad.webapp.integrationtest.teleporter.TeleportedResourcesFolderTest
[INFO] Tests run: 3, Failures: 0, Errors: 0, Skipped: 0, Time elapsed: 0.379 s - in org.apache.sling.launchpad.webapp.integrationtest.teleporter.TeleportedResourcesFolderTest
[INFO] Running org.apache.sling.launchpad.webapp.integrationtest.servlets.post.SlingDateValuesTest
[INFO] Tests run: 2, Failures: 0, Errors: 0, Skipped: 0, Time elapsed: 1.735 s - in org.apache.sling.launchpad.webapp.integrationtest.servlets.post.SlingDateValuesTest
[INFO] Running org.apache.sling.launchpad.webapp.integrationtest.servlets.post.ReferenceTypeHintTest
[INFO] Tests run: 2, Failures: 0, Errors: 0, Skipped: 0, Time elapsed: 0.243 s - in org.apache.sling.launchpad.webapp.integrationtest.servlets.post.ReferenceTypeHintTest
[INFO] Running org.apache.sling.launchpad.webapp.integrationtest.EventsCounterTest
[INFO] Tests run: 1, Failures: 0, Errors: 0, Skipped: 0, Time elapsed: 0.029 s - in org.apache.sling.launchpad.webapp.integrationtest.EventsCounterTest
[INFO] Running org.apache.sling.launchpad.webapp.integrationtest.WebdavDeleteTest
[INFO] Tests run: 1, Failures: 0, Errors: 0, Skipped: 0, Time elapsed: 0.116 s - in org.apache.sling.launchpad.webapp.integrationtest.WebdavDeleteTest
[INFO] Running org.apache.sling.launchpad.webapp.integrationtest.servlets.post.SlingSessionInfoTest
[INFO] Tests run: 2, Failures: 0, Errors: 0, Skipped: 0, Time elapsed: 0.012 s - in org.apache.sling.launchpad.webapp.integrationtest.servlets.post.SlingSessionInfoTest
[INFO] Running org.apache.sling.launchpad.webapp.integrationtest.servlets.post.PostServletOrderTest
[INFO] Tests run: 9, Failures: 0, Errors: 0, Skipped: 0, Time elapsed: 0.481 s - in org.apache.sling.launchpad.webapp.integrationtest.servlets.post.PostServletOrderTest
[INFO] Running org.apache.sling.launchpad.webapp.integrationtest.xml.DomTest
[INFO] Tests run: 1, Failures: 0, Errors: 0, Skipped: 0, Time elapsed: 0.005 s - in org.apache.sling.launchpad.webapp.integrationtest.xml.DomTest
[INFO] Running org.apache.sling.launchpad.webapp.integrationtest.ScriptBuiltinObjectsTest
[INFO] Tests run: 1, Failures: 0, Errors: 0, Skipped: 0, Time elapsed: 0.076 s - in org.apache.sling.launchpad.webapp.integrationtest.ScriptBuiltinObjectsTest
[INFO] Running org.apache.sling.launchpad.webapp.integrationtest.issues.SLING2082Test
[INFO] Tests run: 2, Failures: 0, Errors: 0, Skipped: 0, Time elapsed: 0.011 s - in org.apache.sling.launchpad.webapp.integrationtest.issues.SLING2082Test
[INFO] Running org.apache.sling.launchpad.webapp.integrationtest.ExportedPackagesTest
[INFO] Tests run: 3, Failures: 0, Errors: 0, Skipped: 0, Time elapsed: 0.015 s - in org.apache.sling.launchpad.webapp.integrationtest.ExportedPackagesTest
[INFO] Running org.apache.sling.launchpad.webapp.integrationtest.ResourceDecoratorTest
[INFO] Tests run: 1, Failures: 0, Errors: 0, Skipped: 0, Time elapsed: 0.042 s - in org.apache.sling.launchpad.webapp.integrationtest.ResourceDecoratorTest
[INFO] Running org.apache.sling.launchpad.webapp.integrationtest.userManager.CreateUserTest
[INFO] Tests run: 11, Failures: 0, Errors: 0, Skipped: 0, Time elapsed: 0.335 s - in org.apache.sling.launchpad.webapp.integrationtest.userManager.CreateUserTest
[INFO] Running org.apache.sling.launchpad.webapp.integrationtest.accessManager.GetAclTest
[INFO] Tests run: 7, Failures: 0, Errors: 0, Skipped: 0, Time elapsed: 0.984 s - in org.apache.sling.launchpad.webapp.integrationtest.accessManager.GetAclTest
[INFO] Running org.apache.sling.launchpad.webapp.integrationtest.ValueFromTest
[INFO] Tests run: 3, Failures: 0, Errors: 0, Skipped: 0, Time elapsed: 0.062 s - in org.apache.sling.launchpad.webapp.integrationtest.ValueFromTest
[INFO] Running org.apache.sling.launchpad.webapp.integrationtest.WebdavUploadTest
[INFO] Tests run: 4, Failures: 0, Errors: 0, Skipped: 0, Time elapsed: 0.265 s - in org.apache.sling.launchpad.webapp.integrationtest.WebdavUploadTest
[INFO] Running org.apache.sling.launchpad.webapp.integrationtest.teleporter.MultipleRulesTeleporterTest
[INFO] Tests run: 2, Failures: 0, Errors: 0, Skipped: 0, Time elapsed: 0.342 s - in org.apache.sling.launchpad.webapp.integrationtest.teleporter.MultipleRulesTeleporterTest
[INFO] Running org.apache.sling.launchpad.webapp.integrationtest.resourceprovider.PlanetsResourceProviderTest
[INFO] Tests run: 4, Failures: 0, Errors: 0, Skipped: 0, Time elapsed: 0.027 s - in org.apache.sling.launchpad.webapp.integrationtest.resourceprovider.PlanetsResourceProviderTest
[INFO] Running org.apache.sling.launchpad.webapp.integrationtest.servlets.post.PostServletPrivilegesUpdateTest
[WARNING] Tests run: 1, Failures: 0, Errors: 0, Skipped: 1, Time elapsed: 0.001 s - in org.apache.sling.launchpad.webapp.integrationtest.servlets.post.PostServletPrivilegesUpdateTest
[INFO] Running org.apache.sling.launchpad.webapp.integrationtest.NodetypeRenderingTest
[INFO] Tests run: 7, Failures: 0, Errors: 0, Skipped: 0, Time elapsed: 0.532 s - in org.apache.sling.launchpad.webapp.integrationtest.NodetypeRenderingTest
[INFO] Running org.apache.sling.launchpad.webapp.integrationtest.DavExIntegrationTest
[INFO] Tests run: 2, Failures: 0, Errors: 0, Skipped: 0, Time elapsed: 0.61 s - in org.apache.sling.launchpad.webapp.integrationtest.DavExIntegrationTest
[INFO] Running org.apache.sling.launchpad.webapp.integrationtest.VersionParameterTest
[INFO] Tests run: 1, Failures: 0, Errors: 0, Skipped: 0, Time elapsed: 1.134 s - in org.apache.sling.launchpad.webapp.integrationtest.VersionParameterTest
[INFO] Running org.apache.sling.launchpad.webapp.integrationtest.userManager.CreateGroupTest
[INFO] Tests run: 8, Failures: 0, Errors: 0, Skipped: 0, Time elapsed: 0.332 s - in org.apache.sling.launchpad.webapp.integrationtest.userManager.CreateGroupTest
[INFO] Running org.apache.sling.launchpad.webapp.integrationtest.userManager.UpdateGroupTest
[INFO] Tests run: 8, Failures: 0, Errors: 0, Skipped: 0, Time elapsed: 1.104 s - in org.apache.sling.launchpad.webapp.integrationtest.userManager.UpdateGroupTest
[INFO] Running org.apache.sling.launchpad.webapp.integrationtest.CreateNodeTest
[INFO] Tests run: 6, Failures: 0, Errors: 0, Skipped: 0, Time elapsed: 0.191 s - in org.apache.sling.launchpad.webapp.integrationtest.CreateNodeTest
[INFO] Running org.apache.sling.launchpad.webapp.integrationtest.teleporter.TeleporterOptionsTest
[INFO] Tests run: 1, Failures: 0, Errors: 0, Skipped: 0, Time elapsed: 0.001 s - in org.apache.sling.launchpad.webapp.integrationtest.teleporter.TeleporterOptionsTest
[INFO] Running org.apache.sling.launchpad.webapp.integrationtest.teleporter.TeleportedResourcesSingleTest
[INFO] Tests run: 3, Failures: 0, Errors: 0, Skipped: 0, Time elapsed: 0.441 s - in org.apache.sling.launchpad.webapp.integrationtest.teleporter.TeleportedResourcesSingleTest
[INFO] Running org.apache.sling.launchpad.webapp.integrationtest.GeneratedNodeNameTest
[INFO] Tests run: 6, Failures: 0, Errors: 0, Skipped: 0, Time elapsed: 0.189 s - in org.apache.sling.launchpad.webapp.integrationtest.GeneratedNodeNameTest
[INFO] Running org.apache.sling.launchpad.webapp.integrationtest.issues.SLING2617Test
[INFO] Tests run: 1, Failures: 0, Errors: 0, Skipped: 0, Time elapsed: 0.132 s - in org.apache.sling.launchpad.webapp.integrationtest.issues.SLING2617Test
[INFO] Running org.apache.sling.launchpad.webapp.integrationtest.userManager.UpdateUserTest
[INFO] Tests run: 12, Failures: 0, Errors: 0, Skipped: 0, Time elapsed: 0.811 s - in org.apache.sling.launchpad.webapp.integrationtest.userManager.UpdateUserTest
[INFO] Running org.apache.sling.launchpad.webapp.integrationtest.servlets.post.PostStatusTest
[INFO] Tests run: 4, Failures: 0, Errors: 0, Skipped: 0, Time elapsed: 0.034 s - in org.apache.sling.launchpad.webapp.integrationtest.servlets.post.PostStatusTest
[INFO] Running org.apache.sling.launchpad.webapp.integrationtest.servlets.post.PostSendErrorTest
[INFO] Tests run: 3, Failures: 0, Errors: 0, Skipped: 0, Time elapsed: 0.059 s - in org.apache.sling.launchpad.webapp.integrationtest.servlets.post.PostSendErrorTest
[INFO] Running org.apache.sling.launchpad.webapp.integrationtest.servlets.post.SlingPostProcessorTest
[INFO] Tests run: 1, Failures: 0, Errors: 0, Skipped: 0, Time elapsed: 0.02 s - in org.apache.sling.launchpad.webapp.integrationtest.servlets.post.SlingPostProcessorTest
[INFO] Running org.apache.sling.launchpad.webapp.integrationtest.servlets.resolution.PrioritiesTest
[INFO] Tests run: 1, Failures: 0, Errors: 0, Skipped: 0, Time elapsed: 0.077 s - in org.apache.sling.launchpad.webapp.integrationtest.servlets.resolution.PrioritiesTest
[INFO] Running org.apache.sling.launchpad.webapp.integrationtest.servlets.resolution.PathsServletWithNodeTest
[INFO] Tests run: 1, Failures: 0, Errors: 0, Skipped: 0, Time elapsed: 0.096 s - in org.apache.sling.launchpad.webapp.integrationtest.servlets.resolution.PathsServletWithNodeTest
[INFO] Running org.apache.sling.launchpad.webapp.integrationtest.MkdirTest
[INFO] Tests run: 2, Failures: 0, Errors: 0, Skipped: 0, Time elapsed: 0.114 s - in org.apache.sling.launchpad.webapp.integrationtest.MkdirTest
[INFO] Running org.apache.sling.launchpad.webapp.integrationtest.issues.SLING457Test
[INFO] Tests run: 2, Failures: 0, Errors: 0, Skipped: 0, Time elapsed: 0.342 s - in org.apache.sling.launchpad.webapp.integrationtest.issues.SLING457Test
[INFO] Running org.apache.sling.launchpad.webapp.integrationtest.EspLoadTest
[INFO] Tests run: 2, Failures: 0, Errors: 0, Skipped: 0, Time elapsed: 0.264 s - in org.apache.sling.launchpad.webapp.integrationtest.EspLoadTest
[INFO] Running org.apache.sling.launchpad.webapp.integrationtest.ForwardTest
[INFO] Tests run: 5, Failures: 0, Errors: 0, Skipped: 0, Time elapsed: 1.877 s - in org.apache.sling.launchpad.webapp.integrationtest.ForwardTest
[INFO] Running org.apache.sling.launchpad.webapp.integrationtest.servlets.resolver.errorhandler.ErrorHandlingTest
[INFO] Tests run: 11, Failures: 0, Errors: 0, Skipped: 0, Time elapsed: 3.779 s - in org.apache.sling.launchpad.webapp.integrationtest.servlets.resolver.errorhandler.ErrorHandlingTest
[INFO] Running org.apache.sling.launchpad.webapp.integrationtest.ImmediateScriptActivationTest
[INFO] Tests run: 2, Failures: 0, Errors: 0, Skipped: 0, Time elapsed: 1.502 s - in org.apache.sling.launchpad.webapp.integrationtest.ImmediateScriptActivationTest
[INFO] Running org.apache.sling.launchpad.webapp.integrationtest.VanityPathTest
[INFO] Tests run: 5, Failures: 0, Errors: 0, Skipped: 0, Time elapsed: 0.156 s - in org.apache.sling.launchpad.webapp.integrationtest.VanityPathTest
[INFO] Running org.apache.sling.launchpad.webapp.integrationtest.installer.InstallManyBundlesTest
[INFO] Tests run: 2, Failures: 0, Errors: 0, Skipped: 0, Time elapsed: 13.341 s - in org.apache.sling.launchpad.webapp.integrationtest.installer.InstallManyBundlesTest
[INFO] Running org.apache.sling.launchpad.webapp.integrationtest.servlets.post.PostServletDeleteParentTest
[INFO] Tests run: 6, Failures: 0, Errors: 0, Skipped: 0, Time elapsed: 0.252 s - in org.apache.sling.launchpad.webapp.integrationtest.servlets.post.PostServletDeleteParentTest
[INFO] Running org.apache.sling.launchpad.webapp.integrationtest.jaxb.JaxbMarshallingTest
[INFO] Tests run: 1, Failures: 0, Errors: 0, Skipped: 0, Time elapsed: 0.166 s - in org.apache.sling.launchpad.webapp.integrationtest.jaxb.JaxbMarshallingTest
[INFO] Running org.apache.sling.launchpad.webapp.integrationtest.issues.SLING2522Test
[INFO] Tests run: 1, Failures: 0, Errors: 0, Skipped: 0, Time elapsed: 0.013 s - in org.apache.sling.launchpad.webapp.integrationtest.issues.SLING2522Test
[INFO] Running org.apache.sling.launchpad.webapp.integrationtest.servlets.post.PostServletAtDeleteTest
[INFO] Tests run: 2, Failures: 0, Errors: 0, Skipped: 0, Time elapsed: 0.123 s - in org.apache.sling.launchpad.webapp.integrationtest.servlets.post.PostServletAtDeleteTest
[INFO] Running org.apache.sling.launchpad.webapp.integrationtest.servlets.HeadServletTest
[INFO] Tests run: 6, Failures: 0, Errors: 0, Skipped: 0, Time elapsed: 0.043 s - in org.apache.sling.launchpad.webapp.integrationtest.servlets.HeadServletTest
[INFO] Running org.apache.sling.launchpad.webapp.integrationtest.InitialContentTest
[INFO] Tests run: 5, Failures: 0, Errors: 0, Skipped: 0, Time elapsed: 0.023 s - in org.apache.sling.launchpad.webapp.integrationtest.InitialContentTest
[INFO] Running org.apache.sling.launchpad.webapp.integrationtest.runmodes.InactiveRunModeTest
[INFO] Tests run: 2, Failures: 0, Errors: 0, Skipped: 0, Time elapsed: 0.025 s - in org.apache.sling.launchpad.webapp.integrationtest.runmodes.InactiveRunModeTest
[INFO] Running org.apache.sling.launchpad.webapp.integrationtest.ServletResolverConfigTest
[INFO] Tests run: 1, Failures: 0, Errors: 0, Skipped: 0, Time elapsed: 0.003 s - in org.apache.sling.launchpad.webapp.integrationtest.ServletResolverConfigTest
[INFO] Running org.apache.sling.launchpad.webapp.integrationtest.ContentLoaderMiscPropertyTest
[INFO] Tests run: 1, Failures: 0, Errors: 0, Skipped: 0, Time elapsed: 0.004 s - in org.apache.sling.launchpad.webapp.integrationtest.ContentLoaderMiscPropertyTest
[INFO] Running org.apache.sling.launchpad.webapp.integrationtest.servlets.post.PostServletVersionableTest
[INFO] Tests run: 26, Failures: 0, Errors: 0, Skipped: 0, Time elapsed: 2.085 s - in org.apache.sling.launchpad.webapp.integrationtest.servlets.post.PostServletVersionableTest
[INFO] Running org.apache.sling.launchpad.webapp.integrationtest.JspScriptingTest
[INFO] Tests run: 7, Failures: 0, Errors: 0, Skipped: 0, Time elapsed: 1.253 s - in org.apache.sling.launchpad.webapp.integrationtest.JspScriptingTest
[INFO] Running org.apache.sling.launchpad.webapp.integrationtest.issues.SLING2094Test
[INFO] Tests run: 2, Failures: 0, Errors: 0, Skipped: 0, Time elapsed: 0.275 s - in org.apache.sling.launchpad.webapp.integrationtest.issues.SLING2094Test
[INFO] Running org.apache.sling.launchpad.webapp.integrationtest.BundleContentTest
[INFO] Tests run: 4, Failures: 0, Errors: 0, Skipped: 0, Time elapsed: 0.029 s - in org.apache.sling.launchpad.webapp.integrationtest.BundleContentTest
[INFO] Running org.apache.sling.launchpad.webapp.integrationtest.WebdavOptionsTest
[INFO] Tests run: 2, Failures: 0, Errors: 0, Skipped: 0, Time elapsed: 0.013 s - in org.apache.sling.launchpad.webapp.integrationtest.WebdavOptionsTest
[INFO] Running org.apache.sling.launchpad.webapp.integrationtest.PropertyRenderingTest
[INFO] Tests run: 10, Failures: 0, Errors: 0, Skipped: 0, Time elapsed: 0.232 s - in org.apache.sling.launchpad.webapp.integrationtest.PropertyRenderingTest
[INFO] Running org.apache.sling.launchpad.webapp.integrationtest.SyntheticResourceTest
[INFO] Tests run: 1, Failures: 0, Errors: 0, Skipped: 0, Time elapsed: 0.055 s - in org.apache.sling.launchpad.webapp.integrationtest.SyntheticResourceTest
[INFO] Running org.apache.sling.launchpad.webapp.integrationtest.servlets.post.PostServletMoveTest
[INFO] Tests run: 15, Failures: 0, Errors: 0, Skipped: 0, Time elapsed: 1.154 s - in org.apache.sling.launchpad.webapp.integrationtest.servlets.post.PostServletMoveTest
[INFO] Running org.apache.sling.launchpad.webapp.integrationtest.DavExDisabledAnonAccessTest
[INFO] Tests run: 2, Failures: 0, Errors: 0, Skipped: 0, Time elapsed: 0.602 s - in org.apache.sling.launchpad.webapp.integrationtest.DavExDisabledAnonAccessTest
[INFO] Running org.apache.sling.launchpad.webapp.integrationtest.issues.SLING760Test
[INFO] Tests run: 1, Failures: 0, Errors: 0, Skipped: 0, Time elapsed: 0.076 s - in org.apache.sling.launchpad.webapp.integrationtest.issues.SLING760Test
[INFO] Running org.apache.sling.launchpad.webapp.integrationtest.accessManager.AccessPrivilegesInfoTest
[INFO] Tests run: 7, Failures: 0, Errors: 0, Skipped: 0, Time elapsed: 1.358 s - in org.apache.sling.launchpad.webapp.integrationtest.accessManager.AccessPrivilegesInfoTest
[INFO] Running org.apache.sling.launchpad.webapp.integrationtest.MiscUnsafeTest
[INFO] Tests run: 1, Failures: 0, Errors: 0, Skipped: 0, Time elapsed: 0 s - in org.apache.sling.launchpad.webapp.integrationtest.MiscUnsafeTest
[INFO] Running org.apache.sling.launchpad.webapp.integrationtest.IncludeTest
[INFO] Tests run: 5, Failures: 0, Errors: 0, Skipped: 0, Time elapsed: 1.697 s - in org.apache.sling.launchpad.webapp.integrationtest.IncludeTest
[INFO]
[INFO] Results:
[INFO]
[ERROR] Failures:
[ERROR] RemoveAcesTest.testRemoveAce:145->createFolderWithAces:73->AuthenticatedTestUtil.createTestUser:231->AuthenticatedTestUtil.assertAuthenticatedPostStatus:71 Unexpected status while attempting to create test user at http://localhost:41000/system/userManager/user.create.html expected:<200> but was:<500>
[ERROR] RemoveAcesTest.testRemoveAceChangesInResponse:280->createFolderWithAces:73->AuthenticatedTestUtil.createTestUser:231->AuthenticatedTestUtil.assertAuthenticatedPostStatus:71 Unexpected status while attempting to create test user at http://localhost:41000/system/userManager/user.create.html expected:<200> but was:<500>
[ERROR] RemoveAcesTest.testRemoveAceCustomPostResponse:169->createFolderWithAces:73->AuthenticatedTestUtil.createTestUser:231->AuthenticatedTestUtil.assertAuthenticatedPostStatus:71 Unexpected status while attempting to create test user at http://localhost:41000/system/userManager/user.create.html expected:<200> but was:<500>
[ERROR] RemoveAcesTest.testRemoveAceForInvalidUser:258->createFolderWithAces:73->AuthenticatedTestUtil.createTestUser:231->AuthenticatedTestUtil.assertAuthenticatedPostStatus:71 Unexpected status while attempting to create test user at http://localhost:41000/system/userManager/user.create.html expected:<200> but was:<500>
[ERROR] RemoveAcesTest.testRemoveAceWhenAccessControlListDoesNotExist:231->AuthenticatedTestUtil.createTestUser:231->AuthenticatedTestUtil.assertAuthenticatedPostStatus:71 Unexpected status while attempting to create test user at http://localhost:41000/system/userManager/user.create.html expected:<200> but was:<500>
[ERROR] RemoveAcesTest.testRemoveAces:184->createFolderWithAces:73->AuthenticatedTestUtil.createTestUser:231->AuthenticatedTestUtil.assertAuthenticatedPostStatus:71 Unexpected status while attempting to create test user at http://localhost:41000/system/userManager/user.create.html expected:<200> but was:<500>
[ERROR] RemoveAcesTest.testRemoveAcesResponseAsJSON:209->createFolderWithAces:73->AuthenticatedTestUtil.createTestUser:231->AuthenticatedTestUtil.assertAuthenticatedPostStatus:71 Unexpected status while attempting to create test user at http://localhost:41000/system/userManager/user.create.html expected:<200> but was:<500>
[INFO]
[ERROR] Tests run: 665, Failures: 7, Errors: 0, Skipped: 1
[INFO]
[INFO]
[INFO] --- feature-launcher-maven-plugin:0.1.0:stop (default) @ org.apache.sling.launchpad.testing ---
[INFO] Stopping launch with id sling-12-oak-tar
[DEBUG] [ServiceReference 1178 from bundle 116 : org.apache.sling.jcr.davex:1.3.10 ref=[javax.servlet.Servlet] properties={objectClass=[javax.servlet.Servlet], osgi.http.whiteboard.context.select=(osgi.http.whiteboard.context.name=DavExAuthHttpContext), osgi.http.whiteboard.servlet.pattern=/server/*, service.bundleid=116, service.description=Sling JcrRemoting Servlet, service.id=1178, service.scope=singleton, service.vendor=The Apache Software Foundation, servlet.init.createAbsoluteURI=true, servlet.init.csrf-protection=disabled, servlet.init.protectedhandlers-config=org.apache.jackrabbit.server.remoting.davex.AclRemoveHandler, servlet.init.resource-path-prefix=/server, sling.auth.requirements=-/server}] Ignoring unmatching Servlet service
[DEBUG] [ServiceReference 451 from bundle 132 : org.apache.sling.engine:2.7.2 ref=[javax.servlet.Servlet] properties={objectClass=[javax.servlet.Servlet], osgi.http.whiteboard.context.select=(osgi.http.whiteboard.context.name=org.apache.sling), osgi.http.whiteboard.servlet.name=ApacheSling/2.7, osgi.http.whiteboard.servlet.pattern=/, service.bundleid=132, service.description=Apache Sling Engine Main Servlet, service.id=451, service.scope=singleton, service.vendor=The Apache Software Foundation}] Ignoring unmatching Servlet service
[DEBUG] [ServiceReference 469 from bundle 132 : org.apache.sling.engine:2.7.2 ref=[javax.servlet.Filter] properties={component.id=223, component.name=org.apache.sling.engine.impl.log.RequestLoggerFilter, objectClass=[javax.servlet.Filter], osgi.http.whiteboard.context.select=(osgi.http.whiteboard.context.name=org.apache.sling), osgi.http.whiteboard.filter.pattern=[/], service.bundleid=132, service.description=Request Logger Filter, service.id=469, service.ranking=32768, service.scope=bundle, service.vendor=The Apache Software Foundation}] Ignoring unmatching Filter service
[DEBUG] [ServiceReference 470 from bundle 132 : org.apache.sling.engine:2.7.2 ref=[javax.servlet.Filter] properties={component.id=224, component.name=org.apache.sling.engine.parameters, file.max=-1, file.threshold=256000, objectClass=[javax.servlet.Filter], osgi.http.whiteboard.context.select=(osgi.http.whiteboard.context.name=org.apache.sling), osgi.http.whiteboard.filter.pattern=[/], request.max=-1, service.bundleid=132, service.description=Filter for request parameter support, service.id=470, service.ranking=2147483647, service.scope=bundle, service.vendor=The Apache Software Foundation, sling.default.max.parameters=10000, sling.default.parameter.checkForAdditionalContainerParameters=false, sling.default.parameter.encoding=ISO-8859-1}] Ignoring unmatching Filter service
[DEBUG] [ServiceReference 78 from bundle 38 : org.apache.sling.launchpad.test-services:12.0.0.SNAPSHOT ref=[javax.servlet.Servlet] properties={component.id=53, component.name=org.apache.sling.launchpad.testservices.servlets.R6WhiteboardServlet, objectClass=[javax.servlet.Servlet], osgi.http.whiteboard.context.select=(osgi.http.whiteboard.context.name=org.apache.sling), osgi.http.whiteboard.servlet.pattern=/whiteboard_r6, service.bundleid=38, service.id=78, service.pid=org.apache.sling.launchpad.testservices.servlets.R6WhiteboardServlet, service.scope=bundle, service.vendor=The Apache Software Foundation}] Ignoring unmatching Servlet service
[INFO] Apachde Felix Http Whiteboard Service stopped
[INFO] Stopped Jetty.
[INFO]
[INFO] --- ianal-maven-plugin:1.0-alpha-1:verify-legal-files (default) @ org.apache.sling.launchpad.testing ---
[INFO] Checking legal files in: org.apache.sling.launchpad.testing-12-SNAPSHOT.jar
[INFO] Checking legal files in: org.apache.sling.launchpad.testing-12-SNAPSHOT-sources.jar
[INFO]
[INFO] --- apache-rat-plugin:0.11:check (default) @ org.apache.sling.launchpad.testing ---
[INFO] 51 implicit excludes (use -debug for more details).
[INFO] Exclude: DEPENDENCIES
[INFO] Exclude: src/main/appended-resources/META-INF/*
[INFO] Exclude: velocity.log
[INFO] Exclude: target/*
[INFO] Exclude: README.md
[INFO] Exclude: maven-eclipse.xml
[INFO] Exclude: .*
[INFO] Exclude: .*/**
[INFO] Exclude: **/*.json
[INFO] Exclude: DEPENDENCIES
[INFO] Exclude: **/*.rej
[INFO] Exclude: hs_err_*.log
[INFO] Exclude: **/repository/index/*/index-details.txt
[INFO] Exclude: bnd.bnd
[INFO] 6 resources included (use -debug for more details)
[INFO] Rat check: Summary of files. Unapproved: 0 unknown: 0 generated: 0 approved: 5 licence.
[INFO]
[INFO] --- maven-failsafe-plugin:2.21.0:verify (default) @ org.apache.sling.launchpad.testing ---
[INFO] ------------------------------------------------------------------------
[INFO] BUILD FAILURE
[INFO] ------------------------------------------------------------------------
[INFO] Total time: 03:08 min
[INFO] Finished at: 2021-04-24T11:20:30Z
[INFO] ------------------------------------------------------------------------
[WARNING] The requested profile "ci" could not be activated because it does not exist.
[INFO] [jenkins-event-spy] Generated /home/jenkins/jenkins-agent/workspace/e-sling-launchpad-testing_master@tmp/withMaven1465cab3/maven-spy-20210424-111721-66147588673414813275.log
[ERROR] Failed to execute goal org.apache.maven.plugins:maven-failsafe-plugin:2.21.0:verify (default) on project org.apache.sling.launchpad.testing: There are test failures.
[ERROR]
[ERROR] Please refer to /home/jenkins/jenkins-agent/workspace/e-sling-launchpad-testing_master/target/failsafe-reports for the individual test results.
[ERROR] Please refer to dump files (if any exist) [date]-jvmRun[N].dump, [date].dumpstream and [date]-jvmRun[N].dumpstream.
[ERROR] -> [Help 1]
[ERROR]
[ERROR] To see the full stack trace of the errors, re-run Maven with the -e switch.
[ERROR] Re-run Maven using the -X switch to enable full debug logging.
[ERROR]
[ERROR] For more information about the errors and possible solutions, please read the following articles:
[ERROR] [Help 1] http://cwiki.apache.org/confluence/display/MAVEN/MojoFailureException
[Pipeline] }
[withMaven] junitPublisher - Archive test results for Maven artifact org.apache.sling:org.apache.sling.launchpad.testing:jar:12-SNAPSHOT generated by maven-surefire-plugin:test (default-test): target/surefire-reports/*.xml
Recording test results
None of the test reports contained any result
[withMaven] junitPublisher - Archive test results for Maven artifact org.apache.sling:org.apache.sling.launchpad.testing:jar:12-SNAPSHOT generated by maven-failsafe-plugin:integration-test (default): target/failsafe-reports/*.xml
Recording test results
[DevOpticsMavenPublisher] dependencies consumed: 93, artifacts produced: 0
[withMaven] Publishers: Pipeline Graph Publisher: 7 ms, Generated Artifacts Publisher: 350 ms, Junit Publisher: 77599 ms, Dependencies Fingerprint Publisher: 694 ms, Open Task Scanner Publisher: 172 ms, CloudBees DevOptics Gate Artifact Publisher: 32738 ms
[Pipeline] // withMaven
[Pipeline] }
[Pipeline] // stage
[Pipeline] }
[Pipeline] // timeout
[Pipeline] stage
[Pipeline] { (Notifications)
[Pipeline] echo
Status change is BROKEN, notifications will be sent.
[Pipeline] emailext
[Jenkins] Sling » Modules » sling-org-apache-sling-launchpad-testing » master #441 is FIXED
Posted by Apache Jenkins Server <je...@builds.apache.org>.
Please see https://ci-builds.apache.org/job/Sling/job/modules/job/sling-org-apache-sling-launchpad-testing/job/master/441/ for details.
No further emails will be sent until the status of the build is changed.