You are viewing a plain text version of this content. The canonical link for it is here.
Posted to commits@beam.apache.org by Apache Jenkins Server <je...@builds.apache.org> on 2018/03/24 12:05:53 UTC
Build failed in Jenkins: beam_PerformanceTests_XmlIOIT_HDFS #3
See <https://builds.apache.org/job/beam_PerformanceTests_XmlIOIT_HDFS/3/display/redirect?page=changes>
Changes:
[alex] Correct BigQuery.write JavaDoc example
[rober] Correct EventTime encoding. time.(Time).Unix() returns seconds not
[tgroh] Enable Proto Round Trips in the DirectRunner Tests
[lcwik] [BEAM-3249, BEAM-3457] Make Apache Rat a dependency of the Java and
[sidhom] Add Java bounded read overrides
[herohde] [BEAM-3817] Switch BQ write to not use side input
[lcwik] [BEAM-3457] Exclude generated and data files part of the Go SDK.
[sidhom] Add ExecutableStagePayload to make aid runner stage reconstruction
[sidhom] Fix typo
[coheigea] Replacing size() == 0 with isEmpty()
[markliu] [BEAM-3841] Fix TestDataflowRunner.run to run_pipeline
[coheigea] Put the String literal first when comparing it to an Object
[ankurgoenka] Send error response for process bundle progress instead of throwing and
[tgroh] Use InstructionRequestHandler in RemoteEnvironment
[ekirpichov] BigQueryIO.read().fromQuery() improvements
[szewinho] [BEAM-3060] Fixing mvn dependency issue when runnning filebasedIOIT
[lukasz.gajowy] [BEAM-3798] Remove error check on dataflow when getting batch job state
[tgroh] Add ExecutableStage -> ProcessBundleDescriptor
[tgroh] Clean up GrpcFnServer Constructor Signature
[tgroh] Add a RemoteExecutionTest
[tgroh] Clean up a couple of SdkHarnessClient Signatures
[tgroh] Separate RemoteInputDestinations from SdkHarnessClient
[XuMingmin] [SQL] Add support for DOT expression (#4863)
[herohde] Add TODO to revert Go IO to use side input
[jb] [BEAM-3500] "Attach" JDBC connection to the bundle (improve the pooling)
[jb] [BEAM-3500] Test if the user provides both withDataSourceConfiguration()
[jb] [BEAM-3500] Wrap the datasource as a poolable datasource and expose
[jb] [BEAM-3500] Add commons-pool2 dependency
[jb] [BEAM-3500] Only expose max number of connections in the pool to the
[jb] [BEAM-3500] Cleanup pool configuration parameters
[jb] [BEAM-3500] Remove dataSourceFactory
[jb] [BEAM-3500] Remove unecessary check on dataSourceConfiguration
[szewinho] Jax-api added to dependencyManagement.
[szewinho] Jaxb-api added to beam root pom.xml
[szewinho] Removed empty line
[Pablo] Fixing counter string name.
[tgroh] Add Network Utility Methods
[lcwik] Fix missing license header in test.
[aaltay] Enable input subscription in Python streaming wordcount (#4864)
[tgroh] fixup! Add Network Utility Methods
[tgroh] Remove Future#set(null) in fn-execution
[herohde] [BEAM-3869] Fix Go Dataflow break due to zero timestamps
[axelmagn] Add a generic interface for the state service.
[herohde] Remove WindowedValue on PCollections for Go SDK
[cclauss] [BEAM-3872] Change Exception.message --> Exception.args[0]
[alan.myrvold] [BEAM-3249] Publish java artifacts using gradle
[herohde] CR: Fix comments to remove old windowing
[lcwik] Fix minor checkstyle/findbugs errors
[mariagh] Add support for streaming side inputs in the DirectRunner
[andreas.ehrencrona] [BEAM-2264] Credentials were not being reused between GCS calls
[ccy] Add support for PaneInfo in WindowedValues
[axelmagn] Write unit tests for GrpcStateService.
[XuMingmin] Bump calcite and avatica versions (#4887)
[axelmagn] Fix StateRequestHandler interface to be idiomatic
[herohde] Add Go support for universal runners, incl Flink
[herohde] CR: Fixed comments for job service helper functions
[iemejia] Add missing ASF license to ExecutableStageTranslation file
[szewinho] Updated gradle build to use jaxb-api. Jaxb-api version set to 2.2.12
[mariand] Switched AvroIO default codec to snappyCodec().
[yifanzou] [BEAM-3840] Get python mobile-gaming automating on core runners
[coheigea] Remove "i == numSplits" condition, which can never be reached as i is
[sidhom] [BEAM-3565] Clean up ExecutableStage
[wcn] Fix incorrect read of atomic counter.
[tgroh] Add a suborder parameter to Networks#topologicalOrder
[herohde] [BEAM-3893] Add fallback to unauthenticated access for GCS IO
[robertwb] [BEAM-3865] Fix watermark hold handling bug.
[robertwb] [BEAM-2927] Python support for dataflow portable side inputs over Fn API
[Pablo] Fixing check for sideinput_io_metrics experiment flag.
[herohde] CR: fix typo
[herohde] [BEAM-3897] Add Go wordcount example with multi output DoFns
[ccy] Replace side inputs when applying PTransformOverrides
[tgroh] Add QueryablePipeline#forTransforms
[herohde] Allow manual override of Go worker binary
[aaltay] [BEAM-3861] Improve test infra in Python SDK for streaming end-to-end
[iemejia] Remove testing package-info from main package for GCP IO
[iemejia] Update maven failsafe/surefire plugin to version 2.21.0
[iemejia] [BEAM-3873] Update commons-compress to version 1.16.1 (fix
[iemejia] Remove maven warnings
[tgroh] Add Side Inputs to ExecutableStage
[herohde] [BEAM-3866] Remove windowed value requirement for External
[lcwik] [BEAM-3903] Build the Go SDK examples using gradle
[markliu] Clean up terminal state check in TestDataflowRunner
[robertwb] Add mapper microbenchmark.
[szewinho] Scope removed from root pom.xml and jaxb-api dependency set to
[Pablo] Updating dataflow API protocol buffers.
[tgroh] Make RemoteEnvironment public
[boyuanz] Add cython annotation to make DistributionAccumulator faster
[tgroh] Move getId to the top-level pipeline node
[tgroh] Add FusedPipeline#toPipeline
[robertwb] Remove from docs generation.
[wcn] BEAM-3894: Add Protocol Buffer support
[altay] Convert big query writes to beam.io.WriteToBigQuery
[aaltay] Improve test util for PubSub exist check (#4922)
[XuMingmin] [BEAM-3851] Option to preserve element timestamp while publishing to
[ankurgoenka] Send worker_id in all channels to runner Adding
[wcn] Updating generated files.
[ehudm] Reduce precommit test timeouts for Java and Go.
[altay] More graceful fallback when grpc is not present.
[markliu] [BEAM-3861] Complete streaming wordcount test in Python SDK
[aaltay] [BEAM-3738] Enable py3 lint and cleanup tox.ini. (#4877)
------------------------------------------
[...truncated 145.98 KB...]
[INFO] Excluding com.google.auth:google-auth-library-appengine:jar:0.7.0 from the shaded jar.
[INFO] Excluding io.opencensus:opencensus-contrib-grpc-util:jar:0.7.0 from the shaded jar.
[INFO] Excluding io.opencensus:opencensus-api:jar:0.7.0 from the shaded jar.
[INFO] Excluding io.dropwizard.metrics:metrics-core:jar:3.1.2 from the shaded jar.
[INFO] Excluding io.netty:netty-tcnative-boringssl-static:jar:1.1.33.Fork26 from the shaded jar.
[INFO] Excluding com.google.api.grpc:proto-google-cloud-spanner-admin-database-v1:jar:0.1.9 from the shaded jar.
[INFO] Excluding com.google.api.grpc:proto-google-common-protos:jar:0.1.9 from the shaded jar.
[INFO] Excluding com.google.api-client:google-api-client:jar:1.22.0 from the shaded jar.
[INFO] Excluding com.google.oauth-client:google-oauth-client:jar:1.22.0 from the shaded jar.
[INFO] Excluding com.google.http-client:google-http-client:jar:1.22.0 from the shaded jar.
[INFO] Excluding org.apache.httpcomponents:httpclient:jar:4.0.1 from the shaded jar.
[INFO] Excluding org.apache.httpcomponents:httpcore:jar:4.0.1 from the shaded jar.
[INFO] Excluding com.google.http-client:google-http-client-jackson2:jar:1.22.0 from the shaded jar.
[INFO] Excluding com.google.apis:google-api-services-dataflow:jar:v1b3-rev221-1.22.0 from the shaded jar.
[INFO] Excluding com.google.apis:google-api-services-clouddebugger:jar:v2-rev8-1.22.0 from the shaded jar.
[INFO] Excluding com.google.apis:google-api-services-storage:jar:v1-rev71-1.22.0 from the shaded jar.
[INFO] Excluding com.google.auth:google-auth-library-credentials:jar:0.7.1 from the shaded jar.
[INFO] Excluding com.google.auth:google-auth-library-oauth2-http:jar:0.7.1 from the shaded jar.
[INFO] Excluding com.google.cloud.bigdataoss:util:jar:1.4.5 from the shaded jar.
[INFO] Excluding com.google.api-client:google-api-client-java6:jar:1.22.0 from the shaded jar.
[INFO] Excluding com.google.api-client:google-api-client-jackson2:jar:1.22.0 from the shaded jar.
[INFO] Excluding com.google.oauth-client:google-oauth-client-java6:jar:1.22.0 from the shaded jar.
[INFO] Excluding org.apache.beam:beam-sdks-java-io-hadoop-file-system:jar:2.5.0-SNAPSHOT from the shaded jar.
[INFO] Excluding org.apache.hadoop:hadoop-hdfs:jar:2.7.1 from the shaded jar.
[INFO] Excluding org.mortbay.jetty:jetty:jar:6.1.26 from the shaded jar.
[INFO] Excluding org.mortbay.jetty:jetty-util:jar:6.1.26 from the shaded jar.
[INFO] Excluding com.sun.jersey:jersey-core:jar:1.9 from the shaded jar.
[INFO] Excluding com.sun.jersey:jersey-server:jar:1.9 from the shaded jar.
[INFO] Excluding asm:asm:jar:3.1 from the shaded jar.
[INFO] Excluding commons-cli:commons-cli:jar:1.2 from the shaded jar.
[INFO] Excluding commons-codec:commons-codec:jar:1.4 from the shaded jar.
[INFO] Excluding commons-io:commons-io:jar:2.4 from the shaded jar.
[INFO] Excluding commons-lang:commons-lang:jar:2.6 from the shaded jar.
[INFO] Excluding commons-logging:commons-logging:jar:1.1.3 from the shaded jar.
[INFO] Excluding commons-daemon:commons-daemon:jar:1.0.13 from the shaded jar.
[INFO] Excluding log4j:log4j:jar:1.2.17 from the shaded jar.
[INFO] Excluding com.google.protobuf:protobuf-java:jar:3.2.0 from the shaded jar.
[INFO] Excluding javax.servlet:servlet-api:jar:2.5 from the shaded jar.
[INFO] Excluding xmlenc:xmlenc:jar:0.52 from the shaded jar.
[INFO] Excluding io.netty:netty-all:jar:4.0.23.Final from the shaded jar.
[INFO] Excluding xerces:xercesImpl:jar:2.9.1 from the shaded jar.
[INFO] Excluding xml-apis:xml-apis:jar:1.3.04 from the shaded jar.
[INFO] Excluding org.apache.htrace:htrace-core:jar:3.1.0-incubating from the shaded jar.
[INFO] Excluding org.fusesource.leveldbjni:leveldbjni-all:jar:1.8 from the shaded jar.
[INFO] Excluding org.apache.hadoop:hadoop-client:jar:2.7.1 from the shaded jar.
[INFO] Excluding org.apache.hadoop:hadoop-common:jar:2.7.3 from the shaded jar.
[INFO] Excluding org.apache.commons:commons-math3:jar:3.1.1 from the shaded jar.
[INFO] Excluding commons-httpclient:commons-httpclient:jar:3.1 from the shaded jar.
[INFO] Excluding commons-net:commons-net:jar:3.1 from the shaded jar.
[INFO] Excluding commons-collections:commons-collections:jar:3.2.2 from the shaded jar.
[INFO] Excluding javax.servlet.jsp:jsp-api:jar:2.1 from the shaded jar.
[INFO] Excluding commons-configuration:commons-configuration:jar:1.6 from the shaded jar.
[INFO] Excluding commons-digester:commons-digester:jar:1.8 from the shaded jar.
[INFO] Excluding commons-beanutils:commons-beanutils:jar:1.7.0 from the shaded jar.
[INFO] Excluding commons-beanutils:commons-beanutils-core:jar:1.8.0 from the shaded jar.
[INFO] Excluding org.slf4j:slf4j-log4j12:jar:1.7.10 from the shaded jar.
[INFO] Excluding com.google.code.gson:gson:jar:2.2.4 from the shaded jar.
[INFO] Excluding org.apache.hadoop:hadoop-auth:jar:2.7.3 from the shaded jar.
[INFO] Excluding org.apache.directory.server:apacheds-kerberos-codec:jar:2.0.0-M15 from the shaded jar.
[INFO] Excluding org.apache.directory.server:apacheds-i18n:jar:2.0.0-M15 from the shaded jar.
[INFO] Excluding org.apache.directory.api:api-asn1-api:jar:1.0.0-M20 from the shaded jar.
[INFO] Excluding org.apache.directory.api:api-util:jar:1.0.0-M20 from the shaded jar.
[INFO] Excluding org.apache.curator:curator-framework:jar:2.7.1 from the shaded jar.
[INFO] Excluding org.apache.curator:curator-client:jar:2.7.1 from the shaded jar.
[INFO] Excluding org.apache.curator:curator-recipes:jar:2.7.1 from the shaded jar.
[INFO] Excluding org.apache.zookeeper:zookeeper:jar:3.4.6 from the shaded jar.
[INFO] Excluding io.netty:netty:jar:3.7.0.Final from the shaded jar.
[INFO] Excluding org.apache.hadoop:hadoop-mapreduce-client-app:jar:2.7.1 from the shaded jar.
[INFO] Excluding org.apache.hadoop:hadoop-mapreduce-client-common:jar:2.7.1 from the shaded jar.
[INFO] Excluding org.apache.hadoop:hadoop-yarn-client:jar:2.7.1 from the shaded jar.
[INFO] Excluding org.apache.hadoop:hadoop-yarn-server-common:jar:2.7.1 from the shaded jar.
[INFO] Excluding org.apache.hadoop:hadoop-mapreduce-client-shuffle:jar:2.7.1 from the shaded jar.
[INFO] Excluding org.apache.hadoop:hadoop-yarn-api:jar:2.7.1 from the shaded jar.
[INFO] Excluding org.apache.hadoop:hadoop-mapreduce-client-core:jar:2.7.3 from the shaded jar.
[INFO] Excluding org.apache.hadoop:hadoop-yarn-common:jar:2.7.3 from the shaded jar.
[INFO] Excluding com.sun.jersey:jersey-client:jar:1.9 from the shaded jar.
[INFO] Excluding org.codehaus.jackson:jackson-jaxrs:jar:1.9.13 from the shaded jar.
[INFO] Excluding org.codehaus.jackson:jackson-xc:jar:1.9.13 from the shaded jar.
[INFO] Excluding org.apache.hadoop:hadoop-mapreduce-client-jobclient:jar:2.7.1 from the shaded jar.
[INFO] Excluding org.apache.hadoop:hadoop-annotations:jar:2.7.1 from the shaded jar.
[INFO] Replacing original artifact with shaded artifact.
[INFO] Replacing <https://builds.apache.org/job/beam_PerformanceTests_XmlIOIT_HDFS/ws/runs/981b7b67/beam/sdks/java/io/file-based-io-tests/target/beam-sdks-java-io-file-based-io-tests-2.5.0-SNAPSHOT.jar> with <https://builds.apache.org/job/beam_PerformanceTests_XmlIOIT_HDFS/ws/runs/981b7b67/beam/sdks/java/io/file-based-io-tests/target/beam-sdks-java-io-file-based-io-tests-2.5.0-SNAPSHOT-shaded.jar>
[INFO] Replacing original test artifact with shaded test artifact.
[INFO] Replacing <https://builds.apache.org/job/beam_PerformanceTests_XmlIOIT_HDFS/ws/runs/981b7b67/beam/sdks/java/io/file-based-io-tests/target/beam-sdks-java-io-file-based-io-tests-2.5.0-SNAPSHOT-tests.jar> with <https://builds.apache.org/job/beam_PerformanceTests_XmlIOIT_HDFS/ws/runs/981b7b67/beam/sdks/java/io/file-based-io-tests/target/beam-sdks-java-io-file-based-io-tests-2.5.0-SNAPSHOT-shaded-tests.jar>
[INFO]
[INFO] --- maven-failsafe-plugin:2.21.0:integration-test (default) @ beam-sdks-java-io-file-based-io-tests ---
[INFO] Failsafe report directory: <https://builds.apache.org/job/beam_PerformanceTests_XmlIOIT_HDFS/ws/runs/981b7b67/beam/sdks/java/io/file-based-io-tests/target/failsafe-reports>
[INFO] parallel='all', perCoreThreadCount=true, threadCount=4, useUnlimitedThreads=false, threadCountSuites=0, threadCountClasses=0, threadCountMethods=0, parallelOptimized=true
[INFO]
[INFO] -------------------------------------------------------
[INFO] T E S T S
[INFO] -------------------------------------------------------
[INFO] Running org.apache.beam.sdk.io.xml.XmlIOIT
[ERROR] Tests run: 1, Failures: 0, Errors: 1, Skipped: 0, Time elapsed: 103.062 s <<< FAILURE! - in org.apache.beam.sdk.io.xml.XmlIOIT
[ERROR] writeThenReadAll(org.apache.beam.sdk.io.xml.XmlIOIT) Time elapsed: 103.062 s <<< ERROR!
java.lang.RuntimeException: Startup of the worker pool in zone us-central1-f failed to bring up any of the desired 1 workers. QUOTA_EXCEEDED: Quota 'DISKS_TOTAL_GB' exceeded. Limit: 21000.0 in region us-central1.Workflow failed.
at org.apache.beam.runners.dataflow.TestDataflowRunner.run(TestDataflowRunner.java:134)
at org.apache.beam.runners.dataflow.TestDataflowRunner.run(TestDataflowRunner.java:90)
at org.apache.beam.runners.dataflow.TestDataflowRunner.run(TestDataflowRunner.java:55)
at org.apache.beam.sdk.Pipeline.run(Pipeline.java:311)
at org.apache.beam.sdk.testing.TestPipeline.run(TestPipeline.java:346)
at org.apache.beam.sdk.testing.TestPipeline.run(TestPipeline.java:328)
at org.apache.beam.sdk.io.xml.XmlIOIT.writeThenReadAll(XmlIOIT.java:131)
at sun.reflect.NativeMethodAccessorImpl.invoke0(Native Method)
at sun.reflect.NativeMethodAccessorImpl.invoke(NativeMethodAccessorImpl.java:62)
at sun.reflect.DelegatingMethodAccessorImpl.invoke(DelegatingMethodAccessorImpl.java:43)
at java.lang.reflect.Method.invoke(Method.java:498)
at org.junit.runners.model.FrameworkMethod$1.runReflectiveCall(FrameworkMethod.java:50)
at org.junit.internal.runners.model.ReflectiveCallable.run(ReflectiveCallable.java:12)
at org.junit.runners.model.FrameworkMethod.invokeExplosively(FrameworkMethod.java:47)
at org.junit.internal.runners.statements.InvokeMethod.evaluate(InvokeMethod.java:17)
at org.apache.beam.sdk.testing.TestPipeline$1.evaluate(TestPipeline.java:317)
at org.junit.rules.RunRules.evaluate(RunRules.java:20)
at org.junit.runners.ParentRunner.runLeaf(ParentRunner.java:325)
at org.junit.runners.BlockJUnit4ClassRunner.runChild(BlockJUnit4ClassRunner.java:78)
at org.junit.runners.BlockJUnit4ClassRunner.runChild(BlockJUnit4ClassRunner.java:57)
at org.junit.runners.ParentRunner$3.run(ParentRunner.java:290)
at org.apache.maven.surefire.junitcore.pc.Scheduler$1.run(Scheduler.java:410)
at java.util.concurrent.Executors$RunnableAdapter.call(Executors.java:511)
at java.util.concurrent.FutureTask.run(FutureTask.java:266)
at java.util.concurrent.ThreadPoolExecutor.runWorker(ThreadPoolExecutor.java:1149)
at java.util.concurrent.ThreadPoolExecutor$Worker.run(ThreadPoolExecutor.java:624)
at java.lang.Thread.run(Thread.java:748)
[INFO]
[INFO] Results:
[INFO]
[ERROR] Errors:
[ERROR] XmlIOIT.writeThenReadAll:131 Runtime Startup of the worker pool in zone us-c...
[INFO]
[ERROR] Tests run: 1, Failures: 0, Errors: 1, Skipped: 0
[INFO]
[INFO]
[INFO] --- maven-dependency-plugin:3.0.2:analyze-only (default) @ beam-sdks-java-io-file-based-io-tests ---
[INFO] No dependency problems found
[INFO]
[INFO] --- maven-failsafe-plugin:2.21.0:verify (default) @ beam-sdks-java-io-file-based-io-tests ---
[INFO] Failsafe report directory: <https://builds.apache.org/job/beam_PerformanceTests_XmlIOIT_HDFS/ws/runs/981b7b67/beam/sdks/java/io/file-based-io-tests/target/failsafe-reports>
[INFO] ------------------------------------------------------------------------
[INFO] BUILD FAILURE
[INFO] ------------------------------------------------------------------------
[INFO] Total time: 02:12 min
[INFO] Finished at: 2018-03-24T12:05:51Z
[INFO] Final Memory: 105M/1428M
[INFO] ------------------------------------------------------------------------
[ERROR] Failed to execute goal org.apache.maven.plugins:maven-failsafe-plugin:2.21.0:verify (default) on project beam-sdks-java-io-file-based-io-tests: There are test failures.
[ERROR]
[ERROR] Please refer to <https://builds.apache.org/job/beam_PerformanceTests_XmlIOIT_HDFS/ws/runs/981b7b67/beam/sdks/java/io/file-based-io-tests/target/failsafe-reports> for the individual test results.
[ERROR] Please refer to dump files (if any exist) [date]-jvmRun[N].dump, [date].dumpstream and [date]-jvmRun[N].dumpstream.
[ERROR] -> [Help 1]
org.apache.maven.lifecycle.LifecycleExecutionException: Failed to execute goal org.apache.maven.plugins:maven-failsafe-plugin:2.21.0:verify (default) on project beam-sdks-java-io-file-based-io-tests: There are test failures.
Please refer to <https://builds.apache.org/job/beam_PerformanceTests_XmlIOIT_HDFS/ws/runs/981b7b67/beam/sdks/java/io/file-based-io-tests/target/failsafe-reports> for the individual test results.
Please refer to dump files (if any exist) [date]-jvmRun[N].dump, [date].dumpstream and [date]-jvmRun[N].dumpstream.
at org.apache.maven.lifecycle.internal.MojoExecutor.execute (MojoExecutor.java:213)
at org.apache.maven.lifecycle.internal.MojoExecutor.execute (MojoExecutor.java:154)
at org.apache.maven.lifecycle.internal.MojoExecutor.execute (MojoExecutor.java:146)
at org.apache.maven.lifecycle.internal.LifecycleModuleBuilder.buildProject (LifecycleModuleBuilder.java:117)
at org.apache.maven.lifecycle.internal.LifecycleModuleBuilder.buildProject (LifecycleModuleBuilder.java:81)
at org.apache.maven.lifecycle.internal.builder.singlethreaded.SingleThreadedBuilder.build (SingleThreadedBuilder.java:51)
at org.apache.maven.lifecycle.internal.LifecycleStarter.execute (LifecycleStarter.java:128)
at org.apache.maven.DefaultMaven.doExecute (DefaultMaven.java:309)
at org.apache.maven.DefaultMaven.doExecute (DefaultMaven.java:194)
at org.apache.maven.DefaultMaven.execute (DefaultMaven.java:107)
at org.apache.maven.cli.MavenCli.execute (MavenCli.java:955)
at org.apache.maven.cli.MavenCli.doMain (MavenCli.java:290)
at org.apache.maven.cli.MavenCli.main (MavenCli.java:194)
at sun.reflect.NativeMethodAccessorImpl.invoke0 (Native Method)
at sun.reflect.NativeMethodAccessorImpl.invoke (NativeMethodAccessorImpl.java:62)
at sun.reflect.DelegatingMethodAccessorImpl.invoke (DelegatingMethodAccessorImpl.java:43)
at java.lang.reflect.Method.invoke (Method.java:498)
at org.codehaus.plexus.classworlds.launcher.Launcher.launchEnhanced (Launcher.java:289)
at org.codehaus.plexus.classworlds.launcher.Launcher.launch (Launcher.java:229)
at org.codehaus.plexus.classworlds.launcher.Launcher.mainWithExitCode (Launcher.java:415)
at org.codehaus.plexus.classworlds.launcher.Launcher.main (Launcher.java:356)
Caused by: org.apache.maven.plugin.MojoFailureException: There are test failures.
Please refer to <https://builds.apache.org/job/beam_PerformanceTests_XmlIOIT_HDFS/ws/runs/981b7b67/beam/sdks/java/io/file-based-io-tests/target/failsafe-reports> for the individual test results.
Please refer to dump files (if any exist) [date]-jvmRun[N].dump, [date].dumpstream and [date]-jvmRun[N].dumpstream.
at org.apache.maven.plugin.surefire.SurefireHelper.throwException (SurefireHelper.java:240)
at org.apache.maven.plugin.surefire.SurefireHelper.reportExecution (SurefireHelper.java:112)
at org.apache.maven.plugin.failsafe.VerifyMojo.execute (VerifyMojo.java:192)
at org.apache.maven.plugin.DefaultBuildPluginManager.executeMojo (DefaultBuildPluginManager.java:134)
at org.apache.maven.lifecycle.internal.MojoExecutor.execute (MojoExecutor.java:208)
at org.apache.maven.lifecycle.internal.MojoExecutor.execute (MojoExecutor.java:154)
at org.apache.maven.lifecycle.internal.MojoExecutor.execute (MojoExecutor.java:146)
at org.apache.maven.lifecycle.internal.LifecycleModuleBuilder.buildProject (LifecycleModuleBuilder.java:117)
at org.apache.maven.lifecycle.internal.LifecycleModuleBuilder.buildProject (LifecycleModuleBuilder.java:81)
at org.apache.maven.lifecycle.internal.builder.singlethreaded.SingleThreadedBuilder.build (SingleThreadedBuilder.java:51)
at org.apache.maven.lifecycle.internal.LifecycleStarter.execute (LifecycleStarter.java:128)
at org.apache.maven.DefaultMaven.doExecute (DefaultMaven.java:309)
at org.apache.maven.DefaultMaven.doExecute (DefaultMaven.java:194)
at org.apache.maven.DefaultMaven.execute (DefaultMaven.java:107)
at org.apache.maven.cli.MavenCli.execute (MavenCli.java:955)
at org.apache.maven.cli.MavenCli.doMain (MavenCli.java:290)
at org.apache.maven.cli.MavenCli.main (MavenCli.java:194)
at sun.reflect.NativeMethodAccessorImpl.invoke0 (Native Method)
at sun.reflect.NativeMethodAccessorImpl.invoke (NativeMethodAccessorImpl.java:62)
at sun.reflect.DelegatingMethodAccessorImpl.invoke (DelegatingMethodAccessorImpl.java:43)
at java.lang.reflect.Method.invoke (Method.java:498)
at org.codehaus.plexus.classworlds.launcher.Launcher.launchEnhanced (Launcher.java:289)
at org.codehaus.plexus.classworlds.launcher.Launcher.launch (Launcher.java:229)
at org.codehaus.plexus.classworlds.launcher.Launcher.mainWithExitCode (Launcher.java:415)
at org.codehaus.plexus.classworlds.launcher.Launcher.main (Launcher.java:356)
[ERROR]
[ERROR] Re-run Maven using the -X switch to enable full debug logging.
[ERROR]
[ERROR] For more information about the errors and possible solutions, please read the following articles:
[ERROR] [Help 1] http://cwiki.apache.org/confluence/display/MAVEN/MojoFailureException
STDERR:
2018-03-24 12:05:51,827 981b7b67 MainThread beam_integration_benchmark(1/1) ERROR Error during benchmark beam_integration_benchmark
Traceback (most recent call last):
File "<https://builds.apache.org/job/beam_PerformanceTests_XmlIOIT_HDFS/ws/PerfKitBenchmarker/perfkitbenchmarker/pkb.py",> line 624, in RunBenchmark
DoRunPhase(spec, collector, detailed_timer)
File "<https://builds.apache.org/job/beam_PerformanceTests_XmlIOIT_HDFS/ws/PerfKitBenchmarker/perfkitbenchmarker/pkb.py",> line 527, in DoRunPhase
samples = spec.BenchmarkRun(spec)
File "<https://builds.apache.org/job/beam_PerformanceTests_XmlIOIT_HDFS/ws/PerfKitBenchmarker/perfkitbenchmarker/linux_benchmarks/beam_integration_benchmark.py",> line 159, in Run
job_type=job_type)
File "<https://builds.apache.org/job/beam_PerformanceTests_XmlIOIT_HDFS/ws/PerfKitBenchmarker/perfkitbenchmarker/providers/gcp/gcp_dpb_dataflow.py",> line 90, in SubmitJob
assert retcode == 0, "Integration Test Failed."
AssertionError: Integration Test Failed.
2018-03-24 12:05:51,828 981b7b67 MainThread beam_integration_benchmark(1/1) INFO Cleaning up benchmark beam_integration_benchmark
2018-03-24 12:05:51,828 981b7b67 MainThread beam_integration_benchmark(1/1) INFO Running: kubectl --kubeconfig=<https://builds.apache.org/job/beam_PerformanceTests_XmlIOIT_HDFS/ws/config-filebasedioithdfs-1521890089916> delete -f <https://builds.apache.org/job/beam_PerformanceTests_XmlIOIT_HDFS/ws/src/.test-infra/kubernetes/hadoop/SmallITCluster/hdfs-single-datanode-cluster.yml>
2018-03-24 12:05:52,322 981b7b67 MainThread beam_integration_benchmark(1/1) INFO Running: kubectl --kubeconfig=<https://builds.apache.org/job/beam_PerformanceTests_XmlIOIT_HDFS/ws/config-filebasedioithdfs-1521890089916> delete -f <https://builds.apache.org/job/beam_PerformanceTests_XmlIOIT_HDFS/ws/src/.test-infra/kubernetes/hadoop/SmallITCluster/hdfs-single-datanode-cluster-for-local-dev.yml>
2018-03-24 12:05:52,505 981b7b67 MainThread beam_integration_benchmark(1/1) ERROR Exception running benchmark
Traceback (most recent call last):
File "<https://builds.apache.org/job/beam_PerformanceTests_XmlIOIT_HDFS/ws/PerfKitBenchmarker/perfkitbenchmarker/pkb.py",> line 758, in RunBenchmarkTask
RunBenchmark(spec, collector)
File "<https://builds.apache.org/job/beam_PerformanceTests_XmlIOIT_HDFS/ws/PerfKitBenchmarker/perfkitbenchmarker/pkb.py",> line 624, in RunBenchmark
DoRunPhase(spec, collector, detailed_timer)
File "<https://builds.apache.org/job/beam_PerformanceTests_XmlIOIT_HDFS/ws/PerfKitBenchmarker/perfkitbenchmarker/pkb.py",> line 527, in DoRunPhase
samples = spec.BenchmarkRun(spec)
File "<https://builds.apache.org/job/beam_PerformanceTests_XmlIOIT_HDFS/ws/PerfKitBenchmarker/perfkitbenchmarker/linux_benchmarks/beam_integration_benchmark.py",> line 159, in Run
job_type=job_type)
File "<https://builds.apache.org/job/beam_PerformanceTests_XmlIOIT_HDFS/ws/PerfKitBenchmarker/perfkitbenchmarker/providers/gcp/gcp_dpb_dataflow.py",> line 90, in SubmitJob
assert retcode == 0, "Integration Test Failed."
AssertionError: Integration Test Failed.
2018-03-24 12:05:52,506 981b7b67 MainThread beam_integration_benchmark(1/1) ERROR Benchmark 1/1 beam_integration_benchmark (UID: beam_integration_benchmark0) failed. Execution will continue.
2018-03-24 12:05:52,506 981b7b67 MainThread beam_integration_benchmark(1/1) INFO Benchmark run statuses:
---------------------------------------------------------------------------------
Name UID Status Failed Substatus
---------------------------------------------------------------------------------
beam_integration_benchmark beam_integration_benchmark0 FAILED
---------------------------------------------------------------------------------
Success rate: 0.00% (0/1)
2018-03-24 12:05:52,507 981b7b67 MainThread beam_integration_benchmark(1/1) INFO Complete logs can be found at: <https://builds.apache.org/job/beam_PerformanceTests_XmlIOIT_HDFS/ws/runs/981b7b67/pkb.log>
2018-03-24 12:05:52,507 981b7b67 MainThread beam_integration_benchmark(1/1) INFO Completion statuses can be found at: <https://builds.apache.org/job/beam_PerformanceTests_XmlIOIT_HDFS/ws/runs/981b7b67/completion_statuses.json>
Build step 'Execute shell' marked build as failure
Jenkins build is back to normal :
beam_PerformanceTests_XmlIOIT_HDFS #4
Posted by Apache Jenkins Server <je...@builds.apache.org>.
See <https://builds.apache.org/job/beam_PerformanceTests_XmlIOIT_HDFS/4/display/redirect?page=changes>