You are viewing a plain text version of this content. The canonical link for it is here.
Posted to dev@tuscany.apache.org by "Luciano Resende (JIRA)" <tu...@ws.apache.org> on 2007/09/12 00:49:33 UTC
[jira] Created: (TUSCANY-1687) Callable References iTest are
failing
Callable References iTest are failing
-------------------------------------
Key: TUSCANY-1687
URL: https://issues.apache.org/jira/browse/TUSCANY-1687
Project: Tuscany
Issue Type: Bug
Components: Java SCA Integration Tests
Affects Versions: Java-SCA-1.0
Reporter: Luciano Resende
Fix For: Java-SCA-1.0
I have removed the callableReference iTest from build as they were failing..
Tests run: 7, Failures: 0, Errors: 0, Skipped: 0, Time elapsed: 0.328 sec
Results :
Tests in error:
testBReference(org.apache.tuscany.sca.itest.callableref.CallableReferenceRemoteTestCase)
testBCast(org.apache.tuscany.sca.itest.callableref.CallableReferenceRemoteTestCase)
testCReference(org.apache.tuscany.sca.itest.callableref.CallableReferenceRemoteTestCase)
testCServiceReference(org.apache.tuscany.sca.itest.callableref.CallableReferenceRemoteTestCase)
testDReference(org.apache.tuscany.sca.itest.callableref.CallableReferenceRemoteTestCase)
org.apache.tuscany.sca.itest.callableref.CallableReferenceRemoteTestCase
Tests run: 14, Failures: 0, Errors: 6, Skipped: 0
[INFO] ------------------------------------------------------------------------
[ERROR] BUILD FAILURE
[INFO] ------------------------------------------------------------------------
[INFO] There are test failures.
[INFO] ------------------------------------------------------------------------
[INFO] For more information, run Maven with the -e switch
[INFO] ------------------------------------------------------------------------
[INFO] Total time: 40 seconds
[INFO] Finished at: Tue Sep 11 15:42:18 PDT 2007
[INFO] Final Memory: 10M/21M
[INFO] ------------------------------------------------------------------------
--
This message is automatically generated by JIRA.
-
You can reply to this email to add a comment to the issue online.
---------------------------------------------------------------------
To unsubscribe, e-mail: tuscany-dev-unsubscribe@ws.apache.org
For additional commands, e-mail: tuscany-dev-help@ws.apache.org
[jira] Commented: (TUSCANY-1687) Callable References iTest are
failing
Posted by "Raymond Feng (JIRA)" <tu...@ws.apache.org>.
[ https://issues.apache.org/jira/browse/TUSCANY-1687?page=com.atlassian.jira.plugin.system.issuetabpanels:comment-tabpanel#action_12527299 ]
Raymond Feng commented on TUSCANY-1687:
---------------------------------------
After fixing the composite and sca-contributions.xml. I got most of the test case working.
There are two more issues:
1) If we have remotable component services in two nodes, and they will be bound to the same HTTP port. Then it will fail saying the net address is in use. If we have all the components in one node, then it's fine.
2) We have issue passing the CallbableReferences remotely.
> Callable References iTest are failing
> -------------------------------------
>
> Key: TUSCANY-1687
> URL: https://issues.apache.org/jira/browse/TUSCANY-1687
> Project: Tuscany
> Issue Type: Bug
> Components: Java SCA Integration Tests
> Affects Versions: Java-SCA-1.0
> Reporter: Luciano Resende
> Assignee: Raymond Feng
> Fix For: Java-SCA-1.0
>
>
> I have removed the callableReference iTest from build as they were failing..
> Tests run: 7, Failures: 0, Errors: 0, Skipped: 0, Time elapsed: 0.328 sec
> Results :
> Tests in error:
> testBReference(org.apache.tuscany.sca.itest.callableref.CallableReferenceRemoteTestCase)
> testBCast(org.apache.tuscany.sca.itest.callableref.CallableReferenceRemoteTestCase)
> testCReference(org.apache.tuscany.sca.itest.callableref.CallableReferenceRemoteTestCase)
> testCServiceReference(org.apache.tuscany.sca.itest.callableref.CallableReferenceRemoteTestCase)
> testDReference(org.apache.tuscany.sca.itest.callableref.CallableReferenceRemoteTestCase)
> org.apache.tuscany.sca.itest.callableref.CallableReferenceRemoteTestCase
> Tests run: 14, Failures: 0, Errors: 6, Skipped: 0
> [INFO] ------------------------------------------------------------------------
> [ERROR] BUILD FAILURE
> [INFO] ------------------------------------------------------------------------
> [INFO] There are test failures.
> [INFO] ------------------------------------------------------------------------
> [INFO] For more information, run Maven with the -e switch
> [INFO] ------------------------------------------------------------------------
> [INFO] Total time: 40 seconds
> [INFO] Finished at: Tue Sep 11 15:42:18 PDT 2007
> [INFO] Final Memory: 10M/21M
> [INFO] ------------------------------------------------------------------------
--
This message is automatically generated by JIRA.
-
You can reply to this email to add a comment to the issue online.
---------------------------------------------------------------------
To unsubscribe, e-mail: tuscany-dev-unsubscribe@ws.apache.org
For additional commands, e-mail: tuscany-dev-help@ws.apache.org
[jira] Assigned: (TUSCANY-1687) Callable References iTest are
failing
Posted by "Raymond Feng (JIRA)" <tu...@ws.apache.org>.
[ https://issues.apache.org/jira/browse/TUSCANY-1687?page=com.atlassian.jira.plugin.system.issuetabpanels:all-tabpanel ]
Raymond Feng reassigned TUSCANY-1687:
-------------------------------------
Assignee: Raymond Feng
> Callable References iTest are failing
> -------------------------------------
>
> Key: TUSCANY-1687
> URL: https://issues.apache.org/jira/browse/TUSCANY-1687
> Project: Tuscany
> Issue Type: Bug
> Components: Java SCA Integration Tests
> Affects Versions: Java-SCA-1.0
> Reporter: Luciano Resende
> Assignee: Raymond Feng
> Fix For: Java-SCA-1.0
>
>
> I have removed the callableReference iTest from build as they were failing..
> Tests run: 7, Failures: 0, Errors: 0, Skipped: 0, Time elapsed: 0.328 sec
> Results :
> Tests in error:
> testBReference(org.apache.tuscany.sca.itest.callableref.CallableReferenceRemoteTestCase)
> testBCast(org.apache.tuscany.sca.itest.callableref.CallableReferenceRemoteTestCase)
> testCReference(org.apache.tuscany.sca.itest.callableref.CallableReferenceRemoteTestCase)
> testCServiceReference(org.apache.tuscany.sca.itest.callableref.CallableReferenceRemoteTestCase)
> testDReference(org.apache.tuscany.sca.itest.callableref.CallableReferenceRemoteTestCase)
> org.apache.tuscany.sca.itest.callableref.CallableReferenceRemoteTestCase
> Tests run: 14, Failures: 0, Errors: 6, Skipped: 0
> [INFO] ------------------------------------------------------------------------
> [ERROR] BUILD FAILURE
> [INFO] ------------------------------------------------------------------------
> [INFO] There are test failures.
> [INFO] ------------------------------------------------------------------------
> [INFO] For more information, run Maven with the -e switch
> [INFO] ------------------------------------------------------------------------
> [INFO] Total time: 40 seconds
> [INFO] Finished at: Tue Sep 11 15:42:18 PDT 2007
> [INFO] Final Memory: 10M/21M
> [INFO] ------------------------------------------------------------------------
--
This message is automatically generated by JIRA.
-
You can reply to this email to add a comment to the issue online.
---------------------------------------------------------------------
To unsubscribe, e-mail: tuscany-dev-unsubscribe@ws.apache.org
For additional commands, e-mail: tuscany-dev-help@ws.apache.org
[jira] Updated: (TUSCANY-1687) Callable References iTest are
failing
Posted by "ant elder (JIRA)" <tu...@ws.apache.org>.
[ https://issues.apache.org/jira/browse/TUSCANY-1687?page=com.atlassian.jira.plugin.system.issuetabpanels:all-tabpanel ]
ant elder updated TUSCANY-1687:
-------------------------------
Fix Version/s: (was: Java-SCA-1.0)
Java-SCA-Next
Deferring all the non-critical JIRAs from 1.0
> Callable References iTest are failing
> -------------------------------------
>
> Key: TUSCANY-1687
> URL: https://issues.apache.org/jira/browse/TUSCANY-1687
> Project: Tuscany
> Issue Type: Bug
> Components: Java SCA Integration Tests
> Affects Versions: Java-SCA-1.0
> Reporter: Luciano Resende
> Assignee: Raymond Feng
> Fix For: Java-SCA-Next
>
>
> I have removed the callableReference iTest from build as they were failing..
> Tests run: 7, Failures: 0, Errors: 0, Skipped: 0, Time elapsed: 0.328 sec
> Results :
> Tests in error:
> testBReference(org.apache.tuscany.sca.itest.callableref.CallableReferenceRemoteTestCase)
> testBCast(org.apache.tuscany.sca.itest.callableref.CallableReferenceRemoteTestCase)
> testCReference(org.apache.tuscany.sca.itest.callableref.CallableReferenceRemoteTestCase)
> testCServiceReference(org.apache.tuscany.sca.itest.callableref.CallableReferenceRemoteTestCase)
> testDReference(org.apache.tuscany.sca.itest.callableref.CallableReferenceRemoteTestCase)
> org.apache.tuscany.sca.itest.callableref.CallableReferenceRemoteTestCase
> Tests run: 14, Failures: 0, Errors: 6, Skipped: 0
> [INFO] ------------------------------------------------------------------------
> [ERROR] BUILD FAILURE
> [INFO] ------------------------------------------------------------------------
> [INFO] There are test failures.
> [INFO] ------------------------------------------------------------------------
> [INFO] For more information, run Maven with the -e switch
> [INFO] ------------------------------------------------------------------------
> [INFO] Total time: 40 seconds
> [INFO] Finished at: Tue Sep 11 15:42:18 PDT 2007
> [INFO] Final Memory: 10M/21M
> [INFO] ------------------------------------------------------------------------
--
This message is automatically generated by JIRA.
-
You can reply to this email to add a comment to the issue online.
---------------------------------------------------------------------
To unsubscribe, e-mail: tuscany-dev-unsubscribe@ws.apache.org
For additional commands, e-mail: tuscany-dev-help@ws.apache.org
[jira] Commented: (TUSCANY-1687) Callable References iTest are
failing
Posted by "Simon Laws (JIRA)" <tu...@ws.apache.org>.
[ https://issues.apache.org/jira/browse/TUSCANY-1687?page=com.atlassian.jira.plugin.system.issuetabpanels:comment-tabpanel#action_12527372 ]
Simon Laws commented on TUSCANY-1687:
-------------------------------------
Sorry folks, I notice there were two composite files that I neglected to add to svn.
I have components A & D on NodeA and B & C on NodeB. I'll go and change it back to that.
You are right though that there is still a problem with the remote passing of the callable reference.
> Callable References iTest are failing
> -------------------------------------
>
> Key: TUSCANY-1687
> URL: https://issues.apache.org/jira/browse/TUSCANY-1687
> Project: Tuscany
> Issue Type: Bug
> Components: Java SCA Integration Tests
> Affects Versions: Java-SCA-1.0
> Reporter: Luciano Resende
> Assignee: Raymond Feng
> Fix For: Java-SCA-1.0
>
>
> I have removed the callableReference iTest from build as they were failing..
> Tests run: 7, Failures: 0, Errors: 0, Skipped: 0, Time elapsed: 0.328 sec
> Results :
> Tests in error:
> testBReference(org.apache.tuscany.sca.itest.callableref.CallableReferenceRemoteTestCase)
> testBCast(org.apache.tuscany.sca.itest.callableref.CallableReferenceRemoteTestCase)
> testCReference(org.apache.tuscany.sca.itest.callableref.CallableReferenceRemoteTestCase)
> testCServiceReference(org.apache.tuscany.sca.itest.callableref.CallableReferenceRemoteTestCase)
> testDReference(org.apache.tuscany.sca.itest.callableref.CallableReferenceRemoteTestCase)
> org.apache.tuscany.sca.itest.callableref.CallableReferenceRemoteTestCase
> Tests run: 14, Failures: 0, Errors: 6, Skipped: 0
> [INFO] ------------------------------------------------------------------------
> [ERROR] BUILD FAILURE
> [INFO] ------------------------------------------------------------------------
> [INFO] There are test failures.
> [INFO] ------------------------------------------------------------------------
> [INFO] For more information, run Maven with the -e switch
> [INFO] ------------------------------------------------------------------------
> [INFO] Total time: 40 seconds
> [INFO] Finished at: Tue Sep 11 15:42:18 PDT 2007
> [INFO] Final Memory: 10M/21M
> [INFO] ------------------------------------------------------------------------
--
This message is automatically generated by JIRA.
-
You can reply to this email to add a comment to the issue online.
---------------------------------------------------------------------
To unsubscribe, e-mail: tuscany-dev-unsubscribe@ws.apache.org
For additional commands, e-mail: tuscany-dev-help@ws.apache.org
[jira] Resolved: (TUSCANY-1687) Callable References iTest are
failing
Posted by "Simon Laws (JIRA)" <tu...@ws.apache.org>.
[ https://issues.apache.org/jira/browse/TUSCANY-1687?page=com.atlassian.jira.plugin.system.issuetabpanels:all-tabpanel ]
Simon Laws resolved TUSCANY-1687.
---------------------------------
Resolution: Fixed
Fix Version/s: (was: Java-SCA-Next)
Java-SCA-1.1
This is now fixed and both local and remote (over ws) callable reference itests are running as part of the build
> Callable References iTest are failing
> -------------------------------------
>
> Key: TUSCANY-1687
> URL: https://issues.apache.org/jira/browse/TUSCANY-1687
> Project: Tuscany
> Issue Type: Bug
> Components: Java SCA Integration Tests
> Affects Versions: Java-SCA-1.0
> Reporter: Luciano Resende
> Assignee: Raymond Feng
> Fix For: Java-SCA-1.1
>
>
> I have removed the callableReference iTest from build as they were failing..
> Tests run: 7, Failures: 0, Errors: 0, Skipped: 0, Time elapsed: 0.328 sec
> Results :
> Tests in error:
> testBReference(org.apache.tuscany.sca.itest.callableref.CallableReferenceRemoteTestCase)
> testBCast(org.apache.tuscany.sca.itest.callableref.CallableReferenceRemoteTestCase)
> testCReference(org.apache.tuscany.sca.itest.callableref.CallableReferenceRemoteTestCase)
> testCServiceReference(org.apache.tuscany.sca.itest.callableref.CallableReferenceRemoteTestCase)
> testDReference(org.apache.tuscany.sca.itest.callableref.CallableReferenceRemoteTestCase)
> org.apache.tuscany.sca.itest.callableref.CallableReferenceRemoteTestCase
> Tests run: 14, Failures: 0, Errors: 6, Skipped: 0
> [INFO] ------------------------------------------------------------------------
> [ERROR] BUILD FAILURE
> [INFO] ------------------------------------------------------------------------
> [INFO] There are test failures.
> [INFO] ------------------------------------------------------------------------
> [INFO] For more information, run Maven with the -e switch
> [INFO] ------------------------------------------------------------------------
> [INFO] Total time: 40 seconds
> [INFO] Finished at: Tue Sep 11 15:42:18 PDT 2007
> [INFO] Final Memory: 10M/21M
> [INFO] ------------------------------------------------------------------------
--
This message is automatically generated by JIRA.
-
You can reply to this email to add a comment to the issue online.
---------------------------------------------------------------------
To unsubscribe, e-mail: tuscany-dev-unsubscribe@ws.apache.org
For additional commands, e-mail: tuscany-dev-help@ws.apache.org