You are viewing a plain text version of this content. The canonical link for it is here.
Posted to yarn-dev@hadoop.apache.org by Apache Jenkins Server <je...@builds.apache.org> on 2014/12/12 19:30:40 UTC

Failed: YARN-2938 PreCommit Build #6103

Jira: https://issues.apache.org/jira/browse/YARN-2938
Build: https://builds.apache.org/job/PreCommit-YARN-Build/6103/

###################################################################################
########################## LAST 60 LINES OF THE CONSOLE ###########################
[...truncated 23 lines...]

======================================================================
======================================================================
    Testing patch for YARN-2938.
======================================================================
======================================================================


HEAD is now at 3681de2  YARN-2912 Jersey Tests failing with port in use. (varun saxena via stevel)
Previous HEAD position was 3681de2...  YARN-2912 Jersey Tests failing with port in use. (varun saxena via stevel)
Switched to branch 'trunk'
Your branch is behind 'origin/trunk' by 1 commit, and can be fast-forwarded.
  (use "git pull" to update your local branch)
First, rewinding head to replay your work on top of it...
Fast-forwarded trunk to 3681de203949f84c9fa4a6df49948dbf6980c9ba.
YARN-2938 patch is being downloaded at Fri Dec 12 18:30:33 UTC 2014 from
http://issues.apache.org/jira/secure/attachment/12686669/YARN-2938.002.patch
cp: cannot stat '/home/jenkins/buildSupport/lib/*': No such file or directory
The patch does not appear to apply with p0 to p2
PATCH APPLICATION FAILED




{color:red}-1 overall{color}.  Here are the results of testing the latest attachment 
  http://issues.apache.org/jira/secure/attachment/12686669/YARN-2938.002.patch
  against trunk revision 3681de2.

    {color:red}-1 patch{color}.  The patch command could not apply the patch.

Console output: https://builds.apache.org/job/PreCommit-YARN-Build/6103//console

This message is automatically generated.


======================================================================
======================================================================
    Adding comment to Jira.
======================================================================
======================================================================


Comment added.
6f295817f532bba0c6362c95e37697a314015230 logged out


======================================================================
======================================================================
    Finished build.
======================================================================
======================================================================


Build step 'Execute shell' marked build as failure
Archiving artifacts
[description-setter] Could not determine description.
Recording test results
Email was triggered for: Failure
Sending email for trigger: Failure



###################################################################################
############################## FAILED TESTS (if any) ##############################
No tests ran.

Failed: YARN-313 PreCommit Build #6121

Posted by Apache Jenkins Server <je...@builds.apache.org>.
Jira: https://issues.apache.org/jira/browse/YARN-313
Build: https://builds.apache.org/job/PreCommit-YARN-Build/6121/

###################################################################################
########################## LAST 60 LINES OF THE CONSOLE ###########################
[...truncated 3899 lines...]

    {color:green}+1 @author{color}.  The patch does not contain any @author tags.

    {color:green}+1 tests included{color}.  The patch appears to include 4 new or modified test files.

    {color:green}+1 javac{color}.  The applied patch does not increase the total number of javac compiler warnings.

    {color:green}+1 javadoc{color}.  There were no new javadoc warning messages.

    {color:green}+1 eclipse:eclipse{color}.  The patch built with eclipse:eclipse.

    {color:red}-1 findbugs{color}.  The patch appears to introduce 49 new Findbugs (version 2.0.3) warnings.

    {color:green}+1 release audit{color}.  The applied patch does not increase the total number of release audit warnings.

    {color:red}-1 core tests{color}.  The patch failed these unit tests in hadoop-yarn-project/hadoop-yarn/hadoop-yarn-api hadoop-yarn-project/hadoop-yarn/hadoop-yarn-client hadoop-yarn-project/hadoop-yarn/hadoop-yarn-common hadoop-yarn-project/hadoop-yarn/hadoop-yarn-server/hadoop-yarn-server-resourcemanager:

                  org.apache.hadoop.yarn.client.TestResourceTrackerOnHA
                  org.apache.hadoop.yarn.client.TestApplicationClientProtocolOnHA

Test results: https://builds.apache.org/job/PreCommit-YARN-Build/6121//testReport/
Findbugs warnings: https://builds.apache.org/job/PreCommit-YARN-Build/6121//artifact/patchprocess/newPatchFindbugsWarningshadoop-yarn-client.html
Findbugs warnings: https://builds.apache.org/job/PreCommit-YARN-Build/6121//artifact/patchprocess/newPatchFindbugsWarningshadoop-yarn-server-resourcemanager.html
Findbugs warnings: https://builds.apache.org/job/PreCommit-YARN-Build/6121//artifact/patchprocess/newPatchFindbugsWarningshadoop-yarn-common.html
Console output: https://builds.apache.org/job/PreCommit-YARN-Build/6121//console

This message is automatically generated.


======================================================================
======================================================================
    Adding comment to Jira.
======================================================================
======================================================================


Comment added.
3cfaa9eb49150173361ac542f7b413a74695b055 logged out


======================================================================
======================================================================
    Finished build.
======================================================================
======================================================================


Build step 'Execute shell' marked build as failure
Archiving artifacts
Sending artifact delta relative to PreCommit-YARN-Build #6051
Archived 30 artifacts
Archive block size is 32768
Received 150 blocks and 4844532 bytes
Compression is 50.4%
Took 1.4 sec
[description-setter] Could not determine description.
Recording test results
Email was triggered for: Failure
Sending email for trigger: Failure



###################################################################################
############################## FAILED TESTS (if any) ##############################
8 tests failed.
FAILED:  org.apache.hadoop.yarn.client.TestApplicationClientProtocolOnHA.testGetContainersOnHA

Error Message:
Call From asf905.gq1.ygridcore.net/67.195.81.149 to asf905.gq1.ygridcore.net:28032 failed on connection exception: java.net.ConnectException: Connection refused; For more details see:  http://wiki.apache.org/hadoop/ConnectionRefused

Stack Trace:
java.net.ConnectException: Call From asf905.gq1.ygridcore.net/67.195.81.149 to asf905.gq1.ygridcore.net:28032 failed on connection exception: java.net.ConnectException: Connection refused; For more details see:  http://wiki.apache.org/hadoop/ConnectionRefused
	at sun.nio.ch.SocketChannelImpl.checkConnect(Native Method)
	at sun.nio.ch.SocketChannelImpl.finishConnect(SocketChannelImpl.java:739)
	at org.apache.hadoop.net.SocketIOWithTimeout.connect(SocketIOWithTimeout.java:206)
	at org.apache.hadoop.net.NetUtils.connect(NetUtils.java:530)
	at org.apache.hadoop.net.NetUtils.connect(NetUtils.java:494)
	at org.apache.hadoop.ipc.Client$Connection.setupConnection(Client.java:607)
	at org.apache.hadoop.ipc.Client$Connection.setupIOstreams(Client.java:705)
	at org.apache.hadoop.ipc.Client$Connection.access$2800(Client.java:368)
	at org.apache.hadoop.ipc.Client.getConnection(Client.java:1521)
	at org.apache.hadoop.ipc.Client.call(Client.java:1438)
	at org.apache.hadoop.ipc.Client.call(Client.java:1399)
	at org.apache.hadoop.ipc.ProtobufRpcEngine$Invoker.invoke(ProtobufRpcEngine.java:230)
	at com.sun.proxy.$Proxy17.getContainers(Unknown Source)
	at org.apache.hadoop.yarn.api.impl.pb.client.ApplicationClientProtocolPBClientImpl.getContainers(ApplicationClientProtocolPBClientImpl.java:410)
	at sun.reflect.NativeMethodAccessorImpl.invoke0(Native Method)
	at sun.reflect.NativeMethodAccessorImpl.invoke(NativeMethodAccessorImpl.java:57)
	at sun.reflect.DelegatingMethodAccessorImpl.invoke(DelegatingMethodAccessorImpl.java:43)
	at java.lang.reflect.Method.invoke(Method.java:606)
	at org.apache.hadoop.io.retry.RetryInvocationHandler.invokeMethod(RetryInvocationHandler.java:186)
	at org.apache.hadoop.io.retry.RetryInvocationHandler.invoke(RetryInvocationHandler.java:101)
	at com.sun.proxy.$Proxy18.getContainers(Unknown Source)
	at org.apache.hadoop.yarn.client.api.impl.YarnClientImpl.getContainers(YarnClientImpl.java:654)
	at org.apache.hadoop.yarn.client.TestApplicationClientProtocolOnHA.testGetContainersOnHA(TestApplicationClientProtocolOnHA.java:154)


FAILED:  org.apache.hadoop.yarn.client.TestApplicationClientProtocolOnHA.testGetNewApplicationOnHA

Error Message:
Call From asf905.gq1.ygridcore.net/67.195.81.149 to asf905.gq1.ygridcore.net:28032 failed on connection exception: java.net.ConnectException: Connection refused; For more details see:  http://wiki.apache.org/hadoop/ConnectionRefused

Stack Trace:
java.net.ConnectException: Call From asf905.gq1.ygridcore.net/67.195.81.149 to asf905.gq1.ygridcore.net:28032 failed on connection exception: java.net.ConnectException: Connection refused; For more details see:  http://wiki.apache.org/hadoop/ConnectionRefused
	at sun.nio.ch.SocketChannelImpl.checkConnect(Native Method)
	at sun.nio.ch.SocketChannelImpl.finishConnect(SocketChannelImpl.java:739)
	at org.apache.hadoop.net.SocketIOWithTimeout.connect(SocketIOWithTimeout.java:206)
	at org.apache.hadoop.net.NetUtils.connect(NetUtils.java:530)
	at org.apache.hadoop.net.NetUtils.connect(NetUtils.java:494)
	at org.apache.hadoop.ipc.Client$Connection.setupConnection(Client.java:607)
	at org.apache.hadoop.ipc.Client$Connection.setupIOstreams(Client.java:705)
	at org.apache.hadoop.ipc.Client$Connection.access$2800(Client.java:368)
	at org.apache.hadoop.ipc.Client.getConnection(Client.java:1521)
	at org.apache.hadoop.ipc.Client.call(Client.java:1438)
	at org.apache.hadoop.ipc.Client.call(Client.java:1399)
	at org.apache.hadoop.ipc.ProtobufRpcEngine$Invoker.invoke(ProtobufRpcEngine.java:230)
	at com.sun.proxy.$Proxy17.getNewApplication(Unknown Source)
	at org.apache.hadoop.yarn.api.impl.pb.client.ApplicationClientProtocolPBClientImpl.getNewApplication(ApplicationClientProtocolPBClientImpl.java:217)
	at sun.reflect.NativeMethodAccessorImpl.invoke0(Native Method)
	at sun.reflect.NativeMethodAccessorImpl.invoke(NativeMethodAccessorImpl.java:57)
	at sun.reflect.DelegatingMethodAccessorImpl.invoke(DelegatingMethodAccessorImpl.java:43)
	at java.lang.reflect.Method.invoke(Method.java:606)
	at org.apache.hadoop.io.retry.RetryInvocationHandler.invokeMethod(RetryInvocationHandler.java:186)
	at org.apache.hadoop.io.retry.RetryInvocationHandler.invoke(RetryInvocationHandler.java:101)
	at com.sun.proxy.$Proxy18.getNewApplication(Unknown Source)
	at org.apache.hadoop.yarn.client.api.impl.YarnClientImpl.getNewApplication(YarnClientImpl.java:206)
	at org.apache.hadoop.yarn.client.api.impl.YarnClientImpl.createApplication(YarnClientImpl.java:214)
	at org.apache.hadoop.yarn.client.TestApplicationClientProtocolOnHA.testGetNewApplicationOnHA(TestApplicationClientProtocolOnHA.java:76)


FAILED:  org.apache.hadoop.yarn.client.TestApplicationClientProtocolOnHA.testSubmitApplicationOnHA

Error Message:
Call From asf905.gq1.ygridcore.net/67.195.81.149 to asf905.gq1.ygridcore.net:28032 failed on connection exception: java.net.ConnectException: Connection refused; For more details see:  http://wiki.apache.org/hadoop/ConnectionRefused

Stack Trace:
java.net.ConnectException: Call From asf905.gq1.ygridcore.net/67.195.81.149 to asf905.gq1.ygridcore.net:28032 failed on connection exception: java.net.ConnectException: Connection refused; For more details see:  http://wiki.apache.org/hadoop/ConnectionRefused
	at sun.nio.ch.SocketChannelImpl.checkConnect(Native Method)
	at sun.nio.ch.SocketChannelImpl.finishConnect(SocketChannelImpl.java:739)
	at org.apache.hadoop.net.SocketIOWithTimeout.connect(SocketIOWithTimeout.java:206)
	at org.apache.hadoop.net.NetUtils.connect(NetUtils.java:530)
	at org.apache.hadoop.net.NetUtils.connect(NetUtils.java:494)
	at org.apache.hadoop.ipc.Client$Connection.setupConnection(Client.java:607)
	at org.apache.hadoop.ipc.Client$Connection.setupIOstreams(Client.java:705)
	at org.apache.hadoop.ipc.Client$Connection.access$2800(Client.java:368)
	at org.apache.hadoop.ipc.Client.getConnection(Client.java:1521)
	at org.apache.hadoop.ipc.Client.call(Client.java:1438)
	at org.apache.hadoop.ipc.Client.call(Client.java:1399)
	at org.apache.hadoop.ipc.ProtobufRpcEngine$Invoker.invoke(ProtobufRpcEngine.java:230)
	at com.sun.proxy.$Proxy17.submitApplication(Unknown Source)
	at org.apache.hadoop.yarn.api.impl.pb.client.ApplicationClientProtocolPBClientImpl.submitApplication(ApplicationClientProtocolPBClientImpl.java:232)
	at sun.reflect.NativeMethodAccessorImpl.invoke0(Native Method)
	at sun.reflect.NativeMethodAccessorImpl.invoke(NativeMethodAccessorImpl.java:57)
	at sun.reflect.DelegatingMethodAccessorImpl.invoke(DelegatingMethodAccessorImpl.java:43)
	at java.lang.reflect.Method.invoke(Method.java:606)
	at org.apache.hadoop.io.retry.RetryInvocationHandler.invokeMethod(RetryInvocationHandler.java:186)
	at org.apache.hadoop.io.retry.RetryInvocationHandler.invoke(RetryInvocationHandler.java:101)
	at com.sun.proxy.$Proxy18.submitApplication(Unknown Source)
	at org.apache.hadoop.yarn.client.api.impl.YarnClientImpl.submitApplication(YarnClientImpl.java:240)
	at org.apache.hadoop.yarn.client.TestApplicationClientProtocolOnHA.testSubmitApplicationOnHA(TestApplicationClientProtocolOnHA.java:173)


FAILED:  org.apache.hadoop.yarn.client.TestApplicationClientProtocolOnHA.testGetApplicationReportOnHA

Error Message:
Call From asf905.gq1.ygridcore.net/67.195.81.149 to asf905.gq1.ygridcore.net:28032 failed on connection exception: java.net.ConnectException: Connection refused; For more details see:  http://wiki.apache.org/hadoop/ConnectionRefused

Stack Trace:
java.net.ConnectException: Call From asf905.gq1.ygridcore.net/67.195.81.149 to asf905.gq1.ygridcore.net:28032 failed on connection exception: java.net.ConnectException: Connection refused; For more details see:  http://wiki.apache.org/hadoop/ConnectionRefused
	at sun.nio.ch.SocketChannelImpl.checkConnect(Native Method)
	at sun.nio.ch.SocketChannelImpl.finishConnect(SocketChannelImpl.java:739)
	at org.apache.hadoop.net.SocketIOWithTimeout.connect(SocketIOWithTimeout.java:206)
	at org.apache.hadoop.net.NetUtils.connect(NetUtils.java:530)
	at org.apache.hadoop.net.NetUtils.connect(NetUtils.java:494)
	at org.apache.hadoop.ipc.Client$Connection.setupConnection(Client.java:607)
	at org.apache.hadoop.ipc.Client$Connection.setupIOstreams(Client.java:705)
	at org.apache.hadoop.ipc.Client$Connection.access$2800(Client.java:368)
	at org.apache.hadoop.ipc.Client.getConnection(Client.java:1521)
	at org.apache.hadoop.ipc.Client.call(Client.java:1438)
	at org.apache.hadoop.ipc.Client.call(Client.java:1399)
	at org.apache.hadoop.ipc.ProtobufRpcEngine$Invoker.invoke(ProtobufRpcEngine.java:230)
	at com.sun.proxy.$Proxy17.getApplicationReport(Unknown Source)
	at org.apache.hadoop.yarn.api.impl.pb.client.ApplicationClientProtocolPBClientImpl.getApplicationReport(ApplicationClientProtocolPBClientImpl.java:187)
	at sun.reflect.NativeMethodAccessorImpl.invoke0(Native Method)
	at sun.reflect.NativeMethodAccessorImpl.invoke(NativeMethodAccessorImpl.java:57)
	at sun.reflect.DelegatingMethodAccessorImpl.invoke(DelegatingMethodAccessorImpl.java:43)
	at java.lang.reflect.Method.invoke(Method.java:606)
	at org.apache.hadoop.io.retry.RetryInvocationHandler.invokeMethod(RetryInvocationHandler.java:186)
	at org.apache.hadoop.io.retry.RetryInvocationHandler.invoke(RetryInvocationHandler.java:101)
	at com.sun.proxy.$Proxy18.getApplicationReport(Unknown Source)
	at org.apache.hadoop.yarn.client.api.impl.YarnClientImpl.getApplicationReport(YarnClientImpl.java:399)
	at org.apache.hadoop.yarn.client.TestApplicationClientProtocolOnHA.testGetApplicationReportOnHA(TestApplicationClientProtocolOnHA.java:68)


FAILED:  org.apache.hadoop.yarn.client.TestApplicationClientProtocolOnHA.testGetQueueInfoOnHA

Error Message:
Call From asf905.gq1.ygridcore.net/67.195.81.149 to asf905.gq1.ygridcore.net:28032 failed on connection exception: java.net.ConnectException: Connection refused; For more details see:  http://wiki.apache.org/hadoop/ConnectionRefused

Stack Trace:
java.net.ConnectException: Call From asf905.gq1.ygridcore.net/67.195.81.149 to asf905.gq1.ygridcore.net:28032 failed on connection exception: java.net.ConnectException: Connection refused; For more details see:  http://wiki.apache.org/hadoop/ConnectionRefused
	at sun.nio.ch.SocketChannelImpl.checkConnect(Native Method)
	at sun.nio.ch.SocketChannelImpl.finishConnect(SocketChannelImpl.java:739)
	at org.apache.hadoop.net.SocketIOWithTimeout.connect(SocketIOWithTimeout.java:206)
	at org.apache.hadoop.net.NetUtils.connect(NetUtils.java:530)
	at org.apache.hadoop.net.NetUtils.connect(NetUtils.java:494)
	at org.apache.hadoop.ipc.Client$Connection.setupConnection(Client.java:607)
	at org.apache.hadoop.ipc.Client$Connection.setupIOstreams(Client.java:705)
	at org.apache.hadoop.ipc.Client$Connection.access$2800(Client.java:368)
	at org.apache.hadoop.ipc.Client.getConnection(Client.java:1521)
	at org.apache.hadoop.ipc.Client.call(Client.java:1438)
	at org.apache.hadoop.ipc.Client.call(Client.java:1399)
	at org.apache.hadoop.ipc.ProtobufRpcEngine$Invoker.invoke(ProtobufRpcEngine.java:230)
	at com.sun.proxy.$Proxy17.getQueueInfo(Unknown Source)
	at org.apache.hadoop.yarn.api.impl.pb.client.ApplicationClientProtocolPBClientImpl.getQueueInfo(ApplicationClientProtocolPBClientImpl.java:276)
	at sun.reflect.NativeMethodAccessorImpl.invoke0(Native Method)
	at sun.reflect.NativeMethodAccessorImpl.invoke(NativeMethodAccessorImpl.java:57)
	at sun.reflect.DelegatingMethodAccessorImpl.invoke(DelegatingMethodAccessorImpl.java:43)
	at java.lang.reflect.Method.invoke(Method.java:606)
	at org.apache.hadoop.io.retry.RetryInvocationHandler.invokeMethod(RetryInvocationHandler.java:186)
	at org.apache.hadoop.io.retry.RetryInvocationHandler.invoke(RetryInvocationHandler.java:101)
	at com.sun.proxy.$Proxy18.getQueueInfo(Unknown Source)
	at org.apache.hadoop.yarn.client.api.impl.YarnClientImpl.getQueueInfo(YarnClientImpl.java:509)
	at org.apache.hadoop.yarn.client.TestApplicationClientProtocolOnHA.testGetQueueInfoOnHA(TestApplicationClientProtocolOnHA.java:111)


FAILED:  org.apache.hadoop.yarn.client.TestApplicationClientProtocolOnHA.testGetContainerReportOnHA

Error Message:
Call From asf905.gq1.ygridcore.net/67.195.81.149 to asf905.gq1.ygridcore.net:28032 failed on connection exception: java.net.ConnectException: Connection refused; For more details see:  http://wiki.apache.org/hadoop/ConnectionRefused

Stack Trace:
java.net.ConnectException: Call From asf905.gq1.ygridcore.net/67.195.81.149 to asf905.gq1.ygridcore.net:28032 failed on connection exception: java.net.ConnectException: Connection refused; For more details see:  http://wiki.apache.org/hadoop/ConnectionRefused
	at sun.nio.ch.SocketChannelImpl.checkConnect(Native Method)
	at sun.nio.ch.SocketChannelImpl.finishConnect(SocketChannelImpl.java:739)
	at org.apache.hadoop.net.SocketIOWithTimeout.connect(SocketIOWithTimeout.java:206)
	at org.apache.hadoop.net.NetUtils.connect(NetUtils.java:530)
	at org.apache.hadoop.net.NetUtils.connect(NetUtils.java:494)
	at org.apache.hadoop.ipc.Client$Connection.setupConnection(Client.java:607)
	at org.apache.hadoop.ipc.Client$Connection.setupIOstreams(Client.java:705)
	at org.apache.hadoop.ipc.Client$Connection.access$2800(Client.java:368)
	at org.apache.hadoop.ipc.Client.getConnection(Client.java:1521)
	at org.apache.hadoop.ipc.Client.call(Client.java:1438)
	at org.apache.hadoop.ipc.Client.call(Client.java:1399)
	at org.apache.hadoop.ipc.ProtobufRpcEngine$Invoker.invoke(ProtobufRpcEngine.java:230)
	at com.sun.proxy.$Proxy17.getContainerReport(Unknown Source)
	at org.apache.hadoop.yarn.api.impl.pb.client.ApplicationClientProtocolPBClientImpl.getContainerReport(ApplicationClientProtocolPBClientImpl.java:396)
	at sun.reflect.NativeMethodAccessorImpl.invoke0(Native Method)
	at sun.reflect.NativeMethodAccessorImpl.invoke(NativeMethodAccessorImpl.java:57)
	at sun.reflect.DelegatingMethodAccessorImpl.invoke(DelegatingMethodAccessorImpl.java:43)
	at java.lang.reflect.Method.invoke(Method.java:606)
	at org.apache.hadoop.io.retry.RetryInvocationHandler.invokeMethod(RetryInvocationHandler.java:186)
	at org.apache.hadoop.io.retry.RetryInvocationHandler.invoke(RetryInvocationHandler.java:101)
	at com.sun.proxy.$Proxy18.getContainerReport(Unknown Source)
	at org.apache.hadoop.yarn.client.api.impl.YarnClientImpl.getContainerReport(YarnClientImpl.java:629)
	at org.apache.hadoop.yarn.client.TestApplicationClientProtocolOnHA.testGetContainerReportOnHA(TestApplicationClientProtocolOnHA.java:146)


FAILED:  org.apache.hadoop.yarn.client.TestApplicationClientProtocolOnHA.testGetClusterMetricsOnHA

Error Message:
Call From asf905.gq1.ygridcore.net/67.195.81.149 to asf905.gq1.ygridcore.net:28032 failed on connection exception: java.net.ConnectException: Connection refused; For more details see:  http://wiki.apache.org/hadoop/ConnectionRefused

Stack Trace:
java.net.ConnectException: Call From asf905.gq1.ygridcore.net/67.195.81.149 to asf905.gq1.ygridcore.net:28032 failed on connection exception: java.net.ConnectException: Connection refused; For more details see:  http://wiki.apache.org/hadoop/ConnectionRefused
	at sun.nio.ch.SocketChannelImpl.checkConnect(Native Method)
	at sun.nio.ch.SocketChannelImpl.finishConnect(SocketChannelImpl.java:739)
	at org.apache.hadoop.net.SocketIOWithTimeout.connect(SocketIOWithTimeout.java:206)
	at org.apache.hadoop.net.NetUtils.connect(NetUtils.java:530)
	at org.apache.hadoop.net.NetUtils.connect(NetUtils.java:494)
	at org.apache.hadoop.ipc.Client$Connection.setupConnection(Client.java:607)
	at org.apache.hadoop.ipc.Client$Connection.setupIOstreams(Client.java:705)
	at org.apache.hadoop.ipc.Client$Connection.access$2800(Client.java:368)
	at org.apache.hadoop.ipc.Client.getConnection(Client.java:1521)
	at org.apache.hadoop.ipc.Client.call(Client.java:1438)
	at org.apache.hadoop.ipc.Client.call(Client.java:1399)
	at org.apache.hadoop.ipc.ProtobufRpcEngine$Invoker.invoke(ProtobufRpcEngine.java:230)
	at com.sun.proxy.$Proxy17.getClusterMetrics(Unknown Source)
	at org.apache.hadoop.yarn.api.impl.pb.client.ApplicationClientProtocolPBClientImpl.getClusterMetrics(ApplicationClientProtocolPBClientImpl.java:202)
	at sun.reflect.NativeMethodAccessorImpl.invoke0(Native Method)
	at sun.reflect.NativeMethodAccessorImpl.invoke(NativeMethodAccessorImpl.java:57)
	at sun.reflect.DelegatingMethodAccessorImpl.invoke(DelegatingMethodAccessorImpl.java:43)
	at java.lang.reflect.Method.invoke(Method.java:606)
	at org.apache.hadoop.io.retry.RetryInvocationHandler.invokeMethod(RetryInvocationHandler.java:186)
	at org.apache.hadoop.io.retry.RetryInvocationHandler.invoke(RetryInvocationHandler.java:101)
	at com.sun.proxy.$Proxy18.getClusterMetrics(Unknown Source)
	at org.apache.hadoop.yarn.client.api.impl.YarnClientImpl.getYarnClusterMetrics(YarnClientImpl.java:461)
	at org.apache.hadoop.yarn.client.TestApplicationClientProtocolOnHA.testGetClusterMetricsOnHA(TestApplicationClientProtocolOnHA.java:85)


FAILED:  org.apache.hadoop.yarn.client.TestResourceTrackerOnHA.testResourceTrackerOnHA

Error Message:
Call From asf905.gq1.ygridcore.net/67.195.81.149 to asf905.gq1.ygridcore.net:28031 failed on connection exception: java.net.ConnectException: Connection refused; For more details see:  http://wiki.apache.org/hadoop/ConnectionRefused

Stack Trace:
java.net.ConnectException: Call From asf905.gq1.ygridcore.net/67.195.81.149 to asf905.gq1.ygridcore.net:28031 failed on connection exception: java.net.ConnectException: Connection refused; For more details see:  http://wiki.apache.org/hadoop/ConnectionRefused
	at sun.nio.ch.SocketChannelImpl.checkConnect(Native Method)
	at sun.nio.ch.SocketChannelImpl.finishConnect(SocketChannelImpl.java:739)
	at org.apache.hadoop.net.SocketIOWithTimeout.connect(SocketIOWithTimeout.java:206)
	at org.apache.hadoop.net.NetUtils.connect(NetUtils.java:530)
	at org.apache.hadoop.net.NetUtils.connect(NetUtils.java:494)
	at org.apache.hadoop.ipc.Client$Connection.setupConnection(Client.java:607)
	at org.apache.hadoop.ipc.Client$Connection.setupIOstreams(Client.java:705)
	at org.apache.hadoop.ipc.Client$Connection.access$2800(Client.java:368)
	at org.apache.hadoop.ipc.Client.getConnection(Client.java:1521)
	at org.apache.hadoop.ipc.Client.call(Client.java:1438)
	at org.apache.hadoop.ipc.Client.call(Client.java:1399)
	at org.apache.hadoop.ipc.ProtobufRpcEngine$Invoker.invoke(ProtobufRpcEngine.java:230)
	at com.sun.proxy.$Proxy87.registerNodeManager(Unknown Source)
	at org.apache.hadoop.yarn.server.api.impl.pb.client.ResourceTrackerPBClientImpl.registerNodeManager(ResourceTrackerPBClientImpl.java:68)
	at sun.reflect.NativeMethodAccessorImpl.invoke0(Native Method)
	at sun.reflect.NativeMethodAccessorImpl.invoke(NativeMethodAccessorImpl.java:57)
	at sun.reflect.DelegatingMethodAccessorImpl.invoke(DelegatingMethodAccessorImpl.java:43)
	at java.lang.reflect.Method.invoke(Method.java:606)
	at org.apache.hadoop.io.retry.RetryInvocationHandler.invokeMethod(RetryInvocationHandler.java:186)
	at org.apache.hadoop.io.retry.RetryInvocationHandler.invoke(RetryInvocationHandler.java:101)
	at com.sun.proxy.$Proxy88.registerNodeManager(Unknown Source)
	at org.apache.hadoop.yarn.client.TestResourceTrackerOnHA.testResourceTrackerOnHA(TestResourceTrackerOnHA.java:64)



Failed: YARN-2427 PreCommit Build #6120

Posted by Apache Jenkins Server <je...@builds.apache.org>.
Jira: https://issues.apache.org/jira/browse/YARN-2427
Build: https://builds.apache.org/job/PreCommit-YARN-Build/6120/

###################################################################################
########################## LAST 60 LINES OF THE CONSOLE ###########################
[...truncated 3294 lines...]


{color:red}-1 overall{color}.  Here are the results of testing the latest attachment 
  http://issues.apache.org/jira/secure/attachment/12687516/apache-yarn-2427.3.patch
  against trunk revision b7923a3.

    {color:green}+1 @author{color}.  The patch does not contain any @author tags.

    {color:green}+1 tests included{color}.  The patch appears to include 2 new or modified test files.

    {color:green}+1 javac{color}.  The applied patch does not increase the total number of javac compiler warnings.

    {color:green}+1 javadoc{color}.  There were no new javadoc warning messages.

    {color:green}+1 eclipse:eclipse{color}.  The patch built with eclipse:eclipse.

    {color:red}-1 findbugs{color}.  The patch appears to introduce 14 new Findbugs (version 2.0.3) warnings.

    {color:green}+1 release audit{color}.  The applied patch does not increase the total number of release audit warnings.

    {color:green}+1 core tests{color}.  The patch passed unit tests in hadoop-yarn-project/hadoop-yarn/hadoop-yarn-server/hadoop-yarn-server-resourcemanager.

Test results: https://builds.apache.org/job/PreCommit-YARN-Build/6120//testReport/
Findbugs warnings: https://builds.apache.org/job/PreCommit-YARN-Build/6120//artifact/patchprocess/newPatchFindbugsWarningshadoop-yarn-server-resourcemanager.html
Console output: https://builds.apache.org/job/PreCommit-YARN-Build/6120//console

This message is automatically generated.


======================================================================
======================================================================
    Adding comment to Jira.
======================================================================
======================================================================


Comment added.
7c7a39bd9e68515d47aa43701d67a61caa66b3be logged out


======================================================================
======================================================================
    Finished build.
======================================================================
======================================================================


Build step 'Execute shell' marked build as failure
Archiving artifacts
Sending artifact delta relative to PreCommit-YARN-Build #6051
Archived 15 artifacts
Archive block size is 32768
Received 42 blocks and 7499941 bytes
Compression is 15.5%
Took 2.1 sec
[description-setter] Could not determine description.
Recording test results
Email was triggered for: Failure
Sending email for trigger: Failure



###################################################################################
############################## FAILED TESTS (if any) ##############################
All tests passed

Failed: YARN-2949 PreCommit Build #6119

Posted by Apache Jenkins Server <je...@builds.apache.org>.
Jira: https://issues.apache.org/jira/browse/YARN-2949
Build: https://builds.apache.org/job/PreCommit-YARN-Build/6119/

###################################################################################
########################## LAST 60 LINES OF THE CONSOLE ###########################
[...truncated 2991 lines...]



{color:red}-1 overall{color}.  Here are the results of testing the latest attachment 
  http://issues.apache.org/jira/secure/attachment/12687233/apache-yarn-2949.0.patch
  against trunk revision 07bb0b0.

    {color:green}+1 @author{color}.  The patch does not contain any @author tags.

    {color:green}+0 tests included{color}.  The patch appears to be a documentation patch that doesn't require tests.

    {color:green}+1 javac{color}.  The applied patch does not increase the total number of javac compiler warnings.

    {color:green}+1 javadoc{color}.  There were no new javadoc warning messages.

    {color:green}+1 eclipse:eclipse{color}.  The patch built with eclipse:eclipse.

    {color:green}+1 findbugs{color}.  The patch does not introduce any new Findbugs (version 2.0.3) warnings.

    {color:green}+1 release audit{color}.  The applied patch does not increase the total number of release audit warnings.

    {color:green}+1 core tests{color}.  The patch passed unit tests in .

Test results: https://builds.apache.org/job/PreCommit-YARN-Build/6119//testReport/
Console output: https://builds.apache.org/job/PreCommit-YARN-Build/6119//console

This message is automatically generated.


======================================================================
======================================================================
    Adding comment to Jira.
======================================================================
======================================================================


Comment added.
fce27f4fae78cac27959d3250f49ee088cc34ae0 logged out


======================================================================
======================================================================
    Finished build.
======================================================================
======================================================================


Build step 'Execute shell' marked build as failure
Archiving artifacts
Sending artifact delta relative to PreCommit-YARN-Build #6051
Archived 10 artifacts
Archive block size is 32768
Received 160 blocks and 3271547 bytes
Compression is 61.6%
Took 1.2 sec
[description-setter] Could not determine description.
Recording test results
Email was triggered for: Failure
Sending email for trigger: Failure



###################################################################################
############################## FAILED TESTS (if any) ##############################
No tests ran.

Failed: YARN-2427 PreCommit Build #6118

Posted by Apache Jenkins Server <je...@builds.apache.org>.
Jira: https://issues.apache.org/jira/browse/YARN-2427
Build: https://builds.apache.org/job/PreCommit-YARN-Build/6118/

###################################################################################
########################## LAST 60 LINES OF THE CONSOLE ###########################
[...truncated 23 lines...]

======================================================================
======================================================================
    Testing patch for YARN-2427.
======================================================================
======================================================================


HEAD is now at 07bb0b0 HADOOP-11412 POMs mention "The Apache Software License" rather than "Apache License". (Herve Boutemy via stevel)
Previous HEAD position was 07bb0b0... HADOOP-11412 POMs mention "The Apache Software License" rather than "Apache License". (Herve Boutemy via stevel)
Switched to branch 'trunk'
Your branch is behind 'origin/trunk' by 4 commits, and can be fast-forwarded.
  (use "git pull" to update your local branch)
First, rewinding head to replay your work on top of it...
Fast-forwarded trunk to 07bb0b0bbb4732687c4992e8ce61a43ce8ba3db6.
YARN-2427 patch is being downloaded at Tue Dec 16 13:20:43 UTC 2014 from
http://issues.apache.org/jira/secure/attachment/12687486/apache-yarn-2427.3.patch
cp: cannot stat '/home/jenkins/buildSupport/lib/*': No such file or directory
The patch does not appear to apply with p0 to p2
PATCH APPLICATION FAILED




{color:red}-1 overall{color}.  Here are the results of testing the latest attachment 
  http://issues.apache.org/jira/secure/attachment/12687486/apache-yarn-2427.3.patch
  against trunk revision 07bb0b0.

    {color:red}-1 patch{color}.  The patch command could not apply the patch.

Console output: https://builds.apache.org/job/PreCommit-YARN-Build/6118//console

This message is automatically generated.


======================================================================
======================================================================
    Adding comment to Jira.
======================================================================
======================================================================


Comment added.
e8a95cfa01aeee54810dcccb929ff0778a8d0443 logged out


======================================================================
======================================================================
    Finished build.
======================================================================
======================================================================


Build step 'Execute shell' marked build as failure
Archiving artifacts
[description-setter] Could not determine description.
Recording test results
Email was triggered for: Failure
Sending email for trigger: Failure



###################################################################################
############################## FAILED TESTS (if any) ##############################
No tests ran.

Failed: YARN-2868 PreCommit Build #6117

Posted by Apache Jenkins Server <je...@builds.apache.org>.
Jira: https://issues.apache.org/jira/browse/YARN-2868
Build: https://builds.apache.org/job/PreCommit-YARN-Build/6117/

###################################################################################
########################## LAST 60 LINES OF THE CONSOLE ###########################
[...truncated 3332 lines...]
  against trunk revision a095622.

    {color:green}+1 @author{color}.  The patch does not contain any @author tags.

    {color:red}-1 tests included{color}.  The patch doesn't appear to include any new or modified tests.
                        Please justify why no new tests are needed for this patch.
                        Also please list what manual steps were performed to verify this patch.

    {color:green}+1 javac{color}.  The applied patch does not increase the total number of javac compiler warnings.

    {color:green}+1 javadoc{color}.  There were no new javadoc warning messages.

    {color:green}+1 eclipse:eclipse{color}.  The patch built with eclipse:eclipse.

    {color:red}-1 findbugs{color}.  The patch appears to introduce 14 new Findbugs (version 2.0.3) warnings.

    {color:green}+1 release audit{color}.  The applied patch does not increase the total number of release audit warnings.

    {color:red}-1 core tests{color}.  The patch failed these unit tests in hadoop-yarn-project/hadoop-yarn/hadoop-yarn-server/hadoop-yarn-server-resourcemanager:

                  org.apache.hadoop.yarn.server.resourcemanager.scheduler.fair.TestFairScheduler

Test results: https://builds.apache.org/job/PreCommit-YARN-Build/6117//testReport/
Findbugs warnings: https://builds.apache.org/job/PreCommit-YARN-Build/6117//artifact/patchprocess/newPatchFindbugsWarningshadoop-yarn-server-resourcemanager.html
Console output: https://builds.apache.org/job/PreCommit-YARN-Build/6117//console

This message is automatically generated.


======================================================================
======================================================================
    Adding comment to Jira.
======================================================================
======================================================================


Comment added.
d7bee527edfa126ab230172d319e83dac8cd7ded logged out


======================================================================
======================================================================
    Finished build.
======================================================================
======================================================================


Build step 'Execute shell' marked build as failure
Archiving artifacts
Sending artifact delta relative to PreCommit-YARN-Build #6051
Archived 15 artifacts
Archive block size is 32768
Received 159 blocks and 3665880 bytes
Compression is 58.7%
Took 0.94 sec
[description-setter] Could not determine description.
Recording test results
Email was triggered for: Failure
Sending email for trigger: Failure



###################################################################################
############################## FAILED TESTS (if any) ##############################
4 tests failed.
REGRESSION:  org.apache.hadoop.yarn.server.resourcemanager.scheduler.fair.TestFairScheduler.testRecoverRequestAfterPreemption

Error Message:
null

Stack Trace:
java.lang.NullPointerException: null
	at org.apache.hadoop.yarn.server.resourcemanager.scheduler.fair.QueueManager.ensureRootPrefix(QueueManager.java:348)
	at org.apache.hadoop.yarn.server.resourcemanager.scheduler.fair.QueueManager.getQueue(QueueManager.java:315)
	at org.apache.hadoop.yarn.server.resourcemanager.scheduler.fair.FairScheduler.allocate(FairScheduler.java:957)
	at org.apache.hadoop.yarn.server.resourcemanager.scheduler.fair.TestFairScheduler.testRecoverRequestAfterPreemption(TestFairScheduler.java:3710)


REGRESSION:  org.apache.hadoop.yarn.server.resourcemanager.scheduler.fair.TestFairScheduler.testReservationWhileMultiplePriorities

Error Message:
null

Stack Trace:
java.lang.NullPointerException: null
	at org.apache.hadoop.yarn.server.resourcemanager.scheduler.fair.QueueManager.ensureRootPrefix(QueueManager.java:348)
	at org.apache.hadoop.yarn.server.resourcemanager.scheduler.fair.QueueManager.getQueue(QueueManager.java:315)
	at org.apache.hadoop.yarn.server.resourcemanager.scheduler.fair.FairScheduler.allocate(FairScheduler.java:957)
	at org.apache.hadoop.yarn.server.resourcemanager.scheduler.fair.FairSchedulerTestBase.createSchedulingRequestExistingApplication(FairSchedulerTestBase.java:210)
	at org.apache.hadoop.yarn.server.resourcemanager.scheduler.fair.FairSchedulerTestBase.createSchedulingRequestExistingApplication(FairSchedulerTestBase.java:203)
	at org.apache.hadoop.yarn.server.resourcemanager.scheduler.fair.TestFairScheduler.testReservationWhileMultiplePriorities(TestFairScheduler.java:2246)


REGRESSION:  org.apache.hadoop.yarn.server.resourcemanager.scheduler.fair.TestFairScheduler.testUserMaxRunningApps

Error Message:
null

Stack Trace:
java.lang.NullPointerException: null
	at org.apache.hadoop.yarn.server.resourcemanager.scheduler.fair.QueueManager.ensureRootPrefix(QueueManager.java:348)
	at org.apache.hadoop.yarn.server.resourcemanager.scheduler.fair.QueueManager.getQueue(QueueManager.java:315)
	at org.apache.hadoop.yarn.server.resourcemanager.scheduler.fair.FairScheduler.allocate(FairScheduler.java:957)
	at org.apache.hadoop.yarn.server.resourcemanager.scheduler.fair.FairSchedulerTestBase.createSchedulingRequestExistingApplication(FairSchedulerTestBase.java:210)
	at org.apache.hadoop.yarn.server.resourcemanager.scheduler.fair.FairSchedulerTestBase.createSchedulingRequestExistingApplication(FairSchedulerTestBase.java:196)
	at org.apache.hadoop.yarn.server.resourcemanager.scheduler.fair.TestFairScheduler.testUserMaxRunningApps(TestFairScheduler.java:2211)


REGRESSION:  org.apache.hadoop.yarn.server.resourcemanager.scheduler.fair.TestFairScheduler.testReservationsStrictLocality

Error Message:
null

Stack Trace:
java.lang.NullPointerException: null
	at org.apache.hadoop.yarn.server.resourcemanager.scheduler.fair.QueueManager.ensureRootPrefix(QueueManager.java:348)
	at org.apache.hadoop.yarn.server.resourcemanager.scheduler.fair.QueueManager.getQueue(QueueManager.java:315)
	at org.apache.hadoop.yarn.server.resourcemanager.scheduler.fair.FairScheduler.allocate(FairScheduler.java:957)
	at org.apache.hadoop.yarn.server.resourcemanager.scheduler.fair.TestFairScheduler.testReservationsStrictLocality(TestFairScheduler.java:2794)



Failed: YARN-2952 PreCommit Build #6116

Posted by Apache Jenkins Server <je...@builds.apache.org>.
Jira: https://issues.apache.org/jira/browse/YARN-2952
Build: https://builds.apache.org/job/PreCommit-YARN-Build/6116/

###################################################################################
########################## LAST 60 LINES OF THE CONSOLE ###########################
[...truncated 3819 lines...]
{color:red}-1 overall{color}.  Here are the results of testing the latest attachment 
  http://issues.apache.org/jira/secure/attachment/12687061/0001-YARN-2952.patch
  against trunk revision a095622.

    {color:green}+1 @author{color}.  The patch does not contain any @author tags.

    {color:green}+1 tests included{color}.  The patch appears to include 2 new or modified test files.

    {color:green}+1 javac{color}.  The applied patch does not increase the total number of javac compiler warnings.

    {color:green}+1 javadoc{color}.  There were no new javadoc warning messages.

    {color:green}+1 eclipse:eclipse{color}.  The patch built with eclipse:eclipse.

    {color:red}-1 findbugs{color}.  The patch appears to introduce 45 new Findbugs (version 2.0.3) warnings.

    {color:green}+1 release audit{color}.  The applied patch does not increase the total number of release audit warnings.

    {color:green}+1 core tests{color}.  The patch passed unit tests in hadoop-mapreduce-project/hadoop-mapreduce-client/hadoop-mapreduce-client-shuffle hadoop-yarn-project/hadoop-yarn/hadoop-yarn-server/hadoop-yarn-server-applicationhistoryservice hadoop-yarn-project/hadoop-yarn/hadoop-yarn-server/hadoop-yarn-server-nodemanager hadoop-yarn-project/hadoop-yarn/hadoop-yarn-server/hadoop-yarn-server-resourcemanager.

Test results: https://builds.apache.org/job/PreCommit-YARN-Build/6116//testReport/
Findbugs warnings: https://builds.apache.org/job/PreCommit-YARN-Build/6116//artifact/patchprocess/newPatchFindbugsWarningshadoop-yarn-server-applicationhistoryservice.html
Findbugs warnings: https://builds.apache.org/job/PreCommit-YARN-Build/6116//artifact/patchprocess/newPatchFindbugsWarningshadoop-yarn-server-nodemanager.html
Findbugs warnings: https://builds.apache.org/job/PreCommit-YARN-Build/6116//artifact/patchprocess/newPatchFindbugsWarningshadoop-yarn-server-resourcemanager.html
Console output: https://builds.apache.org/job/PreCommit-YARN-Build/6116//console

This message is automatically generated.


======================================================================
======================================================================
    Adding comment to Jira.
======================================================================
======================================================================


Comment added.
978a24323f44928398fd57b836976f039b992096 logged out


======================================================================
======================================================================
    Finished build.
======================================================================
======================================================================


Build step 'Execute shell' marked build as failure
Archiving artifacts
Sending artifact delta relative to PreCommit-YARN-Build #6051
Archived 30 artifacts
Archive block size is 32768
Received 42 blocks and 8009279 bytes
Compression is 14.7%
Took 1.8 sec
[description-setter] Could not determine description.
Recording test results
Email was triggered for: Failure
Sending email for trigger: Failure



###################################################################################
############################## FAILED TESTS (if any) ##############################
All tests passed

Failed: YARN-2920 PreCommit Build #6115

Posted by Apache Jenkins Server <je...@builds.apache.org>.
Jira: https://issues.apache.org/jira/browse/YARN-2920
Build: https://builds.apache.org/job/PreCommit-YARN-Build/6115/

###################################################################################
########################## LAST 60 LINES OF THE CONSOLE ###########################
[...truncated 3413 lines...]

{color:red}-1 overall{color}.  Here are the results of testing the latest attachment 
  http://issues.apache.org/jira/secure/attachment/12686715/YARN-2920.6.patch
  against trunk revision a095622.

    {color:green}+1 @author{color}.  The patch does not contain any @author tags.

    {color:green}+1 tests included{color}.  The patch appears to include 2 new or modified test files.

    {color:green}+1 javac{color}.  The applied patch does not increase the total number of javac compiler warnings.

    {color:green}+1 javadoc{color}.  There were no new javadoc warning messages.

    {color:green}+1 eclipse:eclipse{color}.  The patch built with eclipse:eclipse.

    {color:red}-1 findbugs{color}.  The patch appears to introduce 27 new Findbugs (version 2.0.3) warnings.

    {color:green}+1 release audit{color}.  The applied patch does not increase the total number of release audit warnings.

    {color:green}+1 core tests{color}.  The patch passed unit tests in hadoop-tools/hadoop-sls hadoop-yarn-project/hadoop-yarn/hadoop-yarn-server/hadoop-yarn-server-resourcemanager.

Test results: https://builds.apache.org/job/PreCommit-YARN-Build/6115//testReport/
Findbugs warnings: https://builds.apache.org/job/PreCommit-YARN-Build/6115//artifact/patchprocess/newPatchFindbugsWarningshadoop-sls.html
Findbugs warnings: https://builds.apache.org/job/PreCommit-YARN-Build/6115//artifact/patchprocess/newPatchFindbugsWarningshadoop-yarn-server-resourcemanager.html
Console output: https://builds.apache.org/job/PreCommit-YARN-Build/6115//console

This message is automatically generated.


======================================================================
======================================================================
    Adding comment to Jira.
======================================================================
======================================================================


Comment added.
02cf768639b911264271466a97bb2db56bbcccef logged out


======================================================================
======================================================================
    Finished build.
======================================================================
======================================================================


Build step 'Execute shell' marked build as failure
Archiving artifacts
Sending artifact delta relative to PreCommit-YARN-Build #6051
Archived 20 artifacts
Archive block size is 32768
Received 156 blocks and 3888372 bytes
Compression is 56.8%
Took 1.1 sec
[description-setter] Could not determine description.
Recording test results
Email was triggered for: Failure
Sending email for trigger: Failure



###################################################################################
############################## FAILED TESTS (if any) ##############################
All tests passed

Failed: YARN-2762 PreCommit Build #6114

Posted by Apache Jenkins Server <je...@builds.apache.org>.
Jira: https://issues.apache.org/jira/browse/YARN-2762
Build: https://builds.apache.org/job/PreCommit-YARN-Build/6114/

###################################################################################
########################## LAST 60 LINES OF THE CONSOLE ###########################
[...truncated 3249 lines...]
{color:red}-1 overall{color}.  Here are the results of testing the latest attachment 
  http://issues.apache.org/jira/secure/attachment/12686760/YARN-2762.7.patch
  against trunk revision e597249.

    {color:green}+1 @author{color}.  The patch does not contain any @author tags.

    {color:green}+1 tests included{color}.  The patch appears to include 1 new or modified test files.

    {color:green}+1 javac{color}.  The applied patch does not increase the total number of javac compiler warnings.

    {color:green}+1 javadoc{color}.  There were no new javadoc warning messages.

    {color:green}+1 eclipse:eclipse{color}.  The patch built with eclipse:eclipse.

    {color:red}-1 findbugs{color}.  The patch appears to introduce 10 new Findbugs (version 2.0.3) warnings.

    {color:green}+1 release audit{color}.  The applied patch does not increase the total number of release audit warnings.

    {color:red}-1 core tests{color}.  The patch failed these unit tests in hadoop-yarn-project/hadoop-yarn/hadoop-yarn-client:

                  org.apache.hadoop.yarn.client.TestApplicationClientProtocolOnHA

Test results: https://builds.apache.org/job/PreCommit-YARN-Build/6114//testReport/
Findbugs warnings: https://builds.apache.org/job/PreCommit-YARN-Build/6114//artifact/patchprocess/newPatchFindbugsWarningshadoop-yarn-client.html
Console output: https://builds.apache.org/job/PreCommit-YARN-Build/6114//console

This message is automatically generated.


======================================================================
======================================================================
    Adding comment to Jira.
======================================================================
======================================================================


Comment added.
308f4ad5848068c92b207b61a04037d43098448d logged out


======================================================================
======================================================================
    Finished build.
======================================================================
======================================================================


Build step 'Execute shell' marked build as failure
Archiving artifacts
Sending artifact delta relative to PreCommit-YARN-Build #6051
Archived 15 artifacts
Archive block size is 32768
Received 42 blocks and 7254290 bytes
Compression is 15.9%
Took 3 sec
[description-setter] Could not determine description.
Recording test results
Email was triggered for: Failure
Sending email for trigger: Failure



###################################################################################
############################## FAILED TESTS (if any) ##############################
5 tests failed.
REGRESSION:  org.apache.hadoop.yarn.client.TestApplicationClientProtocolOnHA.testMoveApplicationAcrossQueuesOnHA

Error Message:
Call From asf908.gq1.ygridcore.net/67.195.81.152 to asf908.gq1.ygridcore.net:28032 failed on connection exception: java.net.ConnectException: Connection refused; For more details see:  http://wiki.apache.org/hadoop/ConnectionRefused

Stack Trace:
java.net.ConnectException: Call From asf908.gq1.ygridcore.net/67.195.81.152 to asf908.gq1.ygridcore.net:28032 failed on connection exception: java.net.ConnectException: Connection refused; For more details see:  http://wiki.apache.org/hadoop/ConnectionRefused
	at sun.nio.ch.SocketChannelImpl.checkConnect(Native Method)
	at sun.nio.ch.SocketChannelImpl.finishConnect(SocketChannelImpl.java:739)
	at org.apache.hadoop.net.SocketIOWithTimeout.connect(SocketIOWithTimeout.java:206)
	at org.apache.hadoop.net.NetUtils.connect(NetUtils.java:530)
	at org.apache.hadoop.net.NetUtils.connect(NetUtils.java:494)
	at org.apache.hadoop.ipc.Client$Connection.setupConnection(Client.java:607)
	at org.apache.hadoop.ipc.Client$Connection.setupIOstreams(Client.java:705)
	at org.apache.hadoop.ipc.Client$Connection.access$2800(Client.java:368)
	at org.apache.hadoop.ipc.Client.getConnection(Client.java:1521)
	at org.apache.hadoop.ipc.Client.call(Client.java:1438)
	at org.apache.hadoop.ipc.Client.call(Client.java:1399)
	at org.apache.hadoop.ipc.ProtobufRpcEngine$Invoker.invoke(ProtobufRpcEngine.java:230)
	at com.sun.proxy.$Proxy17.moveApplicationAcrossQueues(Unknown Source)
	at org.apache.hadoop.yarn.api.impl.pb.client.ApplicationClientProtocolPBClientImpl.moveApplicationAcrossQueues(ApplicationClientProtocolPBClientImpl.java:352)
	at sun.reflect.NativeMethodAccessorImpl.invoke0(Native Method)
	at sun.reflect.NativeMethodAccessorImpl.invoke(NativeMethodAccessorImpl.java:57)
	at sun.reflect.DelegatingMethodAccessorImpl.invoke(DelegatingMethodAccessorImpl.java:43)
	at java.lang.reflect.Method.invoke(Method.java:606)
	at org.apache.hadoop.io.retry.RetryInvocationHandler.invokeMethod(RetryInvocationHandler.java:186)
	at org.apache.hadoop.io.retry.RetryInvocationHandler.invoke(RetryInvocationHandler.java:101)
	at com.sun.proxy.$Proxy18.moveApplicationAcrossQueues(Unknown Source)
	at org.apache.hadoop.yarn.client.api.impl.YarnClientImpl.moveApplicationAcrossQueues(YarnClientImpl.java:675)
	at org.apache.hadoop.yarn.client.TestApplicationClientProtocolOnHA.testMoveApplicationAcrossQueuesOnHA(TestApplicationClientProtocolOnHA.java:180)


REGRESSION:  org.apache.hadoop.yarn.client.TestApplicationClientProtocolOnHA.testGetContainerReportOnHA

Error Message:
Call From asf908.gq1.ygridcore.net/67.195.81.152 to asf908.gq1.ygridcore.net:28032 failed on connection exception: java.net.ConnectException: Connection refused; For more details see:  http://wiki.apache.org/hadoop/ConnectionRefused

Stack Trace:
java.net.ConnectException: Call From asf908.gq1.ygridcore.net/67.195.81.152 to asf908.gq1.ygridcore.net:28032 failed on connection exception: java.net.ConnectException: Connection refused; For more details see:  http://wiki.apache.org/hadoop/ConnectionRefused
	at sun.nio.ch.SocketChannelImpl.checkConnect(Native Method)
	at sun.nio.ch.SocketChannelImpl.finishConnect(SocketChannelImpl.java:739)
	at org.apache.hadoop.net.SocketIOWithTimeout.connect(SocketIOWithTimeout.java:206)
	at org.apache.hadoop.net.NetUtils.connect(NetUtils.java:530)
	at org.apache.hadoop.net.NetUtils.connect(NetUtils.java:494)
	at org.apache.hadoop.ipc.Client$Connection.setupConnection(Client.java:607)
	at org.apache.hadoop.ipc.Client$Connection.setupIOstreams(Client.java:705)
	at org.apache.hadoop.ipc.Client$Connection.access$2800(Client.java:368)
	at org.apache.hadoop.ipc.Client.getConnection(Client.java:1521)
	at org.apache.hadoop.ipc.Client.call(Client.java:1438)
	at org.apache.hadoop.ipc.Client.call(Client.java:1399)
	at org.apache.hadoop.ipc.ProtobufRpcEngine$Invoker.invoke(ProtobufRpcEngine.java:230)
	at com.sun.proxy.$Proxy17.getContainerReport(Unknown Source)
	at org.apache.hadoop.yarn.api.impl.pb.client.ApplicationClientProtocolPBClientImpl.getContainerReport(ApplicationClientProtocolPBClientImpl.java:396)
	at sun.reflect.NativeMethodAccessorImpl.invoke0(Native Method)
	at sun.reflect.NativeMethodAccessorImpl.invoke(NativeMethodAccessorImpl.java:57)
	at sun.reflect.DelegatingMethodAccessorImpl.invoke(DelegatingMethodAccessorImpl.java:43)
	at java.lang.reflect.Method.invoke(Method.java:606)
	at org.apache.hadoop.io.retry.RetryInvocationHandler.invokeMethod(RetryInvocationHandler.java:186)
	at org.apache.hadoop.io.retry.RetryInvocationHandler.invoke(RetryInvocationHandler.java:101)
	at com.sun.proxy.$Proxy18.getContainerReport(Unknown Source)
	at org.apache.hadoop.yarn.client.api.impl.YarnClientImpl.getContainerReport(YarnClientImpl.java:629)
	at org.apache.hadoop.yarn.client.TestApplicationClientProtocolOnHA.testGetContainerReportOnHA(TestApplicationClientProtocolOnHA.java:146)


FAILED:  org.apache.hadoop.yarn.client.TestApplicationClientProtocolOnHA.testGetContainersOnHA

Error Message:
Call From asf908.gq1.ygridcore.net/67.195.81.152 to asf908.gq1.ygridcore.net:28032 failed on connection exception: java.net.ConnectException: Connection refused; For more details see:  http://wiki.apache.org/hadoop/ConnectionRefused

Stack Trace:
java.net.ConnectException: Call From asf908.gq1.ygridcore.net/67.195.81.152 to asf908.gq1.ygridcore.net:28032 failed on connection exception: java.net.ConnectException: Connection refused; For more details see:  http://wiki.apache.org/hadoop/ConnectionRefused
	at sun.nio.ch.SocketChannelImpl.checkConnect(Native Method)
	at sun.nio.ch.SocketChannelImpl.finishConnect(SocketChannelImpl.java:739)
	at org.apache.hadoop.net.SocketIOWithTimeout.connect(SocketIOWithTimeout.java:206)
	at org.apache.hadoop.net.NetUtils.connect(NetUtils.java:530)
	at org.apache.hadoop.net.NetUtils.connect(NetUtils.java:494)
	at org.apache.hadoop.ipc.Client$Connection.setupConnection(Client.java:607)
	at org.apache.hadoop.ipc.Client$Connection.setupIOstreams(Client.java:705)
	at org.apache.hadoop.ipc.Client$Connection.access$2800(Client.java:368)
	at org.apache.hadoop.ipc.Client.getConnection(Client.java:1521)
	at org.apache.hadoop.ipc.Client.call(Client.java:1438)
	at org.apache.hadoop.ipc.Client.call(Client.java:1399)
	at org.apache.hadoop.ipc.ProtobufRpcEngine$Invoker.invoke(ProtobufRpcEngine.java:230)
	at com.sun.proxy.$Proxy17.getContainers(Unknown Source)
	at org.apache.hadoop.yarn.api.impl.pb.client.ApplicationClientProtocolPBClientImpl.getContainers(ApplicationClientProtocolPBClientImpl.java:410)
	at sun.reflect.NativeMethodAccessorImpl.invoke0(Native Method)
	at sun.reflect.NativeMethodAccessorImpl.invoke(NativeMethodAccessorImpl.java:57)
	at sun.reflect.DelegatingMethodAccessorImpl.invoke(DelegatingMethodAccessorImpl.java:43)
	at java.lang.reflect.Method.invoke(Method.java:606)
	at org.apache.hadoop.io.retry.RetryInvocationHandler.invokeMethod(RetryInvocationHandler.java:186)
	at org.apache.hadoop.io.retry.RetryInvocationHandler.invoke(RetryInvocationHandler.java:101)
	at com.sun.proxy.$Proxy18.getContainers(Unknown Source)
	at org.apache.hadoop.yarn.client.api.impl.YarnClientImpl.getContainers(YarnClientImpl.java:654)
	at org.apache.hadoop.yarn.client.TestApplicationClientProtocolOnHA.testGetContainersOnHA(TestApplicationClientProtocolOnHA.java:154)


FAILED:  org.apache.hadoop.yarn.client.TestApplicationClientProtocolOnHA.testGetNewApplicationOnHA

Error Message:
Call From asf908.gq1.ygridcore.net/67.195.81.152 to asf908.gq1.ygridcore.net:28032 failed on connection exception: java.net.ConnectException: Connection refused; For more details see:  http://wiki.apache.org/hadoop/ConnectionRefused

Stack Trace:
java.net.ConnectException: Call From asf908.gq1.ygridcore.net/67.195.81.152 to asf908.gq1.ygridcore.net:28032 failed on connection exception: java.net.ConnectException: Connection refused; For more details see:  http://wiki.apache.org/hadoop/ConnectionRefused
	at sun.nio.ch.SocketChannelImpl.checkConnect(Native Method)
	at sun.nio.ch.SocketChannelImpl.finishConnect(SocketChannelImpl.java:739)
	at org.apache.hadoop.net.SocketIOWithTimeout.connect(SocketIOWithTimeout.java:206)
	at org.apache.hadoop.net.NetUtils.connect(NetUtils.java:530)
	at org.apache.hadoop.net.NetUtils.connect(NetUtils.java:494)
	at org.apache.hadoop.ipc.Client$Connection.setupConnection(Client.java:607)
	at org.apache.hadoop.ipc.Client$Connection.setupIOstreams(Client.java:705)
	at org.apache.hadoop.ipc.Client$Connection.access$2800(Client.java:368)
	at org.apache.hadoop.ipc.Client.getConnection(Client.java:1521)
	at org.apache.hadoop.ipc.Client.call(Client.java:1438)
	at org.apache.hadoop.ipc.Client.call(Client.java:1399)
	at org.apache.hadoop.ipc.ProtobufRpcEngine$Invoker.invoke(ProtobufRpcEngine.java:230)
	at com.sun.proxy.$Proxy17.getNewApplication(Unknown Source)
	at org.apache.hadoop.yarn.api.impl.pb.client.ApplicationClientProtocolPBClientImpl.getNewApplication(ApplicationClientProtocolPBClientImpl.java:217)
	at sun.reflect.NativeMethodAccessorImpl.invoke0(Native Method)
	at sun.reflect.NativeMethodAccessorImpl.invoke(NativeMethodAccessorImpl.java:57)
	at sun.reflect.DelegatingMethodAccessorImpl.invoke(DelegatingMethodAccessorImpl.java:43)
	at java.lang.reflect.Method.invoke(Method.java:606)
	at org.apache.hadoop.io.retry.RetryInvocationHandler.invokeMethod(RetryInvocationHandler.java:186)
	at org.apache.hadoop.io.retry.RetryInvocationHandler.invoke(RetryInvocationHandler.java:101)
	at com.sun.proxy.$Proxy18.getNewApplication(Unknown Source)
	at org.apache.hadoop.yarn.client.api.impl.YarnClientImpl.getNewApplication(YarnClientImpl.java:206)
	at org.apache.hadoop.yarn.client.api.impl.YarnClientImpl.createApplication(YarnClientImpl.java:214)
	at org.apache.hadoop.yarn.client.TestApplicationClientProtocolOnHA.testGetNewApplicationOnHA(TestApplicationClientProtocolOnHA.java:76)


FAILED:  org.apache.hadoop.yarn.client.TestApplicationClientProtocolOnHA.testSubmitApplicationOnHA

Error Message:
Call From asf908.gq1.ygridcore.net/67.195.81.152 to asf908.gq1.ygridcore.net:28032 failed on connection exception: java.net.ConnectException: Connection refused; For more details see:  http://wiki.apache.org/hadoop/ConnectionRefused

Stack Trace:
java.net.ConnectException: Call From asf908.gq1.ygridcore.net/67.195.81.152 to asf908.gq1.ygridcore.net:28032 failed on connection exception: java.net.ConnectException: Connection refused; For more details see:  http://wiki.apache.org/hadoop/ConnectionRefused
	at sun.nio.ch.SocketChannelImpl.checkConnect(Native Method)
	at sun.nio.ch.SocketChannelImpl.finishConnect(SocketChannelImpl.java:739)
	at org.apache.hadoop.net.SocketIOWithTimeout.connect(SocketIOWithTimeout.java:206)
	at org.apache.hadoop.net.NetUtils.connect(NetUtils.java:530)
	at org.apache.hadoop.net.NetUtils.connect(NetUtils.java:494)
	at org.apache.hadoop.ipc.Client$Connection.setupConnection(Client.java:607)
	at org.apache.hadoop.ipc.Client$Connection.setupIOstreams(Client.java:705)
	at org.apache.hadoop.ipc.Client$Connection.access$2800(Client.java:368)
	at org.apache.hadoop.ipc.Client.getConnection(Client.java:1521)
	at org.apache.hadoop.ipc.Client.call(Client.java:1438)
	at org.apache.hadoop.ipc.Client.call(Client.java:1399)
	at org.apache.hadoop.ipc.ProtobufRpcEngine$Invoker.invoke(ProtobufRpcEngine.java:230)
	at com.sun.proxy.$Proxy17.submitApplication(Unknown Source)
	at org.apache.hadoop.yarn.api.impl.pb.client.ApplicationClientProtocolPBClientImpl.submitApplication(ApplicationClientProtocolPBClientImpl.java:232)
	at sun.reflect.NativeMethodAccessorImpl.invoke0(Native Method)
	at sun.reflect.NativeMethodAccessorImpl.invoke(NativeMethodAccessorImpl.java:57)
	at sun.reflect.DelegatingMethodAccessorImpl.invoke(DelegatingMethodAccessorImpl.java:43)
	at java.lang.reflect.Method.invoke(Method.java:606)
	at org.apache.hadoop.io.retry.RetryInvocationHandler.invokeMethod(RetryInvocationHandler.java:186)
	at org.apache.hadoop.io.retry.RetryInvocationHandler.invoke(RetryInvocationHandler.java:101)
	at com.sun.proxy.$Proxy18.submitApplication(Unknown Source)
	at org.apache.hadoop.yarn.client.api.impl.YarnClientImpl.submitApplication(YarnClientImpl.java:240)
	at org.apache.hadoop.yarn.client.TestApplicationClientProtocolOnHA.testSubmitApplicationOnHA(TestApplicationClientProtocolOnHA.java:173)



Failed: YARN-2949 PreCommit Build #6113

Posted by Apache Jenkins Server <je...@builds.apache.org>.
Jira: https://issues.apache.org/jira/browse/YARN-2949
Build: https://builds.apache.org/job/PreCommit-YARN-Build/6113/

###################################################################################
########################## LAST 60 LINES OF THE CONSOLE ###########################
[...truncated 2994 lines...]



{color:red}-1 overall{color}.  Here are the results of testing the latest attachment 
  http://issues.apache.org/jira/secure/attachment/12687233/apache-yarn-2949.0.patch
  against trunk revision fae3e86.

    {color:green}+1 @author{color}.  The patch does not contain any @author tags.

    {color:green}+0 tests included{color}.  The patch appears to be a documentation patch that doesn't require tests.

    {color:green}+1 javac{color}.  The applied patch does not increase the total number of javac compiler warnings.

    {color:green}+1 javadoc{color}.  There were no new javadoc warning messages.

    {color:green}+1 eclipse:eclipse{color}.  The patch built with eclipse:eclipse.

    {color:green}+1 findbugs{color}.  The patch does not introduce any new Findbugs (version 2.0.3) warnings.

    {color:green}+1 release audit{color}.  The applied patch does not increase the total number of release audit warnings.

    {color:green}+1 core tests{color}.  The patch passed unit tests in .

Test results: https://builds.apache.org/job/PreCommit-YARN-Build/6113//testReport/
Console output: https://builds.apache.org/job/PreCommit-YARN-Build/6113//console

This message is automatically generated.


======================================================================
======================================================================
    Adding comment to Jira.
======================================================================
======================================================================


Comment added.
996b6458f607f3a7e499f93b47013fdeb185a379 logged out


======================================================================
======================================================================
    Finished build.
======================================================================
======================================================================


Build step 'Execute shell' marked build as failure
Archiving artifacts
Sending artifact delta relative to PreCommit-YARN-Build #6051
Archived 10 artifacts
Archive block size is 32768
Received 161 blocks and 3238455 bytes
Compression is 62.0%
Took 1.1 sec
[description-setter] Could not determine description.
Recording test results
Email was triggered for: Failure
Sending email for trigger: Failure



###################################################################################
############################## FAILED TESTS (if any) ##############################
No tests ran.

Failed: YARN-2356 PreCommit Build #6112

Posted by Apache Jenkins Server <je...@builds.apache.org>.
Jira: https://issues.apache.org/jira/browse/YARN-2356
Build: https://builds.apache.org/job/PreCommit-YARN-Build/6112/

###################################################################################
########################## LAST 60 LINES OF THE CONSOLE ###########################
[...truncated 3381 lines...]
  http://issues.apache.org/jira/secure/attachment/12686822/0004-YARN-2356.patch
  against trunk revision 25a0440.

    {color:green}+1 @author{color}.  The patch does not contain any @author tags.

    {color:green}+1 tests included{color}.  The patch appears to include 1 new or modified test files.

    {color:green}+1 javac{color}.  The applied patch does not increase the total number of javac compiler warnings.

    {color:green}+1 javadoc{color}.  There were no new javadoc warning messages.

    {color:green}+1 eclipse:eclipse{color}.  The patch built with eclipse:eclipse.

    {color:red}-1 findbugs{color}.  The patch appears to introduce 10 new Findbugs (version 2.0.3) warnings.

    {color:green}+1 release audit{color}.  The applied patch does not increase the total number of release audit warnings.

    {color:red}-1 core tests{color}.  The patch failed these unit tests in hadoop-yarn-project/hadoop-yarn/hadoop-yarn-client:

                  org.apache.hadoop.yarn.client.TestResourceTrackerOnHA
                  org.apache.hadoop.yarn.client.TestApplicationClientProtocolOnHA

Test results: https://builds.apache.org/job/PreCommit-YARN-Build/6112//testReport/
Findbugs warnings: https://builds.apache.org/job/PreCommit-YARN-Build/6112//artifact/patchprocess/newPatchFindbugsWarningshadoop-yarn-client.html
Console output: https://builds.apache.org/job/PreCommit-YARN-Build/6112//console

This message is automatically generated.


======================================================================
======================================================================
    Adding comment to Jira.
======================================================================
======================================================================


Comment added.
8f2943c765f649eb1d59770d0b6ad665ce2c005d logged out


======================================================================
======================================================================
    Finished build.
======================================================================
======================================================================


Build step 'Execute shell' marked build as failure
Archiving artifacts
Sending artifact delta relative to PreCommit-YARN-Build #6051
Archived 15 artifacts
Archive block size is 32768
Received 162 blocks and 3333182 bytes
Compression is 61.4%
Took 1 sec
Description set: MAPREDUCE-4879
Recording test results
Email was triggered for: Failure
Sending email for trigger: Failure



###################################################################################
############################## FAILED TESTS (if any) ##############################
10 tests failed.
FAILED:  org.apache.hadoop.yarn.client.TestApplicationClientProtocolOnHA.testGetContainersOnHA

Error Message:
Call From asf905.gq1.ygridcore.net/67.195.81.149 to asf905.gq1.ygridcore.net:28032 failed on connection exception: java.net.ConnectException: Connection refused; For more details see:  http://wiki.apache.org/hadoop/ConnectionRefused

Stack Trace:
java.net.ConnectException: Call From asf905.gq1.ygridcore.net/67.195.81.149 to asf905.gq1.ygridcore.net:28032 failed on connection exception: java.net.ConnectException: Connection refused; For more details see:  http://wiki.apache.org/hadoop/ConnectionRefused
	at sun.nio.ch.SocketChannelImpl.checkConnect(Native Method)
	at sun.nio.ch.SocketChannelImpl.finishConnect(SocketChannelImpl.java:739)
	at org.apache.hadoop.net.SocketIOWithTimeout.connect(SocketIOWithTimeout.java:206)
	at org.apache.hadoop.net.NetUtils.connect(NetUtils.java:530)
	at org.apache.hadoop.net.NetUtils.connect(NetUtils.java:494)
	at org.apache.hadoop.ipc.Client$Connection.setupConnection(Client.java:607)
	at org.apache.hadoop.ipc.Client$Connection.setupIOstreams(Client.java:705)
	at org.apache.hadoop.ipc.Client$Connection.access$2800(Client.java:368)
	at org.apache.hadoop.ipc.Client.getConnection(Client.java:1521)
	at org.apache.hadoop.ipc.Client.call(Client.java:1438)
	at org.apache.hadoop.ipc.Client.call(Client.java:1399)
	at org.apache.hadoop.ipc.ProtobufRpcEngine$Invoker.invoke(ProtobufRpcEngine.java:230)
	at com.sun.proxy.$Proxy17.getContainers(Unknown Source)
	at org.apache.hadoop.yarn.api.impl.pb.client.ApplicationClientProtocolPBClientImpl.getContainers(ApplicationClientProtocolPBClientImpl.java:410)
	at sun.reflect.NativeMethodAccessorImpl.invoke0(Native Method)
	at sun.reflect.NativeMethodAccessorImpl.invoke(NativeMethodAccessorImpl.java:57)
	at sun.reflect.DelegatingMethodAccessorImpl.invoke(DelegatingMethodAccessorImpl.java:43)
	at java.lang.reflect.Method.invoke(Method.java:606)
	at org.apache.hadoop.io.retry.RetryInvocationHandler.invokeMethod(RetryInvocationHandler.java:186)
	at org.apache.hadoop.io.retry.RetryInvocationHandler.invoke(RetryInvocationHandler.java:101)
	at com.sun.proxy.$Proxy18.getContainers(Unknown Source)
	at org.apache.hadoop.yarn.client.api.impl.YarnClientImpl.getContainers(YarnClientImpl.java:654)
	at org.apache.hadoop.yarn.client.TestApplicationClientProtocolOnHA.testGetContainersOnHA(TestApplicationClientProtocolOnHA.java:154)


FAILED:  org.apache.hadoop.yarn.client.TestApplicationClientProtocolOnHA.testGetNewApplicationOnHA

Error Message:
Call From asf905.gq1.ygridcore.net/67.195.81.149 to asf905.gq1.ygridcore.net:28032 failed on connection exception: java.net.ConnectException: Connection refused; For more details see:  http://wiki.apache.org/hadoop/ConnectionRefused

Stack Trace:
java.net.ConnectException: Call From asf905.gq1.ygridcore.net/67.195.81.149 to asf905.gq1.ygridcore.net:28032 failed on connection exception: java.net.ConnectException: Connection refused; For more details see:  http://wiki.apache.org/hadoop/ConnectionRefused
	at sun.nio.ch.SocketChannelImpl.checkConnect(Native Method)
	at sun.nio.ch.SocketChannelImpl.finishConnect(SocketChannelImpl.java:739)
	at org.apache.hadoop.net.SocketIOWithTimeout.connect(SocketIOWithTimeout.java:206)
	at org.apache.hadoop.net.NetUtils.connect(NetUtils.java:530)
	at org.apache.hadoop.net.NetUtils.connect(NetUtils.java:494)
	at org.apache.hadoop.ipc.Client$Connection.setupConnection(Client.java:607)
	at org.apache.hadoop.ipc.Client$Connection.setupIOstreams(Client.java:705)
	at org.apache.hadoop.ipc.Client$Connection.access$2800(Client.java:368)
	at org.apache.hadoop.ipc.Client.getConnection(Client.java:1521)
	at org.apache.hadoop.ipc.Client.call(Client.java:1438)
	at org.apache.hadoop.ipc.Client.call(Client.java:1399)
	at org.apache.hadoop.ipc.ProtobufRpcEngine$Invoker.invoke(ProtobufRpcEngine.java:230)
	at com.sun.proxy.$Proxy17.getNewApplication(Unknown Source)
	at org.apache.hadoop.yarn.api.impl.pb.client.ApplicationClientProtocolPBClientImpl.getNewApplication(ApplicationClientProtocolPBClientImpl.java:217)
	at sun.reflect.NativeMethodAccessorImpl.invoke0(Native Method)
	at sun.reflect.NativeMethodAccessorImpl.invoke(NativeMethodAccessorImpl.java:57)
	at sun.reflect.DelegatingMethodAccessorImpl.invoke(DelegatingMethodAccessorImpl.java:43)
	at java.lang.reflect.Method.invoke(Method.java:606)
	at org.apache.hadoop.io.retry.RetryInvocationHandler.invokeMethod(RetryInvocationHandler.java:186)
	at org.apache.hadoop.io.retry.RetryInvocationHandler.invoke(RetryInvocationHandler.java:101)
	at com.sun.proxy.$Proxy18.getNewApplication(Unknown Source)
	at org.apache.hadoop.yarn.client.api.impl.YarnClientImpl.getNewApplication(YarnClientImpl.java:206)
	at org.apache.hadoop.yarn.client.api.impl.YarnClientImpl.createApplication(YarnClientImpl.java:214)
	at org.apache.hadoop.yarn.client.TestApplicationClientProtocolOnHA.testGetNewApplicationOnHA(TestApplicationClientProtocolOnHA.java:76)


FAILED:  org.apache.hadoop.yarn.client.TestApplicationClientProtocolOnHA.testGetApplicationAttemptReportOnHA

Error Message:
Call From asf905.gq1.ygridcore.net/67.195.81.149 to asf905.gq1.ygridcore.net:28032 failed on connection exception: java.net.ConnectException: Connection refused; For more details see:  http://wiki.apache.org/hadoop/ConnectionRefused

Stack Trace:
java.net.ConnectException: Call From asf905.gq1.ygridcore.net/67.195.81.149 to asf905.gq1.ygridcore.net:28032 failed on connection exception: java.net.ConnectException: Connection refused; For more details see:  http://wiki.apache.org/hadoop/ConnectionRefused
	at sun.nio.ch.SocketChannelImpl.checkConnect(Native Method)
	at sun.nio.ch.SocketChannelImpl.finishConnect(SocketChannelImpl.java:739)
	at org.apache.hadoop.net.SocketIOWithTimeout.connect(SocketIOWithTimeout.java:206)
	at org.apache.hadoop.net.NetUtils.connect(NetUtils.java:530)
	at org.apache.hadoop.net.NetUtils.connect(NetUtils.java:494)
	at org.apache.hadoop.ipc.Client$Connection.setupConnection(Client.java:607)
	at org.apache.hadoop.ipc.Client$Connection.setupIOstreams(Client.java:705)
	at org.apache.hadoop.ipc.Client$Connection.access$2800(Client.java:368)
	at org.apache.hadoop.ipc.Client.getConnection(Client.java:1521)
	at org.apache.hadoop.ipc.Client.call(Client.java:1438)
	at org.apache.hadoop.ipc.Client.call(Client.java:1399)
	at org.apache.hadoop.ipc.ProtobufRpcEngine$Invoker.invoke(ProtobufRpcEngine.java:230)
	at com.sun.proxy.$Proxy17.getApplicationAttemptReport(Unknown Source)
	at org.apache.hadoop.yarn.api.impl.pb.client.ApplicationClientProtocolPBClientImpl.getApplicationAttemptReport(ApplicationClientProtocolPBClientImpl.java:368)
	at sun.reflect.NativeMethodAccessorImpl.invoke0(Native Method)
	at sun.reflect.NativeMethodAccessorImpl.invoke(NativeMethodAccessorImpl.java:57)
	at sun.reflect.DelegatingMethodAccessorImpl.invoke(DelegatingMethodAccessorImpl.java:43)
	at java.lang.reflect.Method.invoke(Method.java:606)
	at org.apache.hadoop.io.retry.RetryInvocationHandler.invokeMethod(RetryInvocationHandler.java:186)
	at org.apache.hadoop.io.retry.RetryInvocationHandler.invoke(RetryInvocationHandler.java:101)
	at com.sun.proxy.$Proxy18.getApplicationAttemptReport(Unknown Source)
	at org.apache.hadoop.yarn.client.api.impl.YarnClientImpl.getApplicationAttemptReport(YarnClientImpl.java:581)
	at org.apache.hadoop.yarn.client.TestApplicationClientProtocolOnHA.testGetApplicationAttemptReportOnHA(TestApplicationClientProtocolOnHA.java:128)


FAILED:  org.apache.hadoop.yarn.client.TestApplicationClientProtocolOnHA.testSubmitApplicationOnHA

Error Message:
Call From asf905.gq1.ygridcore.net/67.195.81.149 to asf905.gq1.ygridcore.net:28032 failed on connection exception: java.net.ConnectException: Connection refused; For more details see:  http://wiki.apache.org/hadoop/ConnectionRefused

Stack Trace:
java.net.ConnectException: Call From asf905.gq1.ygridcore.net/67.195.81.149 to asf905.gq1.ygridcore.net:28032 failed on connection exception: java.net.ConnectException: Connection refused; For more details see:  http://wiki.apache.org/hadoop/ConnectionRefused
	at sun.nio.ch.SocketChannelImpl.checkConnect(Native Method)
	at sun.nio.ch.SocketChannelImpl.finishConnect(SocketChannelImpl.java:739)
	at org.apache.hadoop.net.SocketIOWithTimeout.connect(SocketIOWithTimeout.java:206)
	at org.apache.hadoop.net.NetUtils.connect(NetUtils.java:530)
	at org.apache.hadoop.net.NetUtils.connect(NetUtils.java:494)
	at org.apache.hadoop.ipc.Client$Connection.setupConnection(Client.java:607)
	at org.apache.hadoop.ipc.Client$Connection.setupIOstreams(Client.java:705)
	at org.apache.hadoop.ipc.Client$Connection.access$2800(Client.java:368)
	at org.apache.hadoop.ipc.Client.getConnection(Client.java:1521)
	at org.apache.hadoop.ipc.Client.call(Client.java:1438)
	at org.apache.hadoop.ipc.Client.call(Client.java:1399)
	at org.apache.hadoop.ipc.ProtobufRpcEngine$Invoker.invoke(ProtobufRpcEngine.java:230)
	at com.sun.proxy.$Proxy17.submitApplication(Unknown Source)
	at org.apache.hadoop.yarn.api.impl.pb.client.ApplicationClientProtocolPBClientImpl.submitApplication(ApplicationClientProtocolPBClientImpl.java:232)
	at sun.reflect.NativeMethodAccessorImpl.invoke0(Native Method)
	at sun.reflect.NativeMethodAccessorImpl.invoke(NativeMethodAccessorImpl.java:57)
	at sun.reflect.DelegatingMethodAccessorImpl.invoke(DelegatingMethodAccessorImpl.java:43)
	at java.lang.reflect.Method.invoke(Method.java:606)
	at org.apache.hadoop.io.retry.RetryInvocationHandler.invokeMethod(RetryInvocationHandler.java:186)
	at org.apache.hadoop.io.retry.RetryInvocationHandler.invoke(RetryInvocationHandler.java:101)
	at com.sun.proxy.$Proxy18.submitApplication(Unknown Source)
	at org.apache.hadoop.yarn.client.api.impl.YarnClientImpl.submitApplication(YarnClientImpl.java:240)
	at org.apache.hadoop.yarn.client.TestApplicationClientProtocolOnHA.testSubmitApplicationOnHA(TestApplicationClientProtocolOnHA.java:173)


FAILED:  org.apache.hadoop.yarn.client.TestApplicationClientProtocolOnHA.testGetApplicationReportOnHA

Error Message:
Call From asf905.gq1.ygridcore.net/67.195.81.149 to asf905.gq1.ygridcore.net:28032 failed on connection exception: java.net.ConnectException: Connection refused; For more details see:  http://wiki.apache.org/hadoop/ConnectionRefused

Stack Trace:
java.net.ConnectException: Call From asf905.gq1.ygridcore.net/67.195.81.149 to asf905.gq1.ygridcore.net:28032 failed on connection exception: java.net.ConnectException: Connection refused; For more details see:  http://wiki.apache.org/hadoop/ConnectionRefused
	at sun.nio.ch.SocketChannelImpl.checkConnect(Native Method)
	at sun.nio.ch.SocketChannelImpl.finishConnect(SocketChannelImpl.java:739)
	at org.apache.hadoop.net.SocketIOWithTimeout.connect(SocketIOWithTimeout.java:206)
	at org.apache.hadoop.net.NetUtils.connect(NetUtils.java:530)
	at org.apache.hadoop.net.NetUtils.connect(NetUtils.java:494)
	at org.apache.hadoop.ipc.Client$Connection.setupConnection(Client.java:607)
	at org.apache.hadoop.ipc.Client$Connection.setupIOstreams(Client.java:705)
	at org.apache.hadoop.ipc.Client$Connection.access$2800(Client.java:368)
	at org.apache.hadoop.ipc.Client.getConnection(Client.java:1521)
	at org.apache.hadoop.ipc.Client.call(Client.java:1438)
	at org.apache.hadoop.ipc.Client.call(Client.java:1399)
	at org.apache.hadoop.ipc.ProtobufRpcEngine$Invoker.invoke(ProtobufRpcEngine.java:230)
	at com.sun.proxy.$Proxy17.getApplicationReport(Unknown Source)
	at org.apache.hadoop.yarn.api.impl.pb.client.ApplicationClientProtocolPBClientImpl.getApplicationReport(ApplicationClientProtocolPBClientImpl.java:187)
	at sun.reflect.NativeMethodAccessorImpl.invoke0(Native Method)
	at sun.reflect.NativeMethodAccessorImpl.invoke(NativeMethodAccessorImpl.java:57)
	at sun.reflect.DelegatingMethodAccessorImpl.invoke(DelegatingMethodAccessorImpl.java:43)
	at java.lang.reflect.Method.invoke(Method.java:606)
	at org.apache.hadoop.io.retry.RetryInvocationHandler.invokeMethod(RetryInvocationHandler.java:186)
	at org.apache.hadoop.io.retry.RetryInvocationHandler.invoke(RetryInvocationHandler.java:101)
	at com.sun.proxy.$Proxy18.getApplicationReport(Unknown Source)
	at org.apache.hadoop.yarn.client.api.impl.YarnClientImpl.getApplicationReport(YarnClientImpl.java:399)
	at org.apache.hadoop.yarn.client.TestApplicationClientProtocolOnHA.testGetApplicationReportOnHA(TestApplicationClientProtocolOnHA.java:68)


FAILED:  org.apache.hadoop.yarn.client.TestApplicationClientProtocolOnHA.testGetQueueUserAclsOnHA

Error Message:
Call From asf905.gq1.ygridcore.net/67.195.81.149 to asf905.gq1.ygridcore.net:28032 failed on connection exception: java.net.ConnectException: Connection refused; For more details see:  http://wiki.apache.org/hadoop/ConnectionRefused

Stack Trace:
java.net.ConnectException: Call From asf905.gq1.ygridcore.net/67.195.81.149 to asf905.gq1.ygridcore.net:28032 failed on connection exception: java.net.ConnectException: Connection refused; For more details see:  http://wiki.apache.org/hadoop/ConnectionRefused
	at sun.nio.ch.SocketChannelImpl.checkConnect(Native Method)
	at sun.nio.ch.SocketChannelImpl.finishConnect(SocketChannelImpl.java:739)
	at org.apache.hadoop.net.SocketIOWithTimeout.connect(SocketIOWithTimeout.java:206)
	at org.apache.hadoop.net.NetUtils.connect(NetUtils.java:530)
	at org.apache.hadoop.net.NetUtils.connect(NetUtils.java:494)
	at org.apache.hadoop.ipc.Client$Connection.setupConnection(Client.java:607)
	at org.apache.hadoop.ipc.Client$Connection.setupIOstreams(Client.java:705)
	at org.apache.hadoop.ipc.Client$Connection.access$2800(Client.java:368)
	at org.apache.hadoop.ipc.Client.getConnection(Client.java:1521)
	at org.apache.hadoop.ipc.Client.call(Client.java:1438)
	at org.apache.hadoop.ipc.Client.call(Client.java:1399)
	at org.apache.hadoop.ipc.ProtobufRpcEngine$Invoker.invoke(ProtobufRpcEngine.java:230)
	at com.sun.proxy.$Proxy17.getQueueUserAcls(Unknown Source)
	at org.apache.hadoop.yarn.api.impl.pb.client.ApplicationClientProtocolPBClientImpl.getQueueUserAcls(ApplicationClientProtocolPBClientImpl.java:291)
	at sun.reflect.NativeMethodAccessorImpl.invoke0(Native Method)
	at sun.reflect.NativeMethodAccessorImpl.invoke(NativeMethodAccessorImpl.java:57)
	at sun.reflect.DelegatingMethodAccessorImpl.invoke(DelegatingMethodAccessorImpl.java:43)
	at java.lang.reflect.Method.invoke(Method.java:606)
	at org.apache.hadoop.io.retry.RetryInvocationHandler.invokeMethod(RetryInvocationHandler.java:186)
	at org.apache.hadoop.io.retry.RetryInvocationHandler.invoke(RetryInvocationHandler.java:101)
	at com.sun.proxy.$Proxy18.getQueueUserAcls(Unknown Source)
	at org.apache.hadoop.yarn.client.api.impl.YarnClientImpl.getQueueAclsInfo(YarnClientImpl.java:517)
	at org.apache.hadoop.yarn.client.TestApplicationClientProtocolOnHA.testGetQueueUserAclsOnHA(TestApplicationClientProtocolOnHA.java:119)


FAILED:  org.apache.hadoop.yarn.client.TestApplicationClientProtocolOnHA.testGetQueueInfoOnHA

Error Message:
Call From asf905.gq1.ygridcore.net/67.195.81.149 to asf905.gq1.ygridcore.net:28032 failed on connection exception: java.net.ConnectException: Connection refused; For more details see:  http://wiki.apache.org/hadoop/ConnectionRefused

Stack Trace:
java.net.ConnectException: Call From asf905.gq1.ygridcore.net/67.195.81.149 to asf905.gq1.ygridcore.net:28032 failed on connection exception: java.net.ConnectException: Connection refused; For more details see:  http://wiki.apache.org/hadoop/ConnectionRefused
	at sun.nio.ch.SocketChannelImpl.checkConnect(Native Method)
	at sun.nio.ch.SocketChannelImpl.finishConnect(SocketChannelImpl.java:739)
	at org.apache.hadoop.net.SocketIOWithTimeout.connect(SocketIOWithTimeout.java:206)
	at org.apache.hadoop.net.NetUtils.connect(NetUtils.java:530)
	at org.apache.hadoop.net.NetUtils.connect(NetUtils.java:494)
	at org.apache.hadoop.ipc.Client$Connection.setupConnection(Client.java:607)
	at org.apache.hadoop.ipc.Client$Connection.setupIOstreams(Client.java:705)
	at org.apache.hadoop.ipc.Client$Connection.access$2800(Client.java:368)
	at org.apache.hadoop.ipc.Client.getConnection(Client.java:1521)
	at org.apache.hadoop.ipc.Client.call(Client.java:1438)
	at org.apache.hadoop.ipc.Client.call(Client.java:1399)
	at org.apache.hadoop.ipc.ProtobufRpcEngine$Invoker.invoke(ProtobufRpcEngine.java:230)
	at com.sun.proxy.$Proxy17.getQueueInfo(Unknown Source)
	at org.apache.hadoop.yarn.api.impl.pb.client.ApplicationClientProtocolPBClientImpl.getQueueInfo(ApplicationClientProtocolPBClientImpl.java:276)
	at sun.reflect.NativeMethodAccessorImpl.invoke0(Native Method)
	at sun.reflect.NativeMethodAccessorImpl.invoke(NativeMethodAccessorImpl.java:57)
	at sun.reflect.DelegatingMethodAccessorImpl.invoke(DelegatingMethodAccessorImpl.java:43)
	at java.lang.reflect.Method.invoke(Method.java:606)
	at org.apache.hadoop.io.retry.RetryInvocationHandler.invokeMethod(RetryInvocationHandler.java:186)
	at org.apache.hadoop.io.retry.RetryInvocationHandler.invoke(RetryInvocationHandler.java:101)
	at com.sun.proxy.$Proxy18.getQueueInfo(Unknown Source)
	at org.apache.hadoop.yarn.client.api.impl.YarnClientImpl.getQueueInfo(YarnClientImpl.java:509)
	at org.apache.hadoop.yarn.client.TestApplicationClientProtocolOnHA.testGetQueueInfoOnHA(TestApplicationClientProtocolOnHA.java:111)


FAILED:  org.apache.hadoop.yarn.client.TestApplicationClientProtocolOnHA.testGetClusterNodesOnHA

Error Message:
Call From asf905.gq1.ygridcore.net/67.195.81.149 to asf905.gq1.ygridcore.net:28032 failed on connection exception: java.net.ConnectException: Connection refused; For more details see:  http://wiki.apache.org/hadoop/ConnectionRefused

Stack Trace:
java.net.ConnectException: Call From asf905.gq1.ygridcore.net/67.195.81.149 to asf905.gq1.ygridcore.net:28032 failed on connection exception: java.net.ConnectException: Connection refused; For more details see:  http://wiki.apache.org/hadoop/ConnectionRefused
	at sun.nio.ch.SocketChannelImpl.checkConnect(Native Method)
	at sun.nio.ch.SocketChannelImpl.finishConnect(SocketChannelImpl.java:739)
	at org.apache.hadoop.net.SocketIOWithTimeout.connect(SocketIOWithTimeout.java:206)
	at org.apache.hadoop.net.NetUtils.connect(NetUtils.java:530)
	at org.apache.hadoop.net.NetUtils.connect(NetUtils.java:494)
	at org.apache.hadoop.ipc.Client$Connection.setupConnection(Client.java:607)
	at org.apache.hadoop.ipc.Client$Connection.setupIOstreams(Client.java:705)
	at org.apache.hadoop.ipc.Client$Connection.access$2800(Client.java:368)
	at org.apache.hadoop.ipc.Client.getConnection(Client.java:1521)
	at org.apache.hadoop.ipc.Client.call(Client.java:1438)
	at org.apache.hadoop.ipc.Client.call(Client.java:1399)
	at org.apache.hadoop.ipc.ProtobufRpcEngine$Invoker.invoke(ProtobufRpcEngine.java:230)
	at com.sun.proxy.$Proxy17.getClusterNodes(Unknown Source)
	at org.apache.hadoop.yarn.api.impl.pb.client.ApplicationClientProtocolPBClientImpl.getClusterNodes(ApplicationClientProtocolPBClientImpl.java:262)
	at sun.reflect.NativeMethodAccessorImpl.invoke0(Native Method)
	at sun.reflect.NativeMethodAccessorImpl.invoke(NativeMethodAccessorImpl.java:57)
	at sun.reflect.DelegatingMethodAccessorImpl.invoke(DelegatingMethodAccessorImpl.java:43)
	at java.lang.reflect.Method.invoke(Method.java:606)
	at org.apache.hadoop.io.retry.RetryInvocationHandler.invokeMethod(RetryInvocationHandler.java:186)
	at org.apache.hadoop.io.retry.RetryInvocationHandler.invoke(RetryInvocationHandler.java:101)
	at com.sun.proxy.$Proxy18.getClusterNodes(Unknown Source)
	at org.apache.hadoop.yarn.client.api.impl.YarnClientImpl.getNodeReports(YarnClientImpl.java:475)
	at org.apache.hadoop.yarn.client.TestApplicationClientProtocolOnHA.testGetClusterNodesOnHA(TestApplicationClientProtocolOnHA.java:103)


FAILED:  org.apache.hadoop.yarn.client.TestApplicationClientProtocolOnHA.testGetClusterMetricsOnHA

Error Message:
Call From asf905.gq1.ygridcore.net/67.195.81.149 to asf905.gq1.ygridcore.net:28032 failed on connection exception: java.net.ConnectException: Connection refused; For more details see:  http://wiki.apache.org/hadoop/ConnectionRefused

Stack Trace:
java.net.ConnectException: Call From asf905.gq1.ygridcore.net/67.195.81.149 to asf905.gq1.ygridcore.net:28032 failed on connection exception: java.net.ConnectException: Connection refused; For more details see:  http://wiki.apache.org/hadoop/ConnectionRefused
	at sun.nio.ch.SocketChannelImpl.checkConnect(Native Method)
	at sun.nio.ch.SocketChannelImpl.finishConnect(SocketChannelImpl.java:739)
	at org.apache.hadoop.net.SocketIOWithTimeout.connect(SocketIOWithTimeout.java:206)
	at org.apache.hadoop.net.NetUtils.connect(NetUtils.java:530)
	at org.apache.hadoop.net.NetUtils.connect(NetUtils.java:494)
	at org.apache.hadoop.ipc.Client$Connection.setupConnection(Client.java:607)
	at org.apache.hadoop.ipc.Client$Connection.setupIOstreams(Client.java:705)
	at org.apache.hadoop.ipc.Client$Connection.access$2800(Client.java:368)
	at org.apache.hadoop.ipc.Client.getConnection(Client.java:1521)
	at org.apache.hadoop.ipc.Client.call(Client.java:1438)
	at org.apache.hadoop.ipc.Client.call(Client.java:1399)
	at org.apache.hadoop.ipc.ProtobufRpcEngine$Invoker.invoke(ProtobufRpcEngine.java:230)
	at com.sun.proxy.$Proxy17.getClusterMetrics(Unknown Source)
	at org.apache.hadoop.yarn.api.impl.pb.client.ApplicationClientProtocolPBClientImpl.getClusterMetrics(ApplicationClientProtocolPBClientImpl.java:202)
	at sun.reflect.NativeMethodAccessorImpl.invoke0(Native Method)
	at sun.reflect.NativeMethodAccessorImpl.invoke(NativeMethodAccessorImpl.java:57)
	at sun.reflect.DelegatingMethodAccessorImpl.invoke(DelegatingMethodAccessorImpl.java:43)
	at java.lang.reflect.Method.invoke(Method.java:606)
	at org.apache.hadoop.io.retry.RetryInvocationHandler.invokeMethod(RetryInvocationHandler.java:186)
	at org.apache.hadoop.io.retry.RetryInvocationHandler.invoke(RetryInvocationHandler.java:101)
	at com.sun.proxy.$Proxy18.getClusterMetrics(Unknown Source)
	at org.apache.hadoop.yarn.client.api.impl.YarnClientImpl.getYarnClusterMetrics(YarnClientImpl.java:461)
	at org.apache.hadoop.yarn.client.TestApplicationClientProtocolOnHA.testGetClusterMetricsOnHA(TestApplicationClientProtocolOnHA.java:85)


FAILED:  org.apache.hadoop.yarn.client.TestResourceTrackerOnHA.testResourceTrackerOnHA

Error Message:
Call From asf905.gq1.ygridcore.net/67.195.81.149 to asf905.gq1.ygridcore.net:28031 failed on connection exception: java.net.ConnectException: Connection refused; For more details see:  http://wiki.apache.org/hadoop/ConnectionRefused

Stack Trace:
java.net.ConnectException: Call From asf905.gq1.ygridcore.net/67.195.81.149 to asf905.gq1.ygridcore.net:28031 failed on connection exception: java.net.ConnectException: Connection refused; For more details see:  http://wiki.apache.org/hadoop/ConnectionRefused
	at sun.nio.ch.SocketChannelImpl.checkConnect(Native Method)
	at sun.nio.ch.SocketChannelImpl.finishConnect(SocketChannelImpl.java:739)
	at org.apache.hadoop.net.SocketIOWithTimeout.connect(SocketIOWithTimeout.java:206)
	at org.apache.hadoop.net.NetUtils.connect(NetUtils.java:530)
	at org.apache.hadoop.net.NetUtils.connect(NetUtils.java:494)
	at org.apache.hadoop.ipc.Client$Connection.setupConnection(Client.java:607)
	at org.apache.hadoop.ipc.Client$Connection.setupIOstreams(Client.java:705)
	at org.apache.hadoop.ipc.Client$Connection.access$2800(Client.java:368)
	at org.apache.hadoop.ipc.Client.getConnection(Client.java:1521)
	at org.apache.hadoop.ipc.Client.call(Client.java:1438)
	at org.apache.hadoop.ipc.Client.call(Client.java:1399)
	at org.apache.hadoop.ipc.ProtobufRpcEngine$Invoker.invoke(ProtobufRpcEngine.java:230)
	at com.sun.proxy.$Proxy87.registerNodeManager(Unknown Source)
	at org.apache.hadoop.yarn.server.api.impl.pb.client.ResourceTrackerPBClientImpl.registerNodeManager(ResourceTrackerPBClientImpl.java:68)
	at sun.reflect.NativeMethodAccessorImpl.invoke0(Native Method)
	at sun.reflect.NativeMethodAccessorImpl.invoke(NativeMethodAccessorImpl.java:57)
	at sun.reflect.DelegatingMethodAccessorImpl.invoke(DelegatingMethodAccessorImpl.java:43)
	at java.lang.reflect.Method.invoke(Method.java:606)
	at org.apache.hadoop.io.retry.RetryInvocationHandler.invokeMethod(RetryInvocationHandler.java:186)
	at org.apache.hadoop.io.retry.RetryInvocationHandler.invoke(RetryInvocationHandler.java:101)
	at com.sun.proxy.$Proxy88.registerNodeManager(Unknown Source)
	at org.apache.hadoop.yarn.client.TestResourceTrackerOnHA.testResourceTrackerOnHA(TestResourceTrackerOnHA.java:64)



Failed: YARN-2937 PreCommit Build #6111

Posted by Apache Jenkins Server <je...@builds.apache.org>.
Jira: https://issues.apache.org/jira/browse/YARN-2937
Build: https://builds.apache.org/job/PreCommit-YARN-Build/6111/

###################################################################################
########################## LAST 60 LINES OF THE CONSOLE ###########################
[...truncated 3320 lines...]

{color:red}-1 overall{color}.  Here are the results of testing the latest attachment 
  http://issues.apache.org/jira/secure/attachment/12687134/YARN-2937.004.patch
  against trunk revision 25a0440.

    {color:green}+1 @author{color}.  The patch does not contain any @author tags.

    {color:red}-1 tests included{color}.  The patch doesn't appear to include any new or modified tests.
                        Please justify why no new tests are needed for this patch.
                        Also please list what manual steps were performed to verify this patch.

    {color:green}+1 javac{color}.  The applied patch does not increase the total number of javac compiler warnings.

    {color:green}+1 javadoc{color}.  There were no new javadoc warning messages.

    {color:green}+1 eclipse:eclipse{color}.  The patch built with eclipse:eclipse.

    {color:green}+1 findbugs{color}.  The patch does not introduce any new Findbugs (version 2.0.3) warnings.

    {color:green}+1 release audit{color}.  The applied patch does not increase the total number of release audit warnings.

    {color:green}+1 core tests{color}.  The patch passed unit tests in hadoop-yarn-project/hadoop-yarn/hadoop-yarn-server/hadoop-yarn-server-nodemanager.

Test results: https://builds.apache.org/job/PreCommit-YARN-Build/6111//testReport/
Console output: https://builds.apache.org/job/PreCommit-YARN-Build/6111//console

This message is automatically generated.


======================================================================
======================================================================
    Adding comment to Jira.
======================================================================
======================================================================


Comment added.
3a5884c4ddb8908bd182f435fdf619024ad6b4c8 logged out


======================================================================
======================================================================
    Finished build.
======================================================================
======================================================================


Build step 'Execute shell' marked build as failure
Archiving artifacts
Sending artifact delta relative to PreCommit-YARN-Build #6051
Archived 15 artifacts
Archive block size is 32768
Received 162 blocks and 3427788 bytes
Compression is 60.8%
Took 1.3 sec
Description set: MAPREDUCE-4879
Recording test results
Email was triggered for: Failure
Sending email for trigger: Failure



###################################################################################
############################## FAILED TESTS (if any) ##############################
All tests passed

Failed: YARN-2952 PreCommit Build #6110

Posted by Apache Jenkins Server <je...@builds.apache.org>.
Jira: https://issues.apache.org/jira/browse/YARN-2952
Build: https://builds.apache.org/job/PreCommit-YARN-Build/6110/

###################################################################################
########################## LAST 60 LINES OF THE CONSOLE ###########################
[...truncated 3828 lines...]
  against trunk revision cbfb996.

    {color:green}+1 @author{color}.  The patch does not contain any @author tags.

    {color:green}+1 tests included{color}.  The patch appears to include 2 new or modified test files.

    {color:green}+1 javac{color}.  The applied patch does not increase the total number of javac compiler warnings.

    {color:green}+1 javadoc{color}.  There were no new javadoc warning messages.

    {color:green}+1 eclipse:eclipse{color}.  The patch built with eclipse:eclipse.

    {color:red}-1 findbugs{color}.  The patch appears to introduce 45 new Findbugs (version 2.0.3) warnings.

    {color:green}+1 release audit{color}.  The applied patch does not increase the total number of release audit warnings.

    {color:red}-1 core tests{color}.  The patch failed these unit tests in hadoop-mapreduce-project/hadoop-mapreduce-client/hadoop-mapreduce-client-shuffle hadoop-yarn-project/hadoop-yarn/hadoop-yarn-server/hadoop-yarn-server-applicationhistoryservice hadoop-yarn-project/hadoop-yarn/hadoop-yarn-server/hadoop-yarn-server-nodemanager hadoop-yarn-project/hadoop-yarn/hadoop-yarn-server/hadoop-yarn-server-resourcemanager:

                  org.apache.hadoop.yarn.server.nodemanager.containermanager.localizer.TestResourceLocalizationService

Test results: https://builds.apache.org/job/PreCommit-YARN-Build/6110//testReport/
Findbugs warnings: https://builds.apache.org/job/PreCommit-YARN-Build/6110//artifact/patchprocess/newPatchFindbugsWarningshadoop-yarn-server-applicationhistoryservice.html
Findbugs warnings: https://builds.apache.org/job/PreCommit-YARN-Build/6110//artifact/patchprocess/newPatchFindbugsWarningshadoop-yarn-server-nodemanager.html
Findbugs warnings: https://builds.apache.org/job/PreCommit-YARN-Build/6110//artifact/patchprocess/newPatchFindbugsWarningshadoop-yarn-server-resourcemanager.html
Console output: https://builds.apache.org/job/PreCommit-YARN-Build/6110//console

This message is automatically generated.


======================================================================
======================================================================
    Adding comment to Jira.
======================================================================
======================================================================


Comment added.
7655f70a5acaa4188c9076110cbc1512fdcf637f logged out


======================================================================
======================================================================
    Finished build.
======================================================================
======================================================================


Build step 'Execute shell' marked build as failure
Archiving artifacts
Sending artifact delta relative to PreCommit-YARN-Build #6051
Archived 30 artifacts
Archive block size is 32768
Received 161 blocks and 4109728 bytes
Compression is 56.2%
Took 1.6 sec
[description-setter] Could not determine description.
Recording test results
Email was triggered for: Failure
Sending email for trigger: Failure



###################################################################################
############################## FAILED TESTS (if any) ##############################
1 tests failed.
FAILED:  org.apache.hadoop.yarn.server.nodemanager.containermanager.localizer.TestResourceLocalizationService.testPublicResourceInitializesLocalDir

Error Message:
Unable to delete directory target/org.apache.hadoop.yarn.server.nodemanager.containermanager.localizer.TestResourceLocalizationService.

Stack Trace:
java.io.IOException: Unable to delete directory target/org.apache.hadoop.yarn.server.nodemanager.containermanager.localizer.TestResourceLocalizationService.
	at org.apache.commons.io.FileUtils.deleteDirectory(FileUtils.java:1541)
	at org.apache.hadoop.yarn.server.nodemanager.containermanager.localizer.TestResourceLocalizationService.cleanup(TestResourceLocalizationService.java:184)



Failed: YARN-2356 PreCommit Build #6109

Posted by Apache Jenkins Server <je...@builds.apache.org>.
Jira: https://issues.apache.org/jira/browse/YARN-2356
Build: https://builds.apache.org/job/PreCommit-YARN-Build/6109/

###################################################################################
########################## LAST 60 LINES OF THE CONSOLE ###########################
[...truncated 3153 lines...]
{color:red}-1 overall{color}.  Here are the results of testing the latest attachment 
  http://issues.apache.org/jira/secure/attachment/12686822/0004-YARN-2356.patch
  against trunk revision c78e3a7.

    {color:green}+1 @author{color}.  The patch does not contain any @author tags.

    {color:green}+1 tests included{color}.  The patch appears to include 1 new or modified test files.

    {color:green}+1 javac{color}.  The applied patch does not increase the total number of javac compiler warnings.

    {color:green}+1 javadoc{color}.  There were no new javadoc warning messages.

    {color:green}+1 eclipse:eclipse{color}.  The patch built with eclipse:eclipse.

    {color:red}-1 findbugs{color}.  The patch appears to introduce 10 new Findbugs (version 2.0.3) warnings.

    {color:green}+1 release audit{color}.  The applied patch does not increase the total number of release audit warnings.

    {color:red}-1 core tests{color}.  The patch failed these unit tests in hadoop-yarn-project/hadoop-yarn/hadoop-yarn-client:

                  org.apache.hadoop.yarn.client.TestApplicationClientProtocolOnHA

Test results: https://builds.apache.org/job/PreCommit-YARN-Build/6109//testReport/
Findbugs warnings: https://builds.apache.org/job/PreCommit-YARN-Build/6109//artifact/patchprocess/newPatchFindbugsWarningshadoop-yarn-client.html
Console output: https://builds.apache.org/job/PreCommit-YARN-Build/6109//console

This message is automatically generated.


======================================================================
======================================================================
    Adding comment to Jira.
======================================================================
======================================================================


Comment added.
2a4aa3987ff0e74df6a24f92ad08340c025d7a60 logged out


======================================================================
======================================================================
    Finished build.
======================================================================
======================================================================


Build step 'Execute shell' marked build as failure
Archiving artifacts
Sending artifact delta relative to PreCommit-YARN-Build #6051
Archived 15 artifacts
Archive block size is 32768
Received 42 blocks and 7245389 bytes
Compression is 16.0%
Took 2.1 sec
[description-setter] Could not determine description.
Recording test results
Email was triggered for: Failure
Sending email for trigger: Failure



###################################################################################
############################## FAILED TESTS (if any) ##############################
1 tests failed.
FAILED:  org.apache.hadoop.yarn.client.TestApplicationClientProtocolOnHA.testMoveApplicationAcrossQueuesOnHA

Error Message:
Call From asf908.gq1.ygridcore.net/67.195.81.152 to asf908.gq1.ygridcore.net:28032 failed on connection exception: java.net.ConnectException: Connection refused; For more details see:  http://wiki.apache.org/hadoop/ConnectionRefused

Stack Trace:
java.net.ConnectException: Call From asf908.gq1.ygridcore.net/67.195.81.152 to asf908.gq1.ygridcore.net:28032 failed on connection exception: java.net.ConnectException: Connection refused; For more details see:  http://wiki.apache.org/hadoop/ConnectionRefused
	at sun.nio.ch.SocketChannelImpl.checkConnect(Native Method)
	at sun.nio.ch.SocketChannelImpl.finishConnect(SocketChannelImpl.java:739)
	at org.apache.hadoop.net.SocketIOWithTimeout.connect(SocketIOWithTimeout.java:206)
	at org.apache.hadoop.net.NetUtils.connect(NetUtils.java:530)
	at org.apache.hadoop.net.NetUtils.connect(NetUtils.java:494)
	at org.apache.hadoop.ipc.Client$Connection.setupConnection(Client.java:607)
	at org.apache.hadoop.ipc.Client$Connection.setupIOstreams(Client.java:705)
	at org.apache.hadoop.ipc.Client$Connection.access$2800(Client.java:368)
	at org.apache.hadoop.ipc.Client.getConnection(Client.java:1521)
	at org.apache.hadoop.ipc.Client.call(Client.java:1438)
	at org.apache.hadoop.ipc.Client.call(Client.java:1399)
	at org.apache.hadoop.ipc.ProtobufRpcEngine$Invoker.invoke(ProtobufRpcEngine.java:230)
	at com.sun.proxy.$Proxy17.moveApplicationAcrossQueues(Unknown Source)
	at org.apache.hadoop.yarn.api.impl.pb.client.ApplicationClientProtocolPBClientImpl.moveApplicationAcrossQueues(ApplicationClientProtocolPBClientImpl.java:352)
	at sun.reflect.NativeMethodAccessorImpl.invoke0(Native Method)
	at sun.reflect.NativeMethodAccessorImpl.invoke(NativeMethodAccessorImpl.java:57)
	at sun.reflect.DelegatingMethodAccessorImpl.invoke(DelegatingMethodAccessorImpl.java:43)
	at java.lang.reflect.Method.invoke(Method.java:606)
	at org.apache.hadoop.io.retry.RetryInvocationHandler.invokeMethod(RetryInvocationHandler.java:186)
	at org.apache.hadoop.io.retry.RetryInvocationHandler.invoke(RetryInvocationHandler.java:101)
	at com.sun.proxy.$Proxy18.moveApplicationAcrossQueues(Unknown Source)
	at org.apache.hadoop.yarn.client.api.impl.YarnClientImpl.moveApplicationAcrossQueues(YarnClientImpl.java:675)
	at org.apache.hadoop.yarn.client.TestApplicationClientProtocolOnHA.testMoveApplicationAcrossQueuesOnHA(TestApplicationClientProtocolOnHA.java:180)



Failed: YARN-2203 PreCommit Build #6108

Posted by Apache Jenkins Server <je...@builds.apache.org>.
Jira: https://issues.apache.org/jira/browse/YARN-2203
Build: https://builds.apache.org/job/PreCommit-YARN-Build/6108/

###################################################################################
########################## LAST 60 LINES OF THE CONSOLE ###########################
[...truncated 3005 lines...]
/bin/grep: /home/jenkins/jenkins-slave/workspace/PreCommit-YARN-Build@2/../patchprocess/patch: No such file or directory
cat: /tmp/tmp.modules.2023: No such file or directory
rm: cannot remove '/tmp/tmp.modules.2023': No such file or directory




{color:red}-1 overall{color}.  Here are the results of testing the latest attachment 
  http://issues.apache.org/jira/secure/attachment/12686964/YARN-2203-trunk-v4.patch
  against trunk revision 7784b10.

    {color:green}+1 @author{color}.  The patch does not contain any @author tags.

    {color:red}-1 tests included{color}.  The patch doesn't appear to include any new or modified tests.
                        Please justify why no new tests are needed for this patch.
                        Also please list what manual steps were performed to verify this patch.

    {color:green}+1 javac{color}.  The applied patch does not increase the total number of javac compiler warnings.

    {color:green}+1 javadoc{color}.  There were no new javadoc warning messages.

    {color:red}-1 eclipse:eclipse{color}.  The patch failed to build with eclipse:eclipse.

    {color:green}+1 findbugs{color}.  The patch does not introduce any new Findbugs (version 2.0.3) warnings.

    {color:green}+1 release audit{color}.  The applied patch does not increase the total number of release audit warnings.

    {color:green}+1 core tests{color}.  The patch passed unit tests in .

Test results: https://builds.apache.org/job/PreCommit-YARN-Build/6108//testReport/
Console output: https://builds.apache.org/job/PreCommit-YARN-Build/6108//console

This message is automatically generated.


======================================================================
======================================================================
    Adding comment to Jira.
======================================================================
======================================================================


Comment added.
331a9b3346eb1e7502f96e7bc7e7fee5e0f88b26 logged out


======================================================================
======================================================================
    Finished build.
======================================================================
======================================================================


Build step 'Execute shell' marked build as failure
Archiving artifacts
[description-setter] Could not determine description.
Recording test results
Email was triggered for: Failure
Sending email for trigger: Failure



###################################################################################
############################## FAILED TESTS (if any) ##############################
No tests ran.

Failed: YARN-2944 PreCommit Build #6107

Posted by Apache Jenkins Server <je...@builds.apache.org>.
Jira: https://issues.apache.org/jira/browse/YARN-2944
Build: https://builds.apache.org/job/PreCommit-YARN-Build/6107/

###################################################################################
########################## LAST 60 LINES OF THE CONSOLE ###########################
[...truncated 3350 lines...]
{color:red}-1 overall{color}.  Here are the results of testing the latest attachment 
  http://issues.apache.org/jira/secure/attachment/12686961/YARN-2944-trunk-v2.patch
  against trunk revision 46612c7.

    {color:green}+1 @author{color}.  The patch does not contain any @author tags.

    {color:green}+1 tests included{color}.  The patch appears to include 4 new or modified test files.

      {color:red}-1 javac{color}.  The applied patch generated 1217 javac compiler warnings (more than the trunk's current 155 warnings).

    {color:red}-1 javadoc{color}.  The javadoc tool appears to have generated 49 warning messages.
        See https://builds.apache.org/job/PreCommit-YARN-Build/6107//artifact/patchprocess/diffJavadocWarnings.txt for details.

    {color:green}+1 eclipse:eclipse{color}.  The patch built with eclipse:eclipse.

    {color:red}-1 findbugs{color}.  The patch appears to introduce 25 new Findbugs (version 2.0.3) warnings.

    {color:green}+1 release audit{color}.  The applied patch does not increase the total number of release audit warnings.

    {color:green}+1 core tests{color}.  The patch passed unit tests in hadoop-yarn-project/hadoop-yarn/hadoop-yarn-api hadoop-yarn-project/hadoop-yarn/hadoop-yarn-common hadoop-yarn-project/hadoop-yarn/hadoop-yarn-server/hadoop-yarn-server-sharedcachemanager.

Test results: https://builds.apache.org/job/PreCommit-YARN-Build/6107//testReport/
Findbugs warnings: https://builds.apache.org/job/PreCommit-YARN-Build/6107//artifact/patchprocess/newPatchFindbugsWarningshadoop-yarn-common.html
Javac warnings: https://builds.apache.org/job/PreCommit-YARN-Build/6107//artifact/patchprocess/diffJavacWarnings.txt
Console output: https://builds.apache.org/job/PreCommit-YARN-Build/6107//console

This message is automatically generated.


======================================================================
======================================================================
    Adding comment to Jira.
======================================================================
======================================================================


Comment added.
215d4639a19593d104f79c923a1b6e2d2b9e633e logged out


======================================================================
======================================================================
    Finished build.
======================================================================
======================================================================


Build step 'Execute shell' marked build as failure
Archiving artifacts
Sending artifact delta relative to PreCommit-YARN-Build #6051
Archived 26 artifacts
Archive block size is 32768
Received 12 blocks and 8467675 bytes
Compression is 4.4%
Took 2.6 sec
[description-setter] Could not determine description.
Recording test results
Email was triggered for: Failure
Sending email for trigger: Failure



###################################################################################
############################## FAILED TESTS (if any) ##############################
All tests passed

Failed: YARN-2944 PreCommit Build #6106

Posted by Apache Jenkins Server <je...@builds.apache.org>.
Jira: https://issues.apache.org/jira/browse/YARN-2944
Build: https://builds.apache.org/job/PreCommit-YARN-Build/6106/

###################################################################################
########################## LAST 60 LINES OF THE CONSOLE ###########################
[...truncated 92 lines...]


======================================================================
======================================================================
    Determining number of patched javac warnings.
======================================================================
======================================================================


/home/jenkins/tools/maven/latest/bin/mvn clean test -DskipTests -DHadoopPatchProcess -Pnative -Ptest-patch > /home/jenkins/jenkins-slave/workspace/PreCommit-YARN-Build/../patchprocess/patchJavacWarnings.txt 2>&1




{color:red}-1 overall{color}.  Here are the results of testing the latest attachment 
  http://issues.apache.org/jira/secure/attachment/12686950/YARN-2944-trunk-v2.patch
  against trunk revision 46612c7.

    {color:green}+1 @author{color}.  The patch does not contain any @author tags.

    {color:green}+1 tests included{color}.  The patch appears to include 4 new or modified test files.

    {color:red}-1 javac{color:red}.  The patch appears to cause the build to fail.

Console output: https://builds.apache.org/job/PreCommit-YARN-Build/6106//console

This message is automatically generated.


======================================================================
======================================================================
    Adding comment to Jira.
======================================================================
======================================================================


Comment added.
5c1ce68bfd2c3167de05ed8cf49986cb3864917a logged out


======================================================================
======================================================================
    Finished build.
======================================================================
======================================================================


Build step 'Execute shell' marked build as failure
Archiving artifacts
Sending artifact delta relative to PreCommit-YARN-Build #6051
Archived 3 artifacts
Archive block size is 32768
Received 10 blocks and 2931979 bytes
Compression is 10.1%
Took 0.98 sec
[description-setter] Could not determine description.
Recording test results
Email was triggered for: Failure
Sending email for trigger: Failure



###################################################################################
############################## FAILED TESTS (if any) ##############################
No tests ran.

Failed: YARN-2944 PreCommit Build #6105

Posted by Apache Jenkins Server <je...@builds.apache.org>.
Jira: https://issues.apache.org/jira/browse/YARN-2944
Build: https://builds.apache.org/job/PreCommit-YARN-Build/6105/

###################################################################################
########################## LAST 60 LINES OF THE CONSOLE ###########################
[...truncated 92 lines...]


======================================================================
======================================================================
    Determining number of patched javac warnings.
======================================================================
======================================================================


/home/jenkins/tools/maven/latest/bin/mvn clean test -DskipTests -DHadoopPatchProcess -Pnative -Ptest-patch > /home/jenkins/jenkins-slave/workspace/PreCommit-YARN-Build/../patchprocess/patchJavacWarnings.txt 2>&1




{color:red}-1 overall{color}.  Here are the results of testing the latest attachment 
  http://issues.apache.org/jira/secure/attachment/12686947/YARN-2944-trunk-v2.patch
  against trunk revision 46612c7.

    {color:green}+1 @author{color}.  The patch does not contain any @author tags.

    {color:green}+1 tests included{color}.  The patch appears to include 4 new or modified test files.

    {color:red}-1 javac{color:red}.  The patch appears to cause the build to fail.

Console output: https://builds.apache.org/job/PreCommit-YARN-Build/6105//console

This message is automatically generated.


======================================================================
======================================================================
    Adding comment to Jira.
======================================================================
======================================================================


Comment added.
ccb4312cedf778ee9c2f8363c6642b45a4d1a924 logged out


======================================================================
======================================================================
    Finished build.
======================================================================
======================================================================


Build step 'Execute shell' marked build as failure
Archiving artifacts
Sending artifact delta relative to PreCommit-YARN-Build #6051
Archived 3 artifacts
Archive block size is 32768
Received 53 blocks and 1522958 bytes
Compression is 53.3%
Took 0.84 sec
[description-setter] Could not determine description.
Recording test results
Email was triggered for: Failure
Sending email for trigger: Failure



###################################################################################
############################## FAILED TESTS (if any) ##############################
No tests ran.

Failed: YARN-2950 PreCommit Build #6104

Posted by Apache Jenkins Server <je...@builds.apache.org>.
Jira: https://issues.apache.org/jira/browse/YARN-2950
Build: https://builds.apache.org/job/PreCommit-YARN-Build/6104/

###################################################################################
########################## LAST 60 LINES OF THE CONSOLE ###########################
[...truncated 3195 lines...]
{color:red}-1 overall{color}.  Here are the results of testing the latest attachment 
  http://issues.apache.org/jira/secure/attachment/12686924/YARN-2950-1.patch
  against trunk revision 3681de2.

    {color:green}+1 @author{color}.  The patch does not contain any @author tags.

    {color:red}-1 tests included{color}.  The patch doesn't appear to include any new or modified tests.
                        Please justify why no new tests are needed for this patch.
                        Also please list what manual steps were performed to verify this patch.

    {color:green}+1 javac{color}.  The applied patch does not increase the total number of javac compiler warnings.

    {color:green}+1 javadoc{color}.  There were no new javadoc warning messages.

    {color:green}+1 eclipse:eclipse{color}.  The patch built with eclipse:eclipse.

    {color:red}-1 findbugs{color}.  The patch appears to introduce 25 new Findbugs (version 2.0.3) warnings.

    {color:green}+1 release audit{color}.  The applied patch does not increase the total number of release audit warnings.

    {color:green}+1 core tests{color}.  The patch passed unit tests in hadoop-yarn-project/hadoop-yarn/hadoop-yarn-common.

Test results: https://builds.apache.org/job/PreCommit-YARN-Build/6104//testReport/
Findbugs warnings: https://builds.apache.org/job/PreCommit-YARN-Build/6104//artifact/patchprocess/newPatchFindbugsWarningshadoop-yarn-common.html
Console output: https://builds.apache.org/job/PreCommit-YARN-Build/6104//console

This message is automatically generated.


======================================================================
======================================================================
    Adding comment to Jira.
======================================================================
======================================================================


Comment added.
2f0e01fc6109d5d87a7768766534a272bfc847c2 logged out


======================================================================
======================================================================
    Finished build.
======================================================================
======================================================================


Build step 'Execute shell' marked build as failure
Archiving artifacts
Sending artifact delta relative to PreCommit-YARN-Build #6051
Archived 15 artifacts
Archive block size is 32768
Received 40 blocks and 7596804 bytes
Compression is 14.7%
Took 1.9 sec
[description-setter] Could not determine description.
Recording test results
Email was triggered for: Failure
Sending email for trigger: Failure



###################################################################################
############################## FAILED TESTS (if any) ##############################
All tests passed