You are viewing a plain text version of this content. The canonical link for it is here.
Posted to builds@beam.apache.org by Apache Jenkins Server <je...@builds.apache.org> on 2022/12/25 20:32:17 UTC
Build failed in Jenkins: beam_Publish_Beam_SDK_Snapshots #4514
See <https://ci-beam.apache.org/job/beam_Publish_Beam_SDK_Snapshots/4514/display/redirect>
Changes:
------------------------------------------
[...truncated 68.56 KB...]
Attempting uninstall: pip
Found existing installation: pip 20.0.2
Uninstalling pip-20.0.2:
Successfully uninstalled pip-20.0.2
Successfully installed pip-22.3.1
Ignoring grpcio: markers 'sys_platform == "darwin"' don't match your environment
Ignoring protobuf: markers 'python_version == "3.10" and sys_platform == "darwin"' don't match your environment
Collecting tox==3.20.1
Using cached tox-3.20.1-py2.py3-none-any.whl (83 kB)
Requirement already satisfied: setuptools in <https://ci-beam.apache.org/job/beam_Publish_Beam_SDK_Snapshots/ws/src/build/gradleenv/1922375555/lib/python3.8/site-packages> (from -r <https://ci-beam.apache.org/job/beam_Publish_Beam_SDK_Snapshots/ws/src/sdks/python/build-requirements.txt> (line 20)) (44.0.0)
Collecting setuptools
Using cached setuptools-65.6.3-py3-none-any.whl (1.2 MB)
Collecting six
Using cached six-1.16.0-py2.py3-none-any.whl (11 kB)
Collecting wheel>=0.36.0
Using cached wheel-0.38.4-py3-none-any.whl (36 kB)
Collecting grpcio-tools==1.37.0
Using cached grpcio_tools-1.37.0-cp38-cp38-manylinux2014_x86_64.whl (2.5 MB)
Collecting mypy-protobuf==1.18
Using cached mypy_protobuf-1.18-py3-none-any.whl (7.3 kB)
Collecting distlib==0.3.1
Using cached distlib-0.3.1-py2.py3-none-any.whl (335 kB)
Collecting numpy<1.23.0,>=1.14.3
Using cached numpy-1.22.4-cp38-cp38-manylinux_2_17_x86_64.manylinux2014_x86_64.whl (16.9 MB)
Collecting packaging>=14
Using cached packaging-22.0-py3-none-any.whl (42 kB)
Collecting toml>=0.9.4
Using cached toml-0.10.2-py2.py3-none-any.whl (16 kB)
Collecting filelock>=3.0.0
Using cached filelock-3.8.2-py3-none-any.whl (10 kB)
Collecting pluggy>=0.12.0
Using cached pluggy-1.0.0-py2.py3-none-any.whl (13 kB)
Collecting virtualenv!=20.0.0,!=20.0.1,!=20.0.2,!=20.0.3,!=20.0.4,!=20.0.5,!=20.0.6,!=20.0.7,>=16.0.0
Using cached virtualenv-20.17.1-py3-none-any.whl (8.8 MB)
Collecting py>=1.4.17
Using cached py-1.11.0-py2.py3-none-any.whl (98 kB)
Collecting grpcio>=1.37.0
Using cached grpcio-1.51.1-cp38-cp38-manylinux_2_17_x86_64.manylinux2014_x86_64.whl (4.8 MB)
Collecting protobuf<4.0dev,>=3.5.0.post1
Using cached protobuf-3.20.3-cp38-cp38-manylinux_2_5_x86_64.manylinux1_x86_64.whl (1.0 MB)
Collecting platformdirs<3,>=2.4
Using cached platformdirs-2.6.0-py3-none-any.whl (14 kB)
Collecting virtualenv!=20.0.0,!=20.0.1,!=20.0.2,!=20.0.3,!=20.0.4,!=20.0.5,!=20.0.6,!=20.0.7,>=16.0.0
Using cached virtualenv-20.17.0-py3-none-any.whl (8.8 MB)
Using cached virtualenv-20.16.7-py3-none-any.whl (8.8 MB)
Using cached virtualenv-20.16.6-py3-none-any.whl (8.8 MB)
Using cached virtualenv-20.16.5-py3-none-any.whl (8.8 MB)
Using cached virtualenv-20.16.4-py3-none-any.whl (8.8 MB)
Using cached virtualenv-20.16.3-py2.py3-none-any.whl (8.8 MB)
Using cached virtualenv-20.16.2-py2.py3-none-any.whl (8.8 MB)
Installing collected packages: distlib, wheel, toml, six, setuptools, py, protobuf, pluggy, platformdirs, packaging, numpy, grpcio, filelock, virtualenv, mypy-protobuf, grpcio-tools, tox
Attempting uninstall: setuptools
Found existing installation: setuptools 44.0.0
Uninstalling setuptools-44.0.0:
Successfully uninstalled setuptools-44.0.0
> Task :sdks:java:container:java11:dockerTag820839fe86b16c4600b0aab4ad8236456cd200a9
> Task :sdks:java:container:java17:docker
Status: Downloaded newer image for openjdk:17-bullseye
---> d4d5b6e666dc
Step 3/21 : MAINTAINER "Apache Beam <de...@beam.apache.org>"
---> Running in f5e1c4b1c6e0
Removing intermediate container f5e1c4b1c6e0
---> fce99cbf60b1
Step 4/21 : ARG pull_licenses
---> Running in ef1b4194bd7e
Removing intermediate container ef1b4194bd7e
---> 87aef0fa596b
Step 5/21 : ADD target/slf4j-api.jar /opt/apache/beam/jars/
---> 291944f09ebf
Step 6/21 : ADD target/slf4j-jdk14.jar /opt/apache/beam/jars/
---> 066d789fde2e
Step 7/21 : ADD target/beam-sdks-java-harness.jar /opt/apache/beam/jars/
---> dd95d3931d4d
Step 8/21 : ADD target/beam-sdks-java-io-kafka.jar /opt/apache/beam/jars/
---> b66212b39908
Step 9/21 : ADD target/kafka-clients.jar /opt/apache/beam/jars/
---> c9efc8acd597
Step 10/21 : COPY target/jamm.jar target/open-module-agent*.jar /opt/apache/beam/jars/
---> fc213c81deec
Step 11/21 : ADD target/linux_amd64/boot /opt/apache/beam/
---> 9f83a13a62f1
Step 12/21 : COPY target/LICENSE /opt/apache/beam/
---> 6813080280ce
Step 13/21 : COPY target/NOTICE /opt/apache/beam/
---> 6a1b217eeca4
Step 14/21 : ADD target/third_party_licenses /opt/apache/beam/third_party_licenses/
---> 7ab1e1875305
Step 15/21 : COPY target/LICENSE target/options/* /opt/apache/beam/options/
---> 4e4fd7a5eb0e
Step 16/21 : RUN rm /opt/apache/beam/options/LICENSE
---> Running in d99fcf3528d7
Removing intermediate container d99fcf3528d7
---> 095baa6c30a6
Step 17/21 : COPY target/LICENSE target/go-licenses/* /opt/apache/beam/third_party_licenses/golang/
---> a3c9d1b88150
Step 18/21 : RUN rm /opt/apache/beam/third_party_licenses/golang/LICENSE
---> Running in 829e07591e20
Removing intermediate container 829e07591e20
---> 2794babdc602
Step 19/21 : RUN if [ "${pull_licenses}" = "false" ] ; then rm -rf /opt/apache/beam/third_party_licenses ; fi
---> Running in 44ab5d33aa69
> Task :release:go-licenses:py:dockerRun
go: downloading github.com/nightlyone/lockfile v1.0.0
go: downloading github.com/golang/protobuf v1.5.2
go: downloading google.golang.org/grpc v1.50.1
go: downloading google.golang.org/protobuf v1.28.1
go: downloading golang.org/x/net v0.0.0-20221012135044-0b7e1fb9d458
go: downloading google.golang.org/genproto v0.0.0-20221010155953-15ba04fc1c0e
go: downloading golang.org/x/sys v0.0.0-20220728004956-3c1f35247d10
go: added github.com/apache/beam/sdks/v2 v2.43.0
go: added github.com/golang/protobuf v1.5.2
go: added github.com/nightlyone/lockfile v1.0.0
go: added golang.org/x/net v0.0.0-20221012135044-0b7e1fb9d458
go: added golang.org/x/sys v0.0.0-20220728004956-3c1f35247d10
go: added golang.org/x/text v0.4.0
go: added google.golang.org/genproto v0.0.0-20221010155953-15ba04fc1c0e
go: added google.golang.org/grpc v1.50.1
go: added google.golang.org/protobuf v1.28.1
+ go-licenses save github.com/apache/beam/sdks/v2/python/container --save_path=/output/licenses
W1225 20:15:07.952751 41 library.go:101] "golang.org/x/sys/unix" contains non-Go code that can't be inspected for further dependencies:
/go/pkg/mod/golang.org/x/sys@v0.0.0-20220728004956-3c1f35247d10/unix/asm_linux_amd64.s
+ go-licenses csv github.com/apache/beam/sdks/v2/python/container
+ tee /output/licenses/list.csv
W1225 20:15:12.337748 88 library.go:101] "golang.org/x/sys/unix" contains non-Go code that can't be inspected for further dependencies:
/go/pkg/mod/golang.org/x/sys@v0.0.0-20220728004956-3c1f35247d10/unix/asm_linux_amd64.s
github.com/apache/beam/sdks/v2/go/pkg/beam,https://github.com/apache/beam/blob/sdks/v2.43.0/sdks/go/README.md,Apache-2.0
github.com/apache/beam/sdks/v2/python/container,https://github.com/apache/beam/blob/sdks/v2.43.0/sdks/LICENSE,Apache-2.0
github.com/golang/protobuf,https://github.com/golang/protobuf/blob/v1.5.2/LICENSE,BSD-3-Clause
github.com/nightlyone/lockfile,https://github.com/nightlyone/lockfile/blob/v1.0.0/LICENSE,MIT
golang.org/x/net,https://cs.opensource.google/go/x/net/+/0b7e1fb9:LICENSE,BSD-3-Clause
golang.org/x/sys,https://cs.opensource.google/go/x/sys/+/3c1f3524:LICENSE,BSD-3-Clause
golang.org/x/text,https://cs.opensource.google/go/x/text/+/v0.4.0:LICENSE,BSD-3-Clause
google.golang.org/genproto/googleapis/rpc/status,https://github.com/googleapis/go-genproto/blob/15ba04fc1c0e/LICENSE,Apache-2.0
google.golang.org/grpc,https://github.com/grpc/grpc-go/blob/v1.50.1/LICENSE,Apache-2.0
google.golang.org/protobuf,https://github.com/protocolbuffers/protobuf-go/blob/v1.28.1/LICENSE,BSD-3-Clause
+ chmod -R a+w /output/licenses
> Task :release:go-licenses:py:createLicenses
> Task :sdks:python:container:py38:copyGolangLicenses
> Task :sdks:python:container:py37:copyGolangLicenses
> Task :sdks:java:container:java17:dockerTag820839fe86b16c4600b0aab4ad8236456cd200a9
> Task :sdks:python:sdist
org/apache/beam/model/interactive/v1/beam_interactive_api.proto:36:1: warning: Import google/protobuf/timestamp.proto is unused.
Writing mypy to org/apache/beam/model/pipeline/v1/external_transforms_pb2.pyi
Writing mypy to org/apache/beam/model/pipeline/v1/beam_runner_api_pb2.pyi
Writing mypy to org/apache/beam/model/pipeline/v1/standard_window_fns_pb2.pyi
Writing mypy to org/apache/beam/model/pipeline/v1/metrics_pb2.pyi
Writing mypy to org/apache/beam/model/pipeline/v1/endpoints_pb2.pyi
Writing mypy to org/apache/beam/model/pipeline/v1/schema_pb2.pyi
Writing mypy to org/apache/beam/model/job_management/v1/beam_artifact_api_pb2.pyi
Writing mypy to org/apache/beam/model/job_management/v1/beam_expansion_api_pb2.pyi
Writing mypy to org/apache/beam/model/job_management/v1/beam_job_api_pb2.pyi
Writing mypy to org/apache/beam/model/fn_execution/v1/beam_provision_api_pb2.pyi
Writing mypy to org/apache/beam/model/fn_execution/v1/beam_fn_api_pb2.pyi
Writing mypy to org/apache/beam/model/interactive/v1/beam_interactive_api_pb2.pyi
<https://ci-beam.apache.org/job/beam_Publish_Beam_SDK_Snapshots/ws/src/build/gradleenv/1922375555/lib/python3.8/site-packages/setuptools/dist.py>:529: UserWarning: Normalizing '2.45.0.dev' to '2.45.0.dev0'
warnings.warn(tmpl.format(**locals()))
warning: no files found matching 'README.md'
warning: no files found matching 'NOTICE'
warning: no files found matching 'LICENSE'
warning: no files found matching 'LICENSE.python'
warning: sdist: standard file not found: should have one of README, README.rst, README.txt, README.md
> Task :sdks:java:container:java11:dockerPush820839fe86b16c4600b0aab4ad8236456cd200a9
> Task :sdks:java:container:java11:dockerTagLatest
> Task :sdks:python:container:py38:copyDockerfileDependencies
> Task :sdks:python:container:py37:copyDockerfileDependencies
> Task :sdks:python:container:py38:dockerClean UP-TO-DATE
> Task :sdks:python:container:py39:copyDockerfileDependencies
> Task :sdks:python:container:py39:copyGolangLicenses
> Task :sdks:python:container:py39:copyLauncherDependencies
> Task :sdks:python:container:py39:copyLicenseScripts
> Task :sdks:python:container:py37:dockerPrepare
> Task :sdks:python:container:py38:dockerPrepare
> Task :sdks:python:container:py39:copyLicenses
> Task :sdks:python:container:py39:dockerClean UP-TO-DATE
> Task :sdks:python:container:py310:copyDockerfileDependencies
> Task :sdks:python:container:py310:copyGolangLicenses
> Task :sdks:python:container:py39:dockerPrepare
> Task :sdks:python:container:py310:copyLauncherDependencies
> Task :sdks:python:container:py310:copyLicenseScripts
> Task :sdks:python:container:py310:copyLicenses
> Task :sdks:python:container:py310:dockerClean UP-TO-DATE
> Task :sdks:python:container:py310:dockerPrepare
> Task :sdks:java:container:java11:dockerPushLatest
> Task :sdks:java:container:java11:dockerTagsPush
> Task :sdks:java:container:java17:dockerPush820839fe86b16c4600b0aab4ad8236456cd200a9
> Task :sdks:java:container:java17:dockerTagLatest
> Task :sdks:java:container:java17:dockerPushLatest
> Task :sdks:java:container:java17:dockerTagsPush
> Task :sdks:python:container:py37:docker
> Task :sdks:python:container:py38:docker
> Task :sdks:python:container:py39:docker
> Task :sdks:python:container:py310:docker
> Task :sdks:python:container:py310:dockerTag820839fe86b16c4600b0aab4ad8236456cd200a9
> Task :sdks:python:container:py39:dockerTag820839fe86b16c4600b0aab4ad8236456cd200a9
> Task :sdks:python:container:py38:dockerTag820839fe86b16c4600b0aab4ad8236456cd200a9
> Task :sdks:python:container:py37:dockerTag820839fe86b16c4600b0aab4ad8236456cd200a9
> Task :sdks:python:container:py310:dockerPush820839fe86b16c4600b0aab4ad8236456cd200a9
> Task :sdks:python:container:py39:dockerPush820839fe86b16c4600b0aab4ad8236456cd200a9
> Task :sdks:python:container:py38:dockerPush820839fe86b16c4600b0aab4ad8236456cd200a9
> Task :sdks:python:container:py37:dockerPush820839fe86b16c4600b0aab4ad8236456cd200a9
> Task :sdks:python:container:py310:dockerTagLatest
> Task :sdks:python:container:py310:dockerPushLatest
> Task :sdks:python:container:py310:dockerTagsPush
> Task :sdks:python:container:py39:dockerTagLatest
> Task :sdks:python:container:py39:dockerPushLatest
> Task :sdks:python:container:py39:dockerTagsPush
> Task :sdks:python:container:py38:dockerTagLatest
> Task :sdks:python:container:py38:dockerPushLatest
> Task :sdks:python:container:py38:dockerTagsPush
> Task :sdks:python:container:py37:dockerTagLatest
> Task :sdks:python:container:py37:dockerPushLatest
> Task :sdks:python:container:py37:dockerTagsPush
FAILURE: Build failed with an exception.
* What went wrong:
Execution failed for task ':sdks:java:container:java8:docker'.
> Process 'command 'docker'' finished with non-zero exit value 1
* Try:
> Run with --stacktrace option to get the stack trace.
> Run with --info or --debug option to get more log output.
* Get more help at https://help.gradle.org
Deprecated Gradle features were used in this build, making it incompatible with Gradle 8.0.
You can use '--warning-mode all' to show the individual deprecation warnings and determine if they come from your own scripts or plugins.
See https://docs.gradle.org/7.5.1/userguide/command_line_interface.html#sec:command_line_warnings
Execution optimizations have been disabled for 3 invalid unit(s) of work during this build to ensure correctness.
Please consult deprecation warnings for more details.
BUILD FAILED in 18m 46s
178 actionable tasks: 140 executed, 25 from cache, 13 up-to-date
Publishing build scan...
https://gradle.com/s/spwgwtnf6op6w
Build step 'Invoke Gradle script' changed build result to FAILURE
Build step 'Invoke Gradle script' marked build as failure
---------------------------------------------------------------------
To unsubscribe, e-mail: builds-unsubscribe@beam.apache.org
For additional commands, e-mail: builds-help@beam.apache.org
Jenkins build is back to normal : beam_Publish_Beam_SDK_Snapshots #4515
Posted by Apache Jenkins Server <je...@builds.apache.org>.
See <https://ci-beam.apache.org/job/beam_Publish_Beam_SDK_Snapshots/4515/display/redirect>
---------------------------------------------------------------------
To unsubscribe, e-mail: builds-unsubscribe@beam.apache.org
For additional commands, e-mail: builds-help@beam.apache.org