You are viewing a plain text version of this content. The canonical link for it is here.
Posted to builds@beam.apache.org by Apache Jenkins Server <je...@builds.apache.org> on 2018/11/22 08:20:36 UTC
Build failed in Jenkins: beam_Release_Gradle_NightlySnapshot #246
See <https://builds.apache.org/job/beam_Release_Gradle_NightlySnapshot/246/display/redirect?page=changes>
Changes:
[robertwb] Ensure global top is non-empty.
[david.moravek] [Website] Euphoria roadmap.
[je.ik] [Website] table stream joins to Euphoria roadmap
[varundhussa] [BEAM-6099] Add PFADD instruction to RedisIO
[david.moravek] Kryo: Annotate kryo as Experimental.
[altay] Revert "[BEAM-5320] Finish Python 3 porting for testing module (#7029)"
[kenn] [BEAM-6104] Use a very large stack for compiling Beam
[chamikara] Moving to 2.10.0-SNAPSHOT on master branch.
[github] typo fix in experiments flag name in the log (#7076)
[github] [BEAM-3608, BEAM-5819] Pass through parameters needed for publishing for
[github] [BEAM-6058] Use vendored gRPC 1.13.1 dependency. (#7105)
[scott] Don't redundantly execute pre-commits as part of Jenkins post-commits
------------------------------------------
[...truncated 41.05 MB...]
:beam-vendor-sdks-java-extensions-protobuf:validateShadedJarDoesntLeakNonOrgApacheBeamClasses (Thread[Task worker for ':' Thread 9,5,main]) started.
> Task :beam-vendor-sdks-java-extensions-protobuf:validateShadedJarDoesntLeakNonOrgApacheBeamClasses
Build cache key for task ':beam-vendor-sdks-java-extensions-protobuf:validateShadedJarDoesntLeakNonOrgApacheBeamClasses' is 869e144709ffea35b06ab98178b7efcb
Caching disabled for task ':beam-vendor-sdks-java-extensions-protobuf:validateShadedJarDoesntLeakNonOrgApacheBeamClasses': Caching has not been enabled for the task
Task ':beam-vendor-sdks-java-extensions-protobuf:validateShadedJarDoesntLeakNonOrgApacheBeamClasses' is not up-to-date because:
No history is available.
:beam-vendor-sdks-java-extensions-protobuf:validateShadedJarDoesntLeakNonOrgApacheBeamClasses (Thread[Task worker for ':' Thread 9,5,main]) completed. Took 0.068 secs.
:beam-vendor-sdks-java-extensions-protobuf:check (Thread[Task worker for ':' Thread 9,5,main]) started.
> Task :beam-vendor-sdks-java-extensions-protobuf:check
Skipping task ':beam-vendor-sdks-java-extensions-protobuf:check' as it has no actions.
:beam-vendor-sdks-java-extensions-protobuf:check (Thread[Task worker for ':' Thread 9,5,main]) completed. Took 0.0 secs.
:beam-vendor-sdks-java-extensions-protobuf:build (Thread[Task worker for ':' Thread 9,5,main]) started.
> Task :beam-vendor-sdks-java-extensions-protobuf:build
Skipping task ':beam-vendor-sdks-java-extensions-protobuf:build' as it has no actions.
:beam-vendor-sdks-java-extensions-protobuf:build (Thread[Task worker for ':' Thread 9,5,main]) completed. Took 0.0 secs.
:beam-website:assemble (Thread[Task worker for ':' Thread 9,5,main]) started.
> Task :beam-website:assemble UP-TO-DATE
Skipping task ':beam-website:assemble' as it has no actions.
:beam-website:assemble (Thread[Task worker for ':' Thread 9,5,main]) completed. Took 0.0 secs.
:beam-website:setupBuildDir (Thread[Task worker for ':' Thread 9,5,main]) started.
> Task :beam-website:setupBuildDir
Build cache key for task ':beam-website:setupBuildDir' is fb2b365f958e0219d3a886db810dc756
Caching disabled for task ':beam-website:setupBuildDir': Caching has not been enabled for the task
Task ':beam-website:setupBuildDir' is not up-to-date because:
No history is available.
:beam-website:setupBuildDir (Thread[Task worker for ':' Thread 9,5,main]) completed. Took 0.037 secs.
:beam-website:buildDockerImage (Thread[Task worker for ':' Thread 9,5,main]) started.
> Task :beam-website:buildDockerImage
Caching disabled for task ':beam-website:buildDockerImage': Caching has not been enabled for the task
Task ':beam-website:buildDockerImage' is not up-to-date because:
Task has not declared any outputs despite executing actions.
Starting process 'command 'docker''. Working directory: <https://builds.apache.org/job/beam_Release_Gradle_NightlySnapshot/ws/src/website> Command: docker build -t beam-website .
Successfully started process 'command 'docker''
Sending build context to Docker daemon 26.36MB
Step 1/7 : FROM ruby:2.5
---> bdbc506da19b
Step 2/7 : WORKDIR /ruby
---> Using cache
---> 6b02319128f5
Step 3/7 : RUN gem install bundler
---> Using cache
---> eabdddd0127d
Step 4/7 : ADD Gemfile Gemfile.lock /ruby/
---> Using cache
---> 769d5bc802cd
Step 5/7 : RUN bundle install --deployment --path $GEM_HOME
---> Using cache
---> 9faff8a37448
Step 6/7 : ENV LC_ALL C.UTF-8
---> Using cache
---> 50b43b77f708
Step 7/7 : CMD sleep 3600
---> Using cache
---> 58f15dd1faba
Successfully built 58f15dd1faba
Successfully tagged beam-website:latest
:beam-website:buildDockerImage (Thread[Task worker for ':' Thread 9,5,main]) completed. Took 0.803 secs.
:beam-website:createDockerContainer (Thread[Task worker for ':' Thread 9,5,main]) started.
> Task :beam-website:createDockerContainer
Caching disabled for task ':beam-website:createDockerContainer': Caching has not been enabled for the task
Task ':beam-website:createDockerContainer' is not up-to-date because:
Task has not declared any outputs despite executing actions.
Starting process 'command '/bin/bash''. Working directory: <https://builds.apache.org/job/beam_Release_Gradle_NightlySnapshot/ws/src/website> Command: /bin/bash -c docker create -v <https://builds.apache.org/job/beam_Release_Gradle_NightlySnapshot/ws/src>:/repo -u $(id -u):$(id -g) beam-website
Successfully started process 'command '/bin/bash''
:beam-website:createDockerContainer (Thread[Task worker for ':' Thread 9,5,main]) completed. Took 1.252 secs.
:beam-website:startDockerContainer (Thread[Task worker for ':' Thread 9,5,main]) started.
> Task :beam-website:startDockerContainer
Caching disabled for task ':beam-website:startDockerContainer': Caching has not been enabled for the task
Task ':beam-website:startDockerContainer' is not up-to-date because:
Task has not declared any outputs despite executing actions.
Starting process 'command 'docker''. Working directory: <https://builds.apache.org/job/beam_Release_Gradle_NightlySnapshot/ws/src/website> Command: docker start 4888f8c96e5b1e2d7d780044d54ecb23ccf45d1eab411d3658792afc44663c2f
Successfully started process 'command 'docker''
4888f8c96e5b1e2d7d780044d54ecb23ccf45d1eab411d3658792afc44663c2f
:beam-website:startDockerContainer (Thread[Task worker for ':' Thread 9,5,main]) completed. Took 0.31 secs.
:beam-website:buildLocalWebsite (Thread[Task worker for ':' Thread 9,5,main]) started.
> Task :beam-website:buildLocalWebsite
Build cache key for task ':beam-website:buildLocalWebsite' is 4f2921152d60365518870741cb3bf5f5
Caching disabled for task ':beam-website:buildLocalWebsite': Caching has not been enabled for the task
Task ':beam-website:buildLocalWebsite' is not up-to-date because:
No history is available.
Starting process 'command 'docker''. Working directory: <https://builds.apache.org/job/beam_Release_Gradle_NightlySnapshot/ws/src/website> Command: docker exec 4888f8c96e5b1e2d7d780044d54ecb23ccf45d1eab411d3658792afc44663c2f /bin/bash -c cd /repo/build/website && bundle exec jekyll build --destination generated-local-content --config /repo/website/_config.yml,/repo/website/_config_test.yml --incremental --source /repo/website/src
Successfully started process 'command 'docker''
`/` is not writable.
Bundler will use `/tmp/bundler/home/unknown' as your home directory temporarily.
Configuration file: /repo/website/_config.yml
Configuration file: /repo/website/_config_test.yml
Source: /repo/website/src
Destination: generated-local-content
Incremental build: enabled
Generating...
done in 12.676 seconds.
Auto-regeneration: disabled. Use --watch to enable.
:beam-website:buildLocalWebsite (Thread[Task worker for ':' Thread 9,5,main]) completed. Took 14.073 secs.
:beam-website:testWebsite (Thread[Task worker for ':' Thread 9,5,main]) started.
> Task :beam-website:testWebsite
Caching disabled for task ':beam-website:testWebsite': Caching has not been enabled for the task
Task ':beam-website:testWebsite' is not up-to-date because:
Task has not declared any outputs despite executing actions.
Starting process 'command 'docker''. Working directory: <https://builds.apache.org/job/beam_Release_Gradle_NightlySnapshot/ws/src/website> Command: docker exec 4888f8c96e5b1e2d7d780044d54ecb23ccf45d1eab411d3658792afc44663c2f /bin/bash -c cd /repo/build/website && bundle exec rake test
Successfully started process 'command 'docker''
`/` is not writable.
Bundler will use `/tmp/bundler/home/unknown' as your home directory temporarily.
Running ["HtmlCheck", "ImageCheck", "ScriptCheck", "LinkCheck"] on ["./generated-local-content"] on *.html...
Checking 724 external links...
Ran on 178 files!
HTML-Proofer finished successfully.
:beam-website:testWebsite (Thread[Task worker for ':' Thread 9,5,main]) completed. Took 1 mins 1.044 secs.
:beam-website:stopAndRemoveDockerContainer (Thread[Task worker for ':' Thread 9,5,main]) started.
> Task :beam-website:stopAndRemoveDockerContainer
Caching disabled for task ':beam-website:stopAndRemoveDockerContainer': Caching has not been enabled for the task
Task ':beam-website:stopAndRemoveDockerContainer' is not up-to-date because:
Task has not declared any outputs despite executing actions.
Starting process 'command 'docker''. Working directory: <https://builds.apache.org/job/beam_Release_Gradle_NightlySnapshot/ws/src/website> Command: docker rm -f 4888f8c96e5b1e2d7d780044d54ecb23ccf45d1eab411d3658792afc44663c2f
Successfully started process 'command 'docker''
4888f8c96e5b1e2d7d780044d54ecb23ccf45d1eab411d3658792afc44663c2f
:beam-website:stopAndRemoveDockerContainer (Thread[Task worker for ':' Thread 9,5,main]) completed. Took 0.387 secs.
:beam-website:buildWebsite (Thread[Task worker for ':' Thread 9,5,main]) started.
> Task :beam-website:buildWebsite
Skipping task ':beam-website:buildWebsite' as it has no actions.
:beam-website:buildWebsite (Thread[Task worker for ':' Thread 9,5,main]) completed. Took 0.0 secs.
:beam-website:check (Thread[Task worker for ':' Thread 10,5,main]) started.
> Task :beam-website:check
Skipping task ':beam-website:check' as it has no actions.
:beam-website:check (Thread[Task worker for ':' Thread 10,5,main]) completed. Took 0.0 secs.
:beam-website:build (Thread[Task worker for ':' Thread 10,5,main]) started.
> Task :beam-website:build
Skipping task ':beam-website:build' as it has no actions.
:beam-website:build (Thread[Task worker for ':' Thread 10,5,main]) completed. Took 0.0 secs.
:release:compileJava (Thread[Task worker for ':' Thread 10,5,main]) started.
> Task :release:compileJava NO-SOURCE
file or directory '<https://builds.apache.org/job/beam_Release_Gradle_NightlySnapshot/ws/src/release/src/main/java',> not found
Skipping task ':release:compileJava' as it has no source files and no previous output files.
:release:compileJava (Thread[Task worker for ':' Thread 10,5,main]) completed. Took 0.001 secs.
:release:compileGroovy (Thread[Task worker for ':' Thread 10,5,main]) started.
> Task :release:compileGroovy FROM-CACHE
Build cache key for task ':release:compileGroovy' is 963c3c0cb4a5245ed10f6e321c75ed98
Task ':release:compileGroovy' is not up-to-date because:
No history is available.
Origin for task ':release:compileGroovy': {executionTime=1522, hostName=apache-beam-jenkins-slave-group-51fn, operatingSystem=Linux, buildInvocationId=uzgfra4vyzdojkmvqpxs6wt4ei, creationTime=1538726917840, type=org.gradle.api.tasks.compile.GroovyCompile_Decorated, userName=jenkins, gradleVersion=4.10.2, rootPath=<https://builds.apache.org/job/beam_Release_Gradle_NightlySnapshot/ws/src,> path=:release:compileGroovy}
Unpacked output for task ':release:compileGroovy' from cache.
:release:compileGroovy (Thread[Task worker for ':' Thread 10,5,main]) completed. Took 0.026 secs.
:release:processResources (Thread[Task worker for ':' Thread 10,5,main]) started.
> Task :release:processResources NO-SOURCE
file or directory '<https://builds.apache.org/job/beam_Release_Gradle_NightlySnapshot/ws/src/release/src/main/resources',> not found
Skipping task ':release:processResources' as it has no source files and no previous output files.
:release:processResources (Thread[Task worker for ':' Thread 10,5,main]) completed. Took 0.0 secs.
:release:classes (Thread[Task worker for ':' Thread 10,5,main]) started.
> Task :release:classes UP-TO-DATE
Skipping task ':release:classes' as it has no actions.
:release:classes (Thread[Task worker for ':' Thread 10,5,main]) completed. Took 0.0 secs.
:release:jar (Thread[Task worker for ':' Thread 10,5,main]) started.
> Task :release:jar
Build cache key for task ':release:jar' is 1a942f3268d9202c85aa89fb3487ff7e
Caching disabled for task ':release:jar': Caching has not been enabled for the task
Task ':release:jar' is not up-to-date because:
No history is available.
:release:jar (Thread[Task worker for ':' Thread 10,5,main]) completed. Took 0.01 secs.
:release:assemble (Thread[Task worker for ':' Thread 10,5,main]) started.
> Task :release:assemble
Skipping task ':release:assemble' as it has no actions.
:release:assemble (Thread[Task worker for ':' Thread 10,5,main]) completed. Took 0.0 secs.
:release:compileTestJava (Thread[Task worker for ':' Thread 10,5,main]) started.
> Task :release:compileTestJava NO-SOURCE
file or directory '<https://builds.apache.org/job/beam_Release_Gradle_NightlySnapshot/ws/src/release/src/test/java',> not found
Skipping task ':release:compileTestJava' as it has no source files and no previous output files.
:release:compileTestJava (Thread[Task worker for ':' Thread 10,5,main]) completed. Took 0.0 secs.
:release:compileTestGroovy (Thread[Task worker for ':' Thread 10,5,main]) started.
> Task :release:compileTestGroovy NO-SOURCE
file or directory '<https://builds.apache.org/job/beam_Release_Gradle_NightlySnapshot/ws/src/release/src/test/groovy',> not found
Skipping task ':release:compileTestGroovy' as it has no source files and no previous output files.
:release:compileTestGroovy (Thread[Task worker for ':' Thread 10,5,main]) completed. Took 0.0 secs.
:release:processTestResources (Thread[Task worker for ':' Thread 10,5,main]) started.
> Task :release:processTestResources NO-SOURCE
file or directory '<https://builds.apache.org/job/beam_Release_Gradle_NightlySnapshot/ws/src/release/src/test/resources',> not found
Skipping task ':release:processTestResources' as it has no source files and no previous output files.
:release:processTestResources (Thread[Task worker for ':' Thread 10,5,main]) completed. Took 0.0 secs.
:release:testClasses (Thread[Task worker for ':' Thread 10,5,main]) started.
> Task :release:testClasses UP-TO-DATE
Skipping task ':release:testClasses' as it has no actions.
:release:testClasses (Thread[Task worker for ':' Thread 10,5,main]) completed. Took 0.0 secs.
:release:test (Thread[Task worker for ':' Thread 10,5,main]) started.
> Task :release:test NO-SOURCE
Skipping task ':release:test' as it has no source files and no previous output files.
:release:test (Thread[Task worker for ':' Thread 10,5,main]) completed. Took 0.001 secs.
:release:check (Thread[Task worker for ':' Thread 10,5,main]) started.
> Task :release:check UP-TO-DATE
Skipping task ':release:check' as it has no actions.
:release:check (Thread[Task worker for ':' Thread 10,5,main]) completed. Took 0.0 secs.
:release:build (Thread[Task worker for ':' Thread 10,5,main]) started.
> Task :release:build
Skipping task ':release:build' as it has no actions.
:release:build (Thread[Task worker for ':' Thread 10,5,main]) completed. Took 0.0 secs.
FAILURE: Build failed with an exception.
* What went wrong:
Execution failed for task ':beam-runners-flink_2.11:test'.
> There were failing tests. See the report at: file://<https://builds.apache.org/job/beam_Release_Gradle_NightlySnapshot/ws/src/runners/flink/build/reports/tests/test/index.html>
* Try:
Run with --stacktrace option to get the stack trace. Run with --debug option to get more log output. Run with --scan to get full insights.
* Get more help at https://help.gradle.org
Deprecated Gradle features were used in this build, making it incompatible with Gradle 5.0.
Use '--warning-mode all' to show the individual deprecation warnings.
See https://docs.gradle.org/4.10.2/userguide/command_line_interface.html#sec:command_line_warnings
BUILD FAILED in 1h 19m 50s
920 actionable tasks: 910 executed, 10 from cache
Publishing build scan...
https://gradle.com/s/rgplsucjn2b4c
Closing Git repo: <https://builds.apache.org/job/beam_Release_Gradle_NightlySnapshot/ws/src/.git>
Build step 'Invoke Gradle script' changed build result to FAILURE
Build step 'Invoke Gradle script' marked build as failure
---------------------------------------------------------------------
To unsubscribe, e-mail: builds-unsubscribe@beam.apache.org
For additional commands, e-mail: builds-help@beam.apache.org
Jenkins build is back to normal :
beam_Release_Gradle_NightlySnapshot #247
Posted by Apache Jenkins Server <je...@builds.apache.org>.
See <https://builds.apache.org/job/beam_Release_Gradle_NightlySnapshot/247/display/redirect?page=changes>
---------------------------------------------------------------------
To unsubscribe, e-mail: builds-unsubscribe@beam.apache.org
For additional commands, e-mail: builds-help@beam.apache.org