You are viewing a plain text version of this content. The canonical link for it is here.
Posted to commits@flex.apache.org by fl...@gmail.com on 2017/01/25 09:13:27 UTC

Build failed in Jenkins: flex-utilities_installer #1072

See <http://apacheflexbuild.cloudapp.net:8080/job/flex-utilities_installer/1072/>

------------------------------------------
Started by timer
Building remotely on flex_sdk_slave2 in workspace <http://apacheflexbuild.cloudapp.net:8080/job/flex-utilities_installer/ws/>
 > C:\Program Files (x86)\Git\cmd\git.exe rev-parse --is-inside-work-tree # timeout=10
Fetching changes from the remote Git repository
 > C:\Program Files (x86)\Git\cmd\git.exe config remote.origin.url https://git-wip-us.apache.org/repos/asf/flex-utilities.git # timeout=10
Fetching upstream changes from https://git-wip-us.apache.org/repos/asf/flex-utilities.git
 > C:\Program Files (x86)\Git\cmd\git.exe --version # timeout=10
 > C:\Program Files (x86)\Git\cmd\git.exe fetch --tags --progress https://git-wip-us.apache.org/repos/asf/flex-utilities.git +refs/heads/*:refs/remotes/origin/*
 > C:\Program Files (x86)\Git\cmd\git.exe rev-parse "origin/develop^{commit}" # timeout=10
Checking out Revision 30ef5fb36374060061739c402f55b3accc7aa019 (origin/develop)
 > C:\Program Files (x86)\Git\cmd\git.exe config core.sparsecheckout # timeout=10
 > C:\Program Files (x86)\Git\cmd\git.exe checkout -f 30ef5fb36374060061739c402f55b3accc7aa019
 > C:\Program Files (x86)\Git\cmd\git.exe rev-list 30ef5fb36374060061739c402f55b3accc7aa019 # timeout=10
[ant_on_air] $ cmd.exe /C "c:\Jenkins\tools\hudson.tasks.Ant_AntInstallation\c_apache-ant-1.9.3\bin\ant.bat -file build.xml -Dplayerglobal.version=11.7 main && exit %%ERRORLEVEL%%"
Buildfile: <http://apacheflexbuild.cloudapp.net:8080/job/flex-utilities_installer/ws/flex-installer/ant_on_air/build.xml>

clean:
   [delete] Deleting directory <http://apacheflexbuild.cloudapp.net:8080/job/flex-utilities_installer/ws/flex-installer/ant_on_air/bin>

init:

check-as3commons.swc:

get-as3commons.swc:

third-party:
      [get] Destination already exists (skipping): <http://apacheflexbuild.cloudapp.net:8080/job/flex-utilities_installer/ws/flex-installer/ant_on_air/external/de/ketzler/utils/SimpleUntar.as>
      [get] Destination already exists (skipping): <http://apacheflexbuild.cloudapp.net:8080/job/flex-utilities_installer/ws/flex-installer/ant_on_air/external/de/ketzler/utils/untar/UntarFileInfo.as>
      [get] Destination already exists (skipping): <http://apacheflexbuild.cloudapp.net:8080/job/flex-utilities_installer/ws/flex-installer/ant_on_air/external/de/ketzler/utils/untar/UntarHeaderBlock.as>
      [get] Destination already exists (skipping): <http://apacheflexbuild.cloudapp.net:8080/job/flex-utilities_installer/ws/flex-installer/ant_on_air/external/com/probertson/utils/CRC32Generator.as>
      [get] Destination already exists (skipping): <http://apacheflexbuild.cloudapp.net:8080/job/flex-utilities_installer/ws/flex-installer/ant_on_air/external/com/probertson/utils/GZIPBytesEncoder.as>
      [get] Destination already exists (skipping): <http://apacheflexbuild.cloudapp.net:8080/job/flex-utilities_installer/ws/flex-installer/ant_on_air/external/com/probertson/utils/GZIPEncoder.as>
      [get] Destination already exists (skipping): <http://apacheflexbuild.cloudapp.net:8080/job/flex-utilities_installer/ws/flex-installer/ant_on_air/external/com/probertson/utils/GZIPFile.as>

compile:
    [compc] Loading configuration file C:\Jenkins\workspace\flex-sdk\frameworks\air-config.xml
    [compc] C:\Jenkins\workspace\flex-utilities_installer\flex-installer\ant_on_air\bin\ant_on_air.swc (134446 bytes)
    [compc] Picked up JAVA_TOOL_OPTIONS: -Dfile.encoding=UTF8

test:
    [mxmlc] Loading configuration file C:\Jenkins\workspace\flex-sdk\frameworks\air-config.xml
    [mxmlc] C:\Jenkins\workspace\flex-utilities_installer\flex-installer\ant_on_air\tests\AntOnAir.swf (1147466 bytes)
    [mxmlc] Picked up JAVA_TOOL_OPTIONS: -Dfile.encoding=UTF8

failuretests:

main:

BUILD SUCCESSFUL
Total time: 1 minute 30 seconds
Picked up JAVA_TOOL_OPTIONS: -Dfile.encoding=UTF8
[flex-installer] $ cmd.exe /C "c:\Jenkins\tools\hudson.tasks.Ant_AntInstallation\c_apache-ant-1.9.3\bin\ant.bat -file build.xml -Dplayerglobal.version=11.7 clean build source-package create-md5s copy-misc && exit %%ERRORLEVEL%%"
Buildfile: <http://apacheflexbuild.cloudapp.net:8080/job/flex-utilities_installer/ws/flex-installer/build.xml>

clean:
   [delete] Deleting directory <http://apacheflexbuild.cloudapp.net:8080/job/flex-utilities_installer/ws/flex-installer/build>
   [delete] Deleting directory <http://apacheflexbuild.cloudapp.net:8080/job/flex-utilities_installer/ws/flex-installer/deps>
   [delete] Deleting directory <http://apacheflexbuild.cloudapp.net:8080/job/flex-utilities_installer/ws/flex-installer/installer/libs>
   [delete] Deleting directory <http://apacheflexbuild.cloudapp.net:8080/job/flex-utilities_installer/ws/flex-installer/release>

clean:

createDirs:
     [echo] ***************************************
     [echo] Execute the update-version target once,
     [echo] and only once, when you modifiy this app.
     [echo] This will increment the version number to allow
     [echo] the app to be updated by the AIR installer.
     [echo] ***************************************
     [echo]         
    [mkdir] Created dir: <http://apacheflexbuild.cloudapp.net:8080/job/flex-utilities_installer/ws/flex-installer/build>
    [mkdir] Created dir: <http://apacheflexbuild.cloudapp.net:8080/job/flex-utilities_installer/ws/flex-installer/release>

update-version-in-xml-files:
     [echo] version in InstallApacheFlex-app.xml will be 3.3.0

init:

certificate:

generate-certificate:
     [echo] Using cert temp.p12
     [java] Picked up JAVA_TOOL_OPTIONS: -Dfile.encoding=UTF8

check-as3commons.swc:

get-as3commons.swc:
    [mkdir] Created dir: <http://apacheflexbuild.cloudapp.net:8080/job/flex-utilities_installer/ws/flex-installer/installer/libs>
      [get] Getting: https://github.com/bigosmallm/MakeApacheFlexForFlashBuilder/blob/master/libs/as3commons-zip-1.0.0-alpha.1.swc?raw=true
      [get] To: <http://apacheflexbuild.cloudapp.net:8080/job/flex-utilities_installer/ws/flex-installer/installer/libs/as3commons-zip-1.0.0-alpha.1.swc>
      [get] https://github.com/bigosmallm/MakeApacheFlexForFlashBuilder/blob/master/libs/as3commons-zip-1.0.0-alpha.1.swc?raw=true moved to https://github.com/bigosmallm/MakeApacheFlexForFlashBuilder/raw/master/libs/as3commons-zip-1.0.0-alpha.1.swc
      [get] https://github.com/bigosmallm/MakeApacheFlexForFlashBuilder/raw/master/libs/as3commons-zip-1.0.0-alpha.1.swc moved to https://raw.githubusercontent.com/bigosmallm/MakeApacheFlexForFlashBuilder/master/libs/as3commons-zip-1.0.0-alpha.1.swc
      [get] .......

check-as3httpclient.swc:

get-as3httpclient.swc:
    [mkdir] Created dir: <http://apacheflexbuild.cloudapp.net:8080/job/flex-utilities_installer/ws/flex-installer/installer/libs/temp>
      [get] Getting: https://github.com/quetwo/as3httpclient/releases/download/1.0/as3httpclient.swc
      [get] To: <http://apacheflexbuild.cloudapp.net:8080/job/flex-utilities_installer/ws/flex-installer/installer/libs/as3httpclient.swc>
      [get] https://github.com/quetwo/as3httpclient/releases/download/1.0/as3httpclient.swc moved to https://github-cloud.s3.amazonaws.com/releases/36265618/8d35f30e-07bb-11e5-821c-8d47d0b898e1.swc?X-Amz-Algorithm=AWS4-HMAC-SHA256&X-Amz-Credential=AKIAISTNZFOVBIJMK3TQ%2F20170125%2Fus-east-1%2Fs3%2Faws4_request&X-Amz-Date=20170125T091156Z&X-Amz-Expires=300&X-Amz-Signature=58cb616a1f2b7ed54cca5cbccba6f2f08b433272d6a3c10f36d7cd53104a5778&X-Amz-SignedHeaders=host&actor_id=0&response-content-disposition=attachment%3B%20filename%3Das3httpclient.swc&response-content-type=application%2Foctet-stream

compile:
    [mxmlc] Loading configuration file C:\Jenkins\workspace\flex-sdk\frameworks\air-config.xml
    [mxmlc] C:\Jenkins\workspace\flex-utilities_installer\flex-installer\build\InstallApacheFlex.swf (1756697 bytes)
    [mxmlc] Picked up JAVA_TOOL_OPTIONS: -Dfile.encoding=UTF8

packageair:
     [echo] Using cert temp.p12
    [mkdir] Created dir: <http://apacheflexbuild.cloudapp.net:8080/job/flex-utilities_installer/ws/flex-installer/deps/as3httpclientlib>
      [get] Getting: https://raw.githubusercontent.com/quetwo/as3httpclient/as3httpclient-work/License.txt
      [get] To: <http://apacheflexbuild.cloudapp.net:8080/job/flex-utilities_installer/ws/flex-installer/deps/as3httpclientlib/License.txt>
    [mkdir] Created dir: <http://apacheflexbuild.cloudapp.net:8080/job/flex-utilities_installer/ws/flex-installer/deps/as3corelib>
      [get] Getting: https://raw.githubusercontent.com/mikechambers/as3corelib/master/README
      [get] To: <http://apacheflexbuild.cloudapp.net:8080/job/flex-utilities_installer/ws/flex-installer/deps/as3corelib/README>

check-as3crypto-license:

get-as3crypto-license:
    [mkdir] Created dir: <http://apacheflexbuild.cloudapp.net:8080/job/flex-utilities_installer/ws/flex-installer/deps/as3crypto/temp>
      [get] Getting: https://storage.googleapis.com/google-code-archive-downloads/v2/code.google.com/as3crypto/Crypto.zip
      [get] To: <http://apacheflexbuild.cloudapp.net:8080/job/flex-utilities_installer/ws/flex-installer/deps/as3crypto/temp/Crypto.zip>
    [unzip] Expanding: <http://apacheflexbuild.cloudapp.net:8080/job/flex-utilities_installer/ws/flex-installer/deps/as3crypto/temp/Crypto.zip> into <http://apacheflexbuild.cloudapp.net:8080/job/flex-utilities_installer/ws/flex-installer/deps/as3crypto>
   [delete] Deleting directory <http://apacheflexbuild.cloudapp.net:8080/job/flex-utilities_installer/ws/flex-installer/deps/as3crypto/temp>

simple-untar-license:
    [mkdir] Created dir: <http://apacheflexbuild.cloudapp.net:8080/job/flex-utilities_installer/ws/flex-installer/deps/as3-simple-untar>
      [get] Getting: https://raw.githubusercontent.com/thdtjsdn/as3-simple-untar/master/src/de/ketzler/utils/SimpleUntar.as
      [get] To: <http://apacheflexbuild.cloudapp.net:8080/job/flex-utilities_installer/ws/flex-installer/deps/as3-simple-untar/LICENSE>
     [java] Could not generate timestamp: Remote host closed connection during handshake
     [java] Picked up JAVA_TOOL_OPTIONS: -Dfile.encoding=UTF8

BUILD FAILED
<http://apacheflexbuild.cloudapp.net:8080/job/flex-utilities_installer/ws/flex-installer/build.xml>:406: Java returned: 10

Total time: 1 minute 43 seconds
Picked up JAVA_TOOL_OPTIONS: -Dfile.encoding=UTF8
Build step 'Invoke Ant' marked build as failure
Archiving artifacts

Build failed in Jenkins: flex-utilities_installer #1081

Posted by fl...@gmail.com.
See <http://apacheflexbuild.cloudapp.net:8080/job/flex-utilities_installer/1081/>

------------------------------------------
Started by timer
Building remotely on flex_sdk_slave2 in workspace <http://apacheflexbuild.cloudapp.net:8080/job/flex-utilities_installer/ws/>
 > C:\Program Files (x86)\Git\cmd\git.exe rev-parse --is-inside-work-tree # timeout=10
Fetching changes from the remote Git repository
 > C:\Program Files (x86)\Git\cmd\git.exe config remote.origin.url https://git-wip-us.apache.org/repos/asf/flex-utilities.git # timeout=10
Fetching upstream changes from https://git-wip-us.apache.org/repos/asf/flex-utilities.git
 > C:\Program Files (x86)\Git\cmd\git.exe --version # timeout=10
 > C:\Program Files (x86)\Git\cmd\git.exe fetch --tags --progress https://git-wip-us.apache.org/repos/asf/flex-utilities.git +refs/heads/*:refs/remotes/origin/*
 > C:\Program Files (x86)\Git\cmd\git.exe rev-parse "origin/develop^{commit}" # timeout=10
Checking out Revision 30ef5fb36374060061739c402f55b3accc7aa019 (origin/develop)
 > C:\Program Files (x86)\Git\cmd\git.exe config core.sparsecheckout # timeout=10
 > C:\Program Files (x86)\Git\cmd\git.exe checkout -f 30ef5fb36374060061739c402f55b3accc7aa019
 > C:\Program Files (x86)\Git\cmd\git.exe rev-list 30ef5fb36374060061739c402f55b3accc7aa019 # timeout=10
[ant_on_air] $ cmd.exe /C "c:\Jenkins\tools\hudson.tasks.Ant_AntInstallation\c_apache-ant-1.9.3\bin\ant.bat -file build.xml -Dplayerglobal.version=11.7 main && exit %%ERRORLEVEL%%"
Buildfile: <http://apacheflexbuild.cloudapp.net:8080/job/flex-utilities_installer/ws/flex-installer/ant_on_air/build.xml>

clean:
   [delete] Deleting directory <http://apacheflexbuild.cloudapp.net:8080/job/flex-utilities_installer/ws/flex-installer/ant_on_air/bin>

init:

check-as3commons.swc:

get-as3commons.swc:

third-party:
      [get] Destination already exists (skipping): <http://apacheflexbuild.cloudapp.net:8080/job/flex-utilities_installer/ws/flex-installer/ant_on_air/external/de/ketzler/utils/SimpleUntar.as>
      [get] Destination already exists (skipping): <http://apacheflexbuild.cloudapp.net:8080/job/flex-utilities_installer/ws/flex-installer/ant_on_air/external/de/ketzler/utils/untar/UntarFileInfo.as>
      [get] Destination already exists (skipping): <http://apacheflexbuild.cloudapp.net:8080/job/flex-utilities_installer/ws/flex-installer/ant_on_air/external/de/ketzler/utils/untar/UntarHeaderBlock.as>
      [get] Destination already exists (skipping): <http://apacheflexbuild.cloudapp.net:8080/job/flex-utilities_installer/ws/flex-installer/ant_on_air/external/com/probertson/utils/CRC32Generator.as>
      [get] Destination already exists (skipping): <http://apacheflexbuild.cloudapp.net:8080/job/flex-utilities_installer/ws/flex-installer/ant_on_air/external/com/probertson/utils/GZIPBytesEncoder.as>
      [get] Destination already exists (skipping): <http://apacheflexbuild.cloudapp.net:8080/job/flex-utilities_installer/ws/flex-installer/ant_on_air/external/com/probertson/utils/GZIPEncoder.as>
      [get] Destination already exists (skipping): <http://apacheflexbuild.cloudapp.net:8080/job/flex-utilities_installer/ws/flex-installer/ant_on_air/external/com/probertson/utils/GZIPFile.as>

compile:
    [compc] Loading configuration file C:\Jenkins\workspace\flex-sdk\frameworks\air-config.xml
    [compc] Picked up JAVA_TOOL_OPTIONS: -Dfile.encoding=UTF8
    [compc] C:\Jenkins\workspace\flex-utilities_installer\flex-installer\ant_on_air\bin\ant_on_air.swc (134439 bytes)

test:
    [mxmlc] Loading configuration file C:\Jenkins\workspace\flex-sdk\frameworks\air-config.xml
    [mxmlc] C:\Jenkins\workspace\flex-utilities_installer\flex-installer\ant_on_air\tests\AntOnAir.swf (1147464 bytes)
    [mxmlc] Picked up JAVA_TOOL_OPTIONS: -Dfile.encoding=UTF8

failuretests:

main:

BUILD SUCCESSFUL
Total time: 1 minute 27 seconds
Picked up JAVA_TOOL_OPTIONS: -Dfile.encoding=UTF8
[flex-installer] $ cmd.exe /C "c:\Jenkins\tools\hudson.tasks.Ant_AntInstallation\c_apache-ant-1.9.3\bin\ant.bat -file build.xml -Dplayerglobal.version=11.7 clean build source-package create-md5s copy-misc && exit %%ERRORLEVEL%%"
Buildfile: <http://apacheflexbuild.cloudapp.net:8080/job/flex-utilities_installer/ws/flex-installer/build.xml>

clean:
   [delete] Deleting directory <http://apacheflexbuild.cloudapp.net:8080/job/flex-utilities_installer/ws/flex-installer/build>
   [delete] Deleting directory <http://apacheflexbuild.cloudapp.net:8080/job/flex-utilities_installer/ws/flex-installer/deps>
   [delete] Deleting directory <http://apacheflexbuild.cloudapp.net:8080/job/flex-utilities_installer/ws/flex-installer/installer/libs>
   [delete] Deleting directory <http://apacheflexbuild.cloudapp.net:8080/job/flex-utilities_installer/ws/flex-installer/release>

clean:

createDirs:
     [echo] ***************************************
     [echo] Execute the update-version target once,
     [echo] and only once, when you modifiy this app.
     [echo] This will increment the version number to allow
     [echo] the app to be updated by the AIR installer.
     [echo] ***************************************
     [echo]         
    [mkdir] Created dir: <http://apacheflexbuild.cloudapp.net:8080/job/flex-utilities_installer/ws/flex-installer/build>
    [mkdir] Created dir: <http://apacheflexbuild.cloudapp.net:8080/job/flex-utilities_installer/ws/flex-installer/release>

update-version-in-xml-files:
     [echo] version in InstallApacheFlex-app.xml will be 3.3.0

init:

certificate:

generate-certificate:
     [echo] Using cert temp.p12
     [java] Picked up JAVA_TOOL_OPTIONS: -Dfile.encoding=UTF8

check-as3commons.swc:

get-as3commons.swc:
    [mkdir] Created dir: <http://apacheflexbuild.cloudapp.net:8080/job/flex-utilities_installer/ws/flex-installer/installer/libs>
      [get] Getting: https://github.com/bigosmallm/MakeApacheFlexForFlashBuilder/blob/master/libs/as3commons-zip-1.0.0-alpha.1.swc?raw=true
      [get] To: <http://apacheflexbuild.cloudapp.net:8080/job/flex-utilities_installer/ws/flex-installer/installer/libs/as3commons-zip-1.0.0-alpha.1.swc>
      [get] https://github.com/bigosmallm/MakeApacheFlexForFlashBuilder/blob/master/libs/as3commons-zip-1.0.0-alpha.1.swc?raw=true moved to https://github.com/bigosmallm/MakeApacheFlexForFlashBuilder/raw/master/libs/as3commons-zip-1.0.0-alpha.1.swc
      [get] https://github.com/bigosmallm/MakeApacheFlexForFlashBuilder/raw/master/libs/as3commons-zip-1.0.0-alpha.1.swc moved to https://raw.githubusercontent.com/bigosmallm/MakeApacheFlexForFlashBuilder/master/libs/as3commons-zip-1.0.0-alpha.1.swc
      [get] .......

check-as3httpclient.swc:

get-as3httpclient.swc:
    [mkdir] Created dir: <http://apacheflexbuild.cloudapp.net:8080/job/flex-utilities_installer/ws/flex-installer/installer/libs/temp>
      [get] Getting: https://github.com/quetwo/as3httpclient/releases/download/1.0/as3httpclient.swc
      [get] To: <http://apacheflexbuild.cloudapp.net:8080/job/flex-utilities_installer/ws/flex-installer/installer/libs/as3httpclient.swc>
      [get] https://github.com/quetwo/as3httpclient/releases/download/1.0/as3httpclient.swc moved to https://github-cloud.s3.amazonaws.com/releases/36265618/8d35f30e-07bb-11e5-821c-8d47d0b898e1.swc?X-Amz-Algorithm=AWS4-HMAC-SHA256&X-Amz-Credential=AKIAISTNZFOVBIJMK3TQ%2F20170203%2Fus-east-1%2Fs3%2Faws4_request&X-Amz-Date=20170203T091118Z&X-Amz-Expires=300&X-Amz-Signature=30d2f4ef26b69769fad6c240a170ad8b31fc593de1f375c479135de5f5aa7fcc&X-Amz-SignedHeaders=host&actor_id=0&response-content-disposition=attachment%3B%20filename%3Das3httpclient.swc&response-content-type=application%2Foctet-stream

compile:
    [mxmlc] Loading configuration file C:\Jenkins\workspace\flex-sdk\frameworks\air-config.xml
    [mxmlc] C:\Jenkins\workspace\flex-utilities_installer\flex-installer\build\InstallApacheFlex.swf (1756699 bytes)
    [mxmlc] Picked up JAVA_TOOL_OPTIONS: -Dfile.encoding=UTF8

packageair:
     [echo] Using cert temp.p12
    [mkdir] Created dir: <http://apacheflexbuild.cloudapp.net:8080/job/flex-utilities_installer/ws/flex-installer/deps/as3httpclientlib>
      [get] Getting: https://raw.githubusercontent.com/quetwo/as3httpclient/as3httpclient-work/License.txt
      [get] To: <http://apacheflexbuild.cloudapp.net:8080/job/flex-utilities_installer/ws/flex-installer/deps/as3httpclientlib/License.txt>
    [mkdir] Created dir: <http://apacheflexbuild.cloudapp.net:8080/job/flex-utilities_installer/ws/flex-installer/deps/as3corelib>
      [get] Getting: https://raw.githubusercontent.com/mikechambers/as3corelib/master/README
      [get] To: <http://apacheflexbuild.cloudapp.net:8080/job/flex-utilities_installer/ws/flex-installer/deps/as3corelib/README>

check-as3crypto-license:

get-as3crypto-license:
    [mkdir] Created dir: <http://apacheflexbuild.cloudapp.net:8080/job/flex-utilities_installer/ws/flex-installer/deps/as3crypto/temp>
      [get] Getting: https://storage.googleapis.com/google-code-archive-downloads/v2/code.google.com/as3crypto/Crypto.zip
      [get] To: <http://apacheflexbuild.cloudapp.net:8080/job/flex-utilities_installer/ws/flex-installer/deps/as3crypto/temp/Crypto.zip>
    [unzip] Expanding: <http://apacheflexbuild.cloudapp.net:8080/job/flex-utilities_installer/ws/flex-installer/deps/as3crypto/temp/Crypto.zip> into <http://apacheflexbuild.cloudapp.net:8080/job/flex-utilities_installer/ws/flex-installer/deps/as3crypto>
   [delete] Deleting directory <http://apacheflexbuild.cloudapp.net:8080/job/flex-utilities_installer/ws/flex-installer/deps/as3crypto/temp>

simple-untar-license:
    [mkdir] Created dir: <http://apacheflexbuild.cloudapp.net:8080/job/flex-utilities_installer/ws/flex-installer/deps/as3-simple-untar>
      [get] Getting: https://raw.githubusercontent.com/thdtjsdn/as3-simple-untar/master/src/de/ketzler/utils/SimpleUntar.as
      [get] To: <http://apacheflexbuild.cloudapp.net:8080/job/flex-utilities_installer/ws/flex-installer/deps/as3-simple-untar/LICENSE>
     [java] Could not generate timestamp: Remote host closed connection during handshake
     [java] Picked up JAVA_TOOL_OPTIONS: -Dfile.encoding=UTF8

BUILD FAILED
<http://apacheflexbuild.cloudapp.net:8080/job/flex-utilities_installer/ws/flex-installer/build.xml>:406: Java returned: 10

Total time: 1 minute 43 seconds
Picked up JAVA_TOOL_OPTIONS: -Dfile.encoding=UTF8
Build step 'Invoke Ant' marked build as failure
Archiving artifacts

Build failed in Jenkins: flex-utilities_installer #1080

Posted by fl...@gmail.com.
See <http://apacheflexbuild.cloudapp.net:8080/job/flex-utilities_installer/1080/>

------------------------------------------
Started by timer
Building remotely on flex_sdk_slave2 in workspace <http://apacheflexbuild.cloudapp.net:8080/job/flex-utilities_installer/ws/>
 > C:\Program Files (x86)\Git\cmd\git.exe rev-parse --is-inside-work-tree # timeout=10
Fetching changes from the remote Git repository
 > C:\Program Files (x86)\Git\cmd\git.exe config remote.origin.url https://git-wip-us.apache.org/repos/asf/flex-utilities.git # timeout=10
Fetching upstream changes from https://git-wip-us.apache.org/repos/asf/flex-utilities.git
 > C:\Program Files (x86)\Git\cmd\git.exe --version # timeout=10
 > C:\Program Files (x86)\Git\cmd\git.exe fetch --tags --progress https://git-wip-us.apache.org/repos/asf/flex-utilities.git +refs/heads/*:refs/remotes/origin/*
 > C:\Program Files (x86)\Git\cmd\git.exe rev-parse "origin/develop^{commit}" # timeout=10
Checking out Revision 30ef5fb36374060061739c402f55b3accc7aa019 (origin/develop)
 > C:\Program Files (x86)\Git\cmd\git.exe config core.sparsecheckout # timeout=10
 > C:\Program Files (x86)\Git\cmd\git.exe checkout -f 30ef5fb36374060061739c402f55b3accc7aa019
 > C:\Program Files (x86)\Git\cmd\git.exe rev-list 30ef5fb36374060061739c402f55b3accc7aa019 # timeout=10
[ant_on_air] $ cmd.exe /C "c:\Jenkins\tools\hudson.tasks.Ant_AntInstallation\c_apache-ant-1.9.3\bin\ant.bat -file build.xml -Dplayerglobal.version=11.7 main && exit %%ERRORLEVEL%%"
Buildfile: <http://apacheflexbuild.cloudapp.net:8080/job/flex-utilities_installer/ws/flex-installer/ant_on_air/build.xml>

clean:
   [delete] Deleting directory <http://apacheflexbuild.cloudapp.net:8080/job/flex-utilities_installer/ws/flex-installer/ant_on_air/bin>

init:

check-as3commons.swc:

get-as3commons.swc:

third-party:
      [get] Destination already exists (skipping): <http://apacheflexbuild.cloudapp.net:8080/job/flex-utilities_installer/ws/flex-installer/ant_on_air/external/de/ketzler/utils/SimpleUntar.as>
      [get] Destination already exists (skipping): <http://apacheflexbuild.cloudapp.net:8080/job/flex-utilities_installer/ws/flex-installer/ant_on_air/external/de/ketzler/utils/untar/UntarFileInfo.as>
      [get] Destination already exists (skipping): <http://apacheflexbuild.cloudapp.net:8080/job/flex-utilities_installer/ws/flex-installer/ant_on_air/external/de/ketzler/utils/untar/UntarHeaderBlock.as>
      [get] Destination already exists (skipping): <http://apacheflexbuild.cloudapp.net:8080/job/flex-utilities_installer/ws/flex-installer/ant_on_air/external/com/probertson/utils/CRC32Generator.as>
      [get] Destination already exists (skipping): <http://apacheflexbuild.cloudapp.net:8080/job/flex-utilities_installer/ws/flex-installer/ant_on_air/external/com/probertson/utils/GZIPBytesEncoder.as>
      [get] Destination already exists (skipping): <http://apacheflexbuild.cloudapp.net:8080/job/flex-utilities_installer/ws/flex-installer/ant_on_air/external/com/probertson/utils/GZIPEncoder.as>
      [get] Destination already exists (skipping): <http://apacheflexbuild.cloudapp.net:8080/job/flex-utilities_installer/ws/flex-installer/ant_on_air/external/com/probertson/utils/GZIPFile.as>

compile:
    [compc] Loading configuration file C:\Jenkins\workspace\flex-sdk\frameworks\air-config.xml
    [compc] Picked up JAVA_TOOL_OPTIONS: -Dfile.encoding=UTF8
    [compc] C:\Jenkins\workspace\flex-utilities_installer\flex-installer\ant_on_air\bin\ant_on_air.swc (134455 bytes)

test:
    [mxmlc] Loading configuration file C:\Jenkins\workspace\flex-sdk\frameworks\air-config.xml
    [mxmlc] C:\Jenkins\workspace\flex-utilities_installer\flex-installer\ant_on_air\tests\AntOnAir.swf (1147458 bytes)
    [mxmlc] Picked up JAVA_TOOL_OPTIONS: -Dfile.encoding=UTF8

failuretests:

main:

BUILD SUCCESSFUL
Total time: 1 minute 27 seconds
Picked up JAVA_TOOL_OPTIONS: -Dfile.encoding=UTF8
[flex-installer] $ cmd.exe /C "c:\Jenkins\tools\hudson.tasks.Ant_AntInstallation\c_apache-ant-1.9.3\bin\ant.bat -file build.xml -Dplayerglobal.version=11.7 clean build source-package create-md5s copy-misc && exit %%ERRORLEVEL%%"
Buildfile: <http://apacheflexbuild.cloudapp.net:8080/job/flex-utilities_installer/ws/flex-installer/build.xml>

clean:
   [delete] Deleting directory <http://apacheflexbuild.cloudapp.net:8080/job/flex-utilities_installer/ws/flex-installer/build>
   [delete] Deleting directory <http://apacheflexbuild.cloudapp.net:8080/job/flex-utilities_installer/ws/flex-installer/deps>
   [delete] Deleting directory <http://apacheflexbuild.cloudapp.net:8080/job/flex-utilities_installer/ws/flex-installer/installer/libs>
   [delete] Deleting directory <http://apacheflexbuild.cloudapp.net:8080/job/flex-utilities_installer/ws/flex-installer/release>

clean:

createDirs:
     [echo] ***************************************
     [echo] Execute the update-version target once,
     [echo] and only once, when you modifiy this app.
     [echo] This will increment the version number to allow
     [echo] the app to be updated by the AIR installer.
     [echo] ***************************************
     [echo]         
    [mkdir] Created dir: <http://apacheflexbuild.cloudapp.net:8080/job/flex-utilities_installer/ws/flex-installer/build>
    [mkdir] Created dir: <http://apacheflexbuild.cloudapp.net:8080/job/flex-utilities_installer/ws/flex-installer/release>

update-version-in-xml-files:
     [echo] version in InstallApacheFlex-app.xml will be 3.3.0

init:

certificate:

generate-certificate:
     [echo] Using cert temp.p12
     [java] Picked up JAVA_TOOL_OPTIONS: -Dfile.encoding=UTF8

check-as3commons.swc:

get-as3commons.swc:
    [mkdir] Created dir: <http://apacheflexbuild.cloudapp.net:8080/job/flex-utilities_installer/ws/flex-installer/installer/libs>
      [get] Getting: https://github.com/bigosmallm/MakeApacheFlexForFlashBuilder/blob/master/libs/as3commons-zip-1.0.0-alpha.1.swc?raw=true
      [get] To: <http://apacheflexbuild.cloudapp.net:8080/job/flex-utilities_installer/ws/flex-installer/installer/libs/as3commons-zip-1.0.0-alpha.1.swc>
      [get] https://github.com/bigosmallm/MakeApacheFlexForFlashBuilder/blob/master/libs/as3commons-zip-1.0.0-alpha.1.swc?raw=true moved to https://github.com/bigosmallm/MakeApacheFlexForFlashBuilder/raw/master/libs/as3commons-zip-1.0.0-alpha.1.swc
      [get] https://github.com/bigosmallm/MakeApacheFlexForFlashBuilder/raw/master/libs/as3commons-zip-1.0.0-alpha.1.swc moved to https://raw.githubusercontent.com/bigosmallm/MakeApacheFlexForFlashBuilder/master/libs/as3commons-zip-1.0.0-alpha.1.swc
      [get] .......

check-as3httpclient.swc:

get-as3httpclient.swc:
    [mkdir] Created dir: <http://apacheflexbuild.cloudapp.net:8080/job/flex-utilities_installer/ws/flex-installer/installer/libs/temp>
      [get] Getting: https://github.com/quetwo/as3httpclient/releases/download/1.0/as3httpclient.swc
      [get] To: <http://apacheflexbuild.cloudapp.net:8080/job/flex-utilities_installer/ws/flex-installer/installer/libs/as3httpclient.swc>
      [get] https://github.com/quetwo/as3httpclient/releases/download/1.0/as3httpclient.swc moved to https://github-cloud.s3.amazonaws.com/releases/36265618/8d35f30e-07bb-11e5-821c-8d47d0b898e1.swc?X-Amz-Algorithm=AWS4-HMAC-SHA256&X-Amz-Credential=AKIAISTNZFOVBIJMK3TQ%2F20170202%2Fus-east-1%2Fs3%2Faws4_request&X-Amz-Date=20170202T091115Z&X-Amz-Expires=300&X-Amz-Signature=67326ec88f0cdeaa1895683f7f6598782fc078842967cab41baf8b9c71da11fd&X-Amz-SignedHeaders=host&actor_id=0&response-content-disposition=attachment%3B%20filename%3Das3httpclient.swc&response-content-type=application%2Foctet-stream

compile:
    [mxmlc] Loading configuration file C:\Jenkins\workspace\flex-sdk\frameworks\air-config.xml
    [mxmlc] C:\Jenkins\workspace\flex-utilities_installer\flex-installer\build\InstallApacheFlex.swf (1756691 bytes)
    [mxmlc] Picked up JAVA_TOOL_OPTIONS: -Dfile.encoding=UTF8

packageair:
     [echo] Using cert temp.p12
    [mkdir] Created dir: <http://apacheflexbuild.cloudapp.net:8080/job/flex-utilities_installer/ws/flex-installer/deps/as3httpclientlib>
      [get] Getting: https://raw.githubusercontent.com/quetwo/as3httpclient/as3httpclient-work/License.txt
      [get] To: <http://apacheflexbuild.cloudapp.net:8080/job/flex-utilities_installer/ws/flex-installer/deps/as3httpclientlib/License.txt>
    [mkdir] Created dir: <http://apacheflexbuild.cloudapp.net:8080/job/flex-utilities_installer/ws/flex-installer/deps/as3corelib>
      [get] Getting: https://raw.githubusercontent.com/mikechambers/as3corelib/master/README
      [get] To: <http://apacheflexbuild.cloudapp.net:8080/job/flex-utilities_installer/ws/flex-installer/deps/as3corelib/README>

check-as3crypto-license:

get-as3crypto-license:
    [mkdir] Created dir: <http://apacheflexbuild.cloudapp.net:8080/job/flex-utilities_installer/ws/flex-installer/deps/as3crypto/temp>
      [get] Getting: https://storage.googleapis.com/google-code-archive-downloads/v2/code.google.com/as3crypto/Crypto.zip
      [get] To: <http://apacheflexbuild.cloudapp.net:8080/job/flex-utilities_installer/ws/flex-installer/deps/as3crypto/temp/Crypto.zip>
    [unzip] Expanding: <http://apacheflexbuild.cloudapp.net:8080/job/flex-utilities_installer/ws/flex-installer/deps/as3crypto/temp/Crypto.zip> into <http://apacheflexbuild.cloudapp.net:8080/job/flex-utilities_installer/ws/flex-installer/deps/as3crypto>
   [delete] Deleting directory <http://apacheflexbuild.cloudapp.net:8080/job/flex-utilities_installer/ws/flex-installer/deps/as3crypto/temp>

simple-untar-license:
    [mkdir] Created dir: <http://apacheflexbuild.cloudapp.net:8080/job/flex-utilities_installer/ws/flex-installer/deps/as3-simple-untar>
      [get] Getting: https://raw.githubusercontent.com/thdtjsdn/as3-simple-untar/master/src/de/ketzler/utils/SimpleUntar.as
      [get] To: <http://apacheflexbuild.cloudapp.net:8080/job/flex-utilities_installer/ws/flex-installer/deps/as3-simple-untar/LICENSE>
     [java] Could not generate timestamp: Remote host closed connection during handshake
     [java] Picked up JAVA_TOOL_OPTIONS: -Dfile.encoding=UTF8

BUILD FAILED
<http://apacheflexbuild.cloudapp.net:8080/job/flex-utilities_installer/ws/flex-installer/build.xml>:406: Java returned: 10

Total time: 1 minute 39 seconds
Picked up JAVA_TOOL_OPTIONS: -Dfile.encoding=UTF8
Build step 'Invoke Ant' marked build as failure
Archiving artifacts

Build failed in Jenkins: flex-utilities_installer #1079

Posted by fl...@gmail.com.
See <http://apacheflexbuild.cloudapp.net:8080/job/flex-utilities_installer/1079/>

------------------------------------------
Started by timer
Building remotely on flex_sdk_slave2 in workspace <http://apacheflexbuild.cloudapp.net:8080/job/flex-utilities_installer/ws/>
 > C:\Program Files (x86)\Git\cmd\git.exe rev-parse --is-inside-work-tree # timeout=10
Fetching changes from the remote Git repository
 > C:\Program Files (x86)\Git\cmd\git.exe config remote.origin.url https://git-wip-us.apache.org/repos/asf/flex-utilities.git # timeout=10
Fetching upstream changes from https://git-wip-us.apache.org/repos/asf/flex-utilities.git
 > C:\Program Files (x86)\Git\cmd\git.exe --version # timeout=10
 > C:\Program Files (x86)\Git\cmd\git.exe fetch --tags --progress https://git-wip-us.apache.org/repos/asf/flex-utilities.git +refs/heads/*:refs/remotes/origin/*
 > C:\Program Files (x86)\Git\cmd\git.exe rev-parse "origin/develop^{commit}" # timeout=10
Checking out Revision 30ef5fb36374060061739c402f55b3accc7aa019 (origin/develop)
 > C:\Program Files (x86)\Git\cmd\git.exe config core.sparsecheckout # timeout=10
 > C:\Program Files (x86)\Git\cmd\git.exe checkout -f 30ef5fb36374060061739c402f55b3accc7aa019
 > C:\Program Files (x86)\Git\cmd\git.exe rev-list 30ef5fb36374060061739c402f55b3accc7aa019 # timeout=10
[ant_on_air] $ cmd.exe /C "c:\Jenkins\tools\hudson.tasks.Ant_AntInstallation\c_apache-ant-1.9.3\bin\ant.bat -file build.xml -Dplayerglobal.version=11.7 main && exit %%ERRORLEVEL%%"
Buildfile: <http://apacheflexbuild.cloudapp.net:8080/job/flex-utilities_installer/ws/flex-installer/ant_on_air/build.xml>

clean:
   [delete] Deleting directory <http://apacheflexbuild.cloudapp.net:8080/job/flex-utilities_installer/ws/flex-installer/ant_on_air/bin>

init:

check-as3commons.swc:

get-as3commons.swc:

third-party:
      [get] Destination already exists (skipping): <http://apacheflexbuild.cloudapp.net:8080/job/flex-utilities_installer/ws/flex-installer/ant_on_air/external/de/ketzler/utils/SimpleUntar.as>
      [get] Destination already exists (skipping): <http://apacheflexbuild.cloudapp.net:8080/job/flex-utilities_installer/ws/flex-installer/ant_on_air/external/de/ketzler/utils/untar/UntarFileInfo.as>
      [get] Destination already exists (skipping): <http://apacheflexbuild.cloudapp.net:8080/job/flex-utilities_installer/ws/flex-installer/ant_on_air/external/de/ketzler/utils/untar/UntarHeaderBlock.as>
      [get] Destination already exists (skipping): <http://apacheflexbuild.cloudapp.net:8080/job/flex-utilities_installer/ws/flex-installer/ant_on_air/external/com/probertson/utils/CRC32Generator.as>
      [get] Destination already exists (skipping): <http://apacheflexbuild.cloudapp.net:8080/job/flex-utilities_installer/ws/flex-installer/ant_on_air/external/com/probertson/utils/GZIPBytesEncoder.as>
      [get] Destination already exists (skipping): <http://apacheflexbuild.cloudapp.net:8080/job/flex-utilities_installer/ws/flex-installer/ant_on_air/external/com/probertson/utils/GZIPEncoder.as>
      [get] Destination already exists (skipping): <http://apacheflexbuild.cloudapp.net:8080/job/flex-utilities_installer/ws/flex-installer/ant_on_air/external/com/probertson/utils/GZIPFile.as>

compile:
    [compc] Loading configuration file C:\Jenkins\workspace\flex-sdk\frameworks\air-config.xml
    [compc] Picked up JAVA_TOOL_OPTIONS: -Dfile.encoding=UTF8
    [compc] C:\Jenkins\workspace\flex-utilities_installer\flex-installer\ant_on_air\bin\ant_on_air.swc (134446 bytes)

test:
    [mxmlc] Loading configuration file C:\Jenkins\workspace\flex-sdk\frameworks\air-config.xml
    [mxmlc] Picked up JAVA_TOOL_OPTIONS: -Dfile.encoding=UTF8
    [mxmlc] C:\Jenkins\workspace\flex-utilities_installer\flex-installer\ant_on_air\tests\AntOnAir.swf (1147457 bytes)

failuretests:

main:

BUILD SUCCESSFUL
Total time: 1 minute 28 seconds
Picked up JAVA_TOOL_OPTIONS: -Dfile.encoding=UTF8
[flex-installer] $ cmd.exe /C "c:\Jenkins\tools\hudson.tasks.Ant_AntInstallation\c_apache-ant-1.9.3\bin\ant.bat -file build.xml -Dplayerglobal.version=11.7 clean build source-package create-md5s copy-misc && exit %%ERRORLEVEL%%"
Buildfile: <http://apacheflexbuild.cloudapp.net:8080/job/flex-utilities_installer/ws/flex-installer/build.xml>

clean:
   [delete] Deleting directory <http://apacheflexbuild.cloudapp.net:8080/job/flex-utilities_installer/ws/flex-installer/build>
   [delete] Deleting directory <http://apacheflexbuild.cloudapp.net:8080/job/flex-utilities_installer/ws/flex-installer/deps>
   [delete] Deleting directory <http://apacheflexbuild.cloudapp.net:8080/job/flex-utilities_installer/ws/flex-installer/installer/libs>
   [delete] Deleting directory <http://apacheflexbuild.cloudapp.net:8080/job/flex-utilities_installer/ws/flex-installer/release>

clean:

createDirs:
     [echo] ***************************************
     [echo] Execute the update-version target once,
     [echo] and only once, when you modifiy this app.
     [echo] This will increment the version number to allow
     [echo] the app to be updated by the AIR installer.
     [echo] ***************************************
     [echo]         
    [mkdir] Created dir: <http://apacheflexbuild.cloudapp.net:8080/job/flex-utilities_installer/ws/flex-installer/build>
    [mkdir] Created dir: <http://apacheflexbuild.cloudapp.net:8080/job/flex-utilities_installer/ws/flex-installer/release>

update-version-in-xml-files:
     [echo] version in InstallApacheFlex-app.xml will be 3.3.0

init:

certificate:

generate-certificate:
     [echo] Using cert temp.p12
     [java] Picked up JAVA_TOOL_OPTIONS: -Dfile.encoding=UTF8

check-as3commons.swc:

get-as3commons.swc:
    [mkdir] Created dir: <http://apacheflexbuild.cloudapp.net:8080/job/flex-utilities_installer/ws/flex-installer/installer/libs>
      [get] Getting: https://github.com/bigosmallm/MakeApacheFlexForFlashBuilder/blob/master/libs/as3commons-zip-1.0.0-alpha.1.swc?raw=true
      [get] To: <http://apacheflexbuild.cloudapp.net:8080/job/flex-utilities_installer/ws/flex-installer/installer/libs/as3commons-zip-1.0.0-alpha.1.swc>
      [get] https://github.com/bigosmallm/MakeApacheFlexForFlashBuilder/blob/master/libs/as3commons-zip-1.0.0-alpha.1.swc?raw=true moved to https://github.com/bigosmallm/MakeApacheFlexForFlashBuilder/raw/master/libs/as3commons-zip-1.0.0-alpha.1.swc
      [get] https://github.com/bigosmallm/MakeApacheFlexForFlashBuilder/raw/master/libs/as3commons-zip-1.0.0-alpha.1.swc moved to https://raw.githubusercontent.com/bigosmallm/MakeApacheFlexForFlashBuilder/master/libs/as3commons-zip-1.0.0-alpha.1.swc
      [get] .......

check-as3httpclient.swc:

get-as3httpclient.swc:
    [mkdir] Created dir: <http://apacheflexbuild.cloudapp.net:8080/job/flex-utilities_installer/ws/flex-installer/installer/libs/temp>
      [get] Getting: https://github.com/quetwo/as3httpclient/releases/download/1.0/as3httpclient.swc
      [get] To: <http://apacheflexbuild.cloudapp.net:8080/job/flex-utilities_installer/ws/flex-installer/installer/libs/as3httpclient.swc>
      [get] https://github.com/quetwo/as3httpclient/releases/download/1.0/as3httpclient.swc moved to https://github-cloud.s3.amazonaws.com/releases/36265618/8d35f30e-07bb-11e5-821c-8d47d0b898e1.swc?X-Amz-Algorithm=AWS4-HMAC-SHA256&X-Amz-Credential=AKIAISTNZFOVBIJMK3TQ%2F20170201%2Fus-east-1%2Fs3%2Faws4_request&X-Amz-Date=20170201T091124Z&X-Amz-Expires=300&X-Amz-Signature=c462fb962e2202b3073b88bd946ac5860fb89aa98a3ced6e295135fced71bf7d&X-Amz-SignedHeaders=host&actor_id=0&response-content-disposition=attachment%3B%20filename%3Das3httpclient.swc&response-content-type=application%2Foctet-stream

compile:
    [mxmlc] Loading configuration file C:\Jenkins\workspace\flex-sdk\frameworks\air-config.xml
    [mxmlc] C:\Jenkins\workspace\flex-utilities_installer\flex-installer\build\InstallApacheFlex.swf (1756691 bytes)
    [mxmlc] Picked up JAVA_TOOL_OPTIONS: -Dfile.encoding=UTF8

packageair:
     [echo] Using cert temp.p12
    [mkdir] Created dir: <http://apacheflexbuild.cloudapp.net:8080/job/flex-utilities_installer/ws/flex-installer/deps/as3httpclientlib>
      [get] Getting: https://raw.githubusercontent.com/quetwo/as3httpclient/as3httpclient-work/License.txt
      [get] To: <http://apacheflexbuild.cloudapp.net:8080/job/flex-utilities_installer/ws/flex-installer/deps/as3httpclientlib/License.txt>
    [mkdir] Created dir: <http://apacheflexbuild.cloudapp.net:8080/job/flex-utilities_installer/ws/flex-installer/deps/as3corelib>
      [get] Getting: https://raw.githubusercontent.com/mikechambers/as3corelib/master/README
      [get] To: <http://apacheflexbuild.cloudapp.net:8080/job/flex-utilities_installer/ws/flex-installer/deps/as3corelib/README>

check-as3crypto-license:

get-as3crypto-license:
    [mkdir] Created dir: <http://apacheflexbuild.cloudapp.net:8080/job/flex-utilities_installer/ws/flex-installer/deps/as3crypto/temp>
      [get] Getting: https://storage.googleapis.com/google-code-archive-downloads/v2/code.google.com/as3crypto/Crypto.zip
      [get] To: <http://apacheflexbuild.cloudapp.net:8080/job/flex-utilities_installer/ws/flex-installer/deps/as3crypto/temp/Crypto.zip>
    [unzip] Expanding: <http://apacheflexbuild.cloudapp.net:8080/job/flex-utilities_installer/ws/flex-installer/deps/as3crypto/temp/Crypto.zip> into <http://apacheflexbuild.cloudapp.net:8080/job/flex-utilities_installer/ws/flex-installer/deps/as3crypto>
   [delete] Deleting directory <http://apacheflexbuild.cloudapp.net:8080/job/flex-utilities_installer/ws/flex-installer/deps/as3crypto/temp>

simple-untar-license:
    [mkdir] Created dir: <http://apacheflexbuild.cloudapp.net:8080/job/flex-utilities_installer/ws/flex-installer/deps/as3-simple-untar>
      [get] Getting: https://raw.githubusercontent.com/thdtjsdn/as3-simple-untar/master/src/de/ketzler/utils/SimpleUntar.as
      [get] To: <http://apacheflexbuild.cloudapp.net:8080/job/flex-utilities_installer/ws/flex-installer/deps/as3-simple-untar/LICENSE>
     [java] Could not generate timestamp: Remote host closed connection during handshake
     [java] Picked up JAVA_TOOL_OPTIONS: -Dfile.encoding=UTF8

BUILD FAILED
<http://apacheflexbuild.cloudapp.net:8080/job/flex-utilities_installer/ws/flex-installer/build.xml>:406: Java returned: 10

Total time: 1 minute 42 seconds
Picked up JAVA_TOOL_OPTIONS: -Dfile.encoding=UTF8
Build step 'Invoke Ant' marked build as failure
Archiving artifacts

Build failed in Jenkins: flex-utilities_installer #1078

Posted by fl...@gmail.com.
See <http://apacheflexbuild.cloudapp.net:8080/job/flex-utilities_installer/1078/>

------------------------------------------
Started by timer
Building remotely on flex_sdk_slave2 in workspace <http://apacheflexbuild.cloudapp.net:8080/job/flex-utilities_installer/ws/>
 > C:\Program Files (x86)\Git\cmd\git.exe rev-parse --is-inside-work-tree # timeout=10
Fetching changes from the remote Git repository
 > C:\Program Files (x86)\Git\cmd\git.exe config remote.origin.url https://git-wip-us.apache.org/repos/asf/flex-utilities.git # timeout=10
Fetching upstream changes from https://git-wip-us.apache.org/repos/asf/flex-utilities.git
 > C:\Program Files (x86)\Git\cmd\git.exe --version # timeout=10
 > C:\Program Files (x86)\Git\cmd\git.exe fetch --tags --progress https://git-wip-us.apache.org/repos/asf/flex-utilities.git +refs/heads/*:refs/remotes/origin/*
 > C:\Program Files (x86)\Git\cmd\git.exe rev-parse "origin/develop^{commit}" # timeout=10
Checking out Revision 30ef5fb36374060061739c402f55b3accc7aa019 (origin/develop)
 > C:\Program Files (x86)\Git\cmd\git.exe config core.sparsecheckout # timeout=10
 > C:\Program Files (x86)\Git\cmd\git.exe checkout -f 30ef5fb36374060061739c402f55b3accc7aa019
 > C:\Program Files (x86)\Git\cmd\git.exe rev-list 30ef5fb36374060061739c402f55b3accc7aa019 # timeout=10
[ant_on_air] $ cmd.exe /C "c:\Jenkins\tools\hudson.tasks.Ant_AntInstallation\c_apache-ant-1.9.3\bin\ant.bat -file build.xml -Dplayerglobal.version=11.7 main && exit %%ERRORLEVEL%%"
Buildfile: <http://apacheflexbuild.cloudapp.net:8080/job/flex-utilities_installer/ws/flex-installer/ant_on_air/build.xml>

clean:
   [delete] Deleting directory <http://apacheflexbuild.cloudapp.net:8080/job/flex-utilities_installer/ws/flex-installer/ant_on_air/bin>

init:

check-as3commons.swc:

get-as3commons.swc:

third-party:
      [get] Destination already exists (skipping): <http://apacheflexbuild.cloudapp.net:8080/job/flex-utilities_installer/ws/flex-installer/ant_on_air/external/de/ketzler/utils/SimpleUntar.as>
      [get] Destination already exists (skipping): <http://apacheflexbuild.cloudapp.net:8080/job/flex-utilities_installer/ws/flex-installer/ant_on_air/external/de/ketzler/utils/untar/UntarFileInfo.as>
      [get] Destination already exists (skipping): <http://apacheflexbuild.cloudapp.net:8080/job/flex-utilities_installer/ws/flex-installer/ant_on_air/external/de/ketzler/utils/untar/UntarHeaderBlock.as>
      [get] Destination already exists (skipping): <http://apacheflexbuild.cloudapp.net:8080/job/flex-utilities_installer/ws/flex-installer/ant_on_air/external/com/probertson/utils/CRC32Generator.as>
      [get] Destination already exists (skipping): <http://apacheflexbuild.cloudapp.net:8080/job/flex-utilities_installer/ws/flex-installer/ant_on_air/external/com/probertson/utils/GZIPBytesEncoder.as>
      [get] Destination already exists (skipping): <http://apacheflexbuild.cloudapp.net:8080/job/flex-utilities_installer/ws/flex-installer/ant_on_air/external/com/probertson/utils/GZIPEncoder.as>
      [get] Destination already exists (skipping): <http://apacheflexbuild.cloudapp.net:8080/job/flex-utilities_installer/ws/flex-installer/ant_on_air/external/com/probertson/utils/GZIPFile.as>

compile:
    [compc] Loading configuration file C:\Jenkins\workspace\flex-sdk\frameworks\air-config.xml
    [compc] Picked up JAVA_TOOL_OPTIONS: -Dfile.encoding=UTF8
    [compc] C:\Jenkins\workspace\flex-utilities_installer\flex-installer\ant_on_air\bin\ant_on_air.swc (134454 bytes)

test:
    [mxmlc] Loading configuration file C:\Jenkins\workspace\flex-sdk\frameworks\air-config.xml
    [mxmlc] C:\Jenkins\workspace\flex-utilities_installer\flex-installer\ant_on_air\tests\AntOnAir.swf (1147460 bytes)
    [mxmlc] Picked up JAVA_TOOL_OPTIONS: -Dfile.encoding=UTF8

failuretests:

main:

BUILD SUCCESSFUL
Total time: 1 minute 38 seconds
Picked up JAVA_TOOL_OPTIONS: -Dfile.encoding=UTF8
[flex-installer] $ cmd.exe /C "c:\Jenkins\tools\hudson.tasks.Ant_AntInstallation\c_apache-ant-1.9.3\bin\ant.bat -file build.xml -Dplayerglobal.version=11.7 clean build source-package create-md5s copy-misc && exit %%ERRORLEVEL%%"
Buildfile: <http://apacheflexbuild.cloudapp.net:8080/job/flex-utilities_installer/ws/flex-installer/build.xml>

clean:
   [delete] Deleting directory <http://apacheflexbuild.cloudapp.net:8080/job/flex-utilities_installer/ws/flex-installer/build>
   [delete] Deleting directory <http://apacheflexbuild.cloudapp.net:8080/job/flex-utilities_installer/ws/flex-installer/deps>
   [delete] Deleting directory <http://apacheflexbuild.cloudapp.net:8080/job/flex-utilities_installer/ws/flex-installer/installer/libs>
   [delete] Deleting directory <http://apacheflexbuild.cloudapp.net:8080/job/flex-utilities_installer/ws/flex-installer/release>

clean:

createDirs:
     [echo] ***************************************
     [echo] Execute the update-version target once,
     [echo] and only once, when you modifiy this app.
     [echo] This will increment the version number to allow
     [echo] the app to be updated by the AIR installer.
     [echo] ***************************************
     [echo]         
    [mkdir] Created dir: <http://apacheflexbuild.cloudapp.net:8080/job/flex-utilities_installer/ws/flex-installer/build>
    [mkdir] Created dir: <http://apacheflexbuild.cloudapp.net:8080/job/flex-utilities_installer/ws/flex-installer/release>

update-version-in-xml-files:
     [echo] version in InstallApacheFlex-app.xml will be 3.3.0

init:

certificate:

generate-certificate:
     [echo] Using cert temp.p12
     [java] Picked up JAVA_TOOL_OPTIONS: -Dfile.encoding=UTF8

check-as3commons.swc:

get-as3commons.swc:
    [mkdir] Created dir: <http://apacheflexbuild.cloudapp.net:8080/job/flex-utilities_installer/ws/flex-installer/installer/libs>
      [get] Getting: https://github.com/bigosmallm/MakeApacheFlexForFlashBuilder/blob/master/libs/as3commons-zip-1.0.0-alpha.1.swc?raw=true
      [get] To: <http://apacheflexbuild.cloudapp.net:8080/job/flex-utilities_installer/ws/flex-installer/installer/libs/as3commons-zip-1.0.0-alpha.1.swc>
      [get] https://github.com/bigosmallm/MakeApacheFlexForFlashBuilder/blob/master/libs/as3commons-zip-1.0.0-alpha.1.swc?raw=true moved to https://github.com/bigosmallm/MakeApacheFlexForFlashBuilder/raw/master/libs/as3commons-zip-1.0.0-alpha.1.swc
      [get] https://github.com/bigosmallm/MakeApacheFlexForFlashBuilder/raw/master/libs/as3commons-zip-1.0.0-alpha.1.swc moved to https://raw.githubusercontent.com/bigosmallm/MakeApacheFlexForFlashBuilder/master/libs/as3commons-zip-1.0.0-alpha.1.swc
      [get] .......

check-as3httpclient.swc:

get-as3httpclient.swc:
    [mkdir] Created dir: <http://apacheflexbuild.cloudapp.net:8080/job/flex-utilities_installer/ws/flex-installer/installer/libs/temp>
      [get] Getting: https://github.com/quetwo/as3httpclient/releases/download/1.0/as3httpclient.swc
      [get] To: <http://apacheflexbuild.cloudapp.net:8080/job/flex-utilities_installer/ws/flex-installer/installer/libs/as3httpclient.swc>
      [get] https://github.com/quetwo/as3httpclient/releases/download/1.0/as3httpclient.swc moved to https://github-cloud.s3.amazonaws.com/releases/36265618/8d35f30e-07bb-11e5-821c-8d47d0b898e1.swc?X-Amz-Algorithm=AWS4-HMAC-SHA256&X-Amz-Credential=AKIAISTNZFOVBIJMK3TQ%2F20170131%2Fus-east-1%2Fs3%2Faws4_request&X-Amz-Date=20170131T104651Z&X-Amz-Expires=300&X-Amz-Signature=5ae25e73899639022893d85967d7097b3c7f6e871762dd05a550e76e4b4d8083&X-Amz-SignedHeaders=host&actor_id=0&response-content-disposition=attachment%3B%20filename%3Das3httpclient.swc&response-content-type=application%2Foctet-stream

compile:
    [mxmlc] Loading configuration file C:\Jenkins\workspace\flex-sdk\frameworks\air-config.xml
    [mxmlc] C:\Jenkins\workspace\flex-utilities_installer\flex-installer\build\InstallApacheFlex.swf (1756699 bytes)
    [mxmlc] Picked up JAVA_TOOL_OPTIONS: -Dfile.encoding=UTF8

packageair:
     [echo] Using cert temp.p12
    [mkdir] Created dir: <http://apacheflexbuild.cloudapp.net:8080/job/flex-utilities_installer/ws/flex-installer/deps/as3httpclientlib>
      [get] Getting: https://raw.githubusercontent.com/quetwo/as3httpclient/as3httpclient-work/License.txt
      [get] To: <http://apacheflexbuild.cloudapp.net:8080/job/flex-utilities_installer/ws/flex-installer/deps/as3httpclientlib/License.txt>
    [mkdir] Created dir: <http://apacheflexbuild.cloudapp.net:8080/job/flex-utilities_installer/ws/flex-installer/deps/as3corelib>
      [get] Getting: https://raw.githubusercontent.com/mikechambers/as3corelib/master/README
      [get] To: <http://apacheflexbuild.cloudapp.net:8080/job/flex-utilities_installer/ws/flex-installer/deps/as3corelib/README>

check-as3crypto-license:

get-as3crypto-license:
    [mkdir] Created dir: <http://apacheflexbuild.cloudapp.net:8080/job/flex-utilities_installer/ws/flex-installer/deps/as3crypto/temp>
      [get] Getting: https://storage.googleapis.com/google-code-archive-downloads/v2/code.google.com/as3crypto/Crypto.zip
      [get] To: <http://apacheflexbuild.cloudapp.net:8080/job/flex-utilities_installer/ws/flex-installer/deps/as3crypto/temp/Crypto.zip>
    [unzip] Expanding: <http://apacheflexbuild.cloudapp.net:8080/job/flex-utilities_installer/ws/flex-installer/deps/as3crypto/temp/Crypto.zip> into <http://apacheflexbuild.cloudapp.net:8080/job/flex-utilities_installer/ws/flex-installer/deps/as3crypto>
   [delete] Deleting directory <http://apacheflexbuild.cloudapp.net:8080/job/flex-utilities_installer/ws/flex-installer/deps/as3crypto/temp>

simple-untar-license:
    [mkdir] Created dir: <http://apacheflexbuild.cloudapp.net:8080/job/flex-utilities_installer/ws/flex-installer/deps/as3-simple-untar>
      [get] Getting: https://raw.githubusercontent.com/thdtjsdn/as3-simple-untar/master/src/de/ketzler/utils/SimpleUntar.as
      [get] To: <http://apacheflexbuild.cloudapp.net:8080/job/flex-utilities_installer/ws/flex-installer/deps/as3-simple-untar/LICENSE>
     [java] Could not generate timestamp: Remote host closed connection during handshake
     [java] Picked up JAVA_TOOL_OPTIONS: -Dfile.encoding=UTF8

BUILD FAILED
<http://apacheflexbuild.cloudapp.net:8080/job/flex-utilities_installer/ws/flex-installer/build.xml>:406: Java returned: 10

Total time: 1 minute 43 seconds
Picked up JAVA_TOOL_OPTIONS: -Dfile.encoding=UTF8
Build step 'Invoke Ant' marked build as failure
Archiving artifacts

Build failed in Jenkins: flex-utilities_installer #1077

Posted by fl...@gmail.com.
See <http://apacheflexbuild.cloudapp.net:8080/job/flex-utilities_installer/1077/>

------------------------------------------
Started by timer
Building remotely on flex_sdk_slave2 in workspace <http://apacheflexbuild.cloudapp.net:8080/job/flex-utilities_installer/ws/>
 > C:\Program Files (x86)\Git\cmd\git.exe rev-parse --is-inside-work-tree # timeout=10
Fetching changes from the remote Git repository
 > C:\Program Files (x86)\Git\cmd\git.exe config remote.origin.url https://git-wip-us.apache.org/repos/asf/flex-utilities.git # timeout=10
Fetching upstream changes from https://git-wip-us.apache.org/repos/asf/flex-utilities.git
 > C:\Program Files (x86)\Git\cmd\git.exe --version # timeout=10
 > C:\Program Files (x86)\Git\cmd\git.exe fetch --tags --progress https://git-wip-us.apache.org/repos/asf/flex-utilities.git +refs/heads/*:refs/remotes/origin/*
 > C:\Program Files (x86)\Git\cmd\git.exe rev-parse "origin/develop^{commit}" # timeout=10
Checking out Revision 30ef5fb36374060061739c402f55b3accc7aa019 (origin/develop)
 > C:\Program Files (x86)\Git\cmd\git.exe config core.sparsecheckout # timeout=10
 > C:\Program Files (x86)\Git\cmd\git.exe checkout -f 30ef5fb36374060061739c402f55b3accc7aa019
 > C:\Program Files (x86)\Git\cmd\git.exe rev-list 30ef5fb36374060061739c402f55b3accc7aa019 # timeout=10
[ant_on_air] $ cmd.exe /C "c:\Jenkins\tools\hudson.tasks.Ant_AntInstallation\c_apache-ant-1.9.3\bin\ant.bat -file build.xml -Dplayerglobal.version=11.7 main && exit %%ERRORLEVEL%%"
Buildfile: <http://apacheflexbuild.cloudapp.net:8080/job/flex-utilities_installer/ws/flex-installer/ant_on_air/build.xml>

clean:
   [delete] Deleting directory <http://apacheflexbuild.cloudapp.net:8080/job/flex-utilities_installer/ws/flex-installer/ant_on_air/bin>

init:

check-as3commons.swc:

get-as3commons.swc:

third-party:
      [get] Destination already exists (skipping): <http://apacheflexbuild.cloudapp.net:8080/job/flex-utilities_installer/ws/flex-installer/ant_on_air/external/de/ketzler/utils/SimpleUntar.as>
      [get] Destination already exists (skipping): <http://apacheflexbuild.cloudapp.net:8080/job/flex-utilities_installer/ws/flex-installer/ant_on_air/external/de/ketzler/utils/untar/UntarFileInfo.as>
      [get] Destination already exists (skipping): <http://apacheflexbuild.cloudapp.net:8080/job/flex-utilities_installer/ws/flex-installer/ant_on_air/external/de/ketzler/utils/untar/UntarHeaderBlock.as>
      [get] Destination already exists (skipping): <http://apacheflexbuild.cloudapp.net:8080/job/flex-utilities_installer/ws/flex-installer/ant_on_air/external/com/probertson/utils/CRC32Generator.as>
      [get] Destination already exists (skipping): <http://apacheflexbuild.cloudapp.net:8080/job/flex-utilities_installer/ws/flex-installer/ant_on_air/external/com/probertson/utils/GZIPBytesEncoder.as>
      [get] Destination already exists (skipping): <http://apacheflexbuild.cloudapp.net:8080/job/flex-utilities_installer/ws/flex-installer/ant_on_air/external/com/probertson/utils/GZIPEncoder.as>
      [get] Destination already exists (skipping): <http://apacheflexbuild.cloudapp.net:8080/job/flex-utilities_installer/ws/flex-installer/ant_on_air/external/com/probertson/utils/GZIPFile.as>

compile:
    [compc] Loading configuration file C:\Jenkins\workspace\flex-sdk\frameworks\air-config.xml
    [compc] C:\Jenkins\workspace\flex-utilities_installer\flex-installer\ant_on_air\bin\ant_on_air.swc (134445 bytes)
    [compc] Picked up JAVA_TOOL_OPTIONS: -Dfile.encoding=UTF8

test:
    [mxmlc] Loading configuration file C:\Jenkins\workspace\flex-sdk\frameworks\air-config.xml
    [mxmlc] Picked up JAVA_TOOL_OPTIONS: -Dfile.encoding=UTF8
    [mxmlc] C:\Jenkins\workspace\flex-utilities_installer\flex-installer\ant_on_air\tests\AntOnAir.swf (1147460 bytes)

failuretests:

main:

BUILD SUCCESSFUL
Total time: 1 minute 27 seconds
Picked up JAVA_TOOL_OPTIONS: -Dfile.encoding=UTF8
[flex-installer] $ cmd.exe /C "c:\Jenkins\tools\hudson.tasks.Ant_AntInstallation\c_apache-ant-1.9.3\bin\ant.bat -file build.xml -Dplayerglobal.version=11.7 clean build source-package create-md5s copy-misc && exit %%ERRORLEVEL%%"
Buildfile: <http://apacheflexbuild.cloudapp.net:8080/job/flex-utilities_installer/ws/flex-installer/build.xml>

clean:
   [delete] Deleting directory <http://apacheflexbuild.cloudapp.net:8080/job/flex-utilities_installer/ws/flex-installer/build>
   [delete] Deleting directory <http://apacheflexbuild.cloudapp.net:8080/job/flex-utilities_installer/ws/flex-installer/deps>
   [delete] Deleting directory <http://apacheflexbuild.cloudapp.net:8080/job/flex-utilities_installer/ws/flex-installer/installer/libs>
   [delete] Deleting directory <http://apacheflexbuild.cloudapp.net:8080/job/flex-utilities_installer/ws/flex-installer/release>

clean:

createDirs:
     [echo] ***************************************
     [echo] Execute the update-version target once,
     [echo] and only once, when you modifiy this app.
     [echo] This will increment the version number to allow
     [echo] the app to be updated by the AIR installer.
     [echo] ***************************************
     [echo]         
    [mkdir] Created dir: <http://apacheflexbuild.cloudapp.net:8080/job/flex-utilities_installer/ws/flex-installer/build>
    [mkdir] Created dir: <http://apacheflexbuild.cloudapp.net:8080/job/flex-utilities_installer/ws/flex-installer/release>

update-version-in-xml-files:
     [echo] version in InstallApacheFlex-app.xml will be 3.3.0

init:

certificate:

generate-certificate:
     [echo] Using cert temp.p12
     [java] Picked up JAVA_TOOL_OPTIONS: -Dfile.encoding=UTF8

check-as3commons.swc:

get-as3commons.swc:
    [mkdir] Created dir: <http://apacheflexbuild.cloudapp.net:8080/job/flex-utilities_installer/ws/flex-installer/installer/libs>
      [get] Getting: https://github.com/bigosmallm/MakeApacheFlexForFlashBuilder/blob/master/libs/as3commons-zip-1.0.0-alpha.1.swc?raw=true
      [get] To: <http://apacheflexbuild.cloudapp.net:8080/job/flex-utilities_installer/ws/flex-installer/installer/libs/as3commons-zip-1.0.0-alpha.1.swc>
      [get] https://github.com/bigosmallm/MakeApacheFlexForFlashBuilder/blob/master/libs/as3commons-zip-1.0.0-alpha.1.swc?raw=true moved to https://github.com/bigosmallm/MakeApacheFlexForFlashBuilder/raw/master/libs/as3commons-zip-1.0.0-alpha.1.swc
      [get] https://github.com/bigosmallm/MakeApacheFlexForFlashBuilder/raw/master/libs/as3commons-zip-1.0.0-alpha.1.swc moved to https://raw.githubusercontent.com/bigosmallm/MakeApacheFlexForFlashBuilder/master/libs/as3commons-zip-1.0.0-alpha.1.swc
      [get] .......

check-as3httpclient.swc:

get-as3httpclient.swc:
    [mkdir] Created dir: <http://apacheflexbuild.cloudapp.net:8080/job/flex-utilities_installer/ws/flex-installer/installer/libs/temp>
      [get] Getting: https://github.com/quetwo/as3httpclient/releases/download/1.0/as3httpclient.swc
      [get] To: <http://apacheflexbuild.cloudapp.net:8080/job/flex-utilities_installer/ws/flex-installer/installer/libs/as3httpclient.swc>
      [get] https://github.com/quetwo/as3httpclient/releases/download/1.0/as3httpclient.swc moved to https://github-cloud.s3.amazonaws.com/releases/36265618/8d35f30e-07bb-11e5-821c-8d47d0b898e1.swc?X-Amz-Algorithm=AWS4-HMAC-SHA256&X-Amz-Credential=AKIAISTNZFOVBIJMK3TQ%2F20170130%2Fus-east-1%2Fs3%2Faws4_request&X-Amz-Date=20170130T091206Z&X-Amz-Expires=300&X-Amz-Signature=0134ff99436b0b3f6dbc2044fb0da8718539c3edf37b16db0fbc34b2b37de1b1&X-Amz-SignedHeaders=host&actor_id=0&response-content-disposition=attachment%3B%20filename%3Das3httpclient.swc&response-content-type=application%2Foctet-stream

compile:
    [mxmlc] Loading configuration file C:\Jenkins\workspace\flex-sdk\frameworks\air-config.xml
    [mxmlc] C:\Jenkins\workspace\flex-utilities_installer\flex-installer\build\InstallApacheFlex.swf (1756687 bytes)
    [mxmlc] Picked up JAVA_TOOL_OPTIONS: -Dfile.encoding=UTF8

packageair:
     [echo] Using cert temp.p12
    [mkdir] Created dir: <http://apacheflexbuild.cloudapp.net:8080/job/flex-utilities_installer/ws/flex-installer/deps/as3httpclientlib>
      [get] Getting: https://raw.githubusercontent.com/quetwo/as3httpclient/as3httpclient-work/License.txt
      [get] To: <http://apacheflexbuild.cloudapp.net:8080/job/flex-utilities_installer/ws/flex-installer/deps/as3httpclientlib/License.txt>
    [mkdir] Created dir: <http://apacheflexbuild.cloudapp.net:8080/job/flex-utilities_installer/ws/flex-installer/deps/as3corelib>
      [get] Getting: https://raw.githubusercontent.com/mikechambers/as3corelib/master/README
      [get] To: <http://apacheflexbuild.cloudapp.net:8080/job/flex-utilities_installer/ws/flex-installer/deps/as3corelib/README>

check-as3crypto-license:

get-as3crypto-license:
    [mkdir] Created dir: <http://apacheflexbuild.cloudapp.net:8080/job/flex-utilities_installer/ws/flex-installer/deps/as3crypto/temp>
      [get] Getting: https://storage.googleapis.com/google-code-archive-downloads/v2/code.google.com/as3crypto/Crypto.zip
      [get] To: <http://apacheflexbuild.cloudapp.net:8080/job/flex-utilities_installer/ws/flex-installer/deps/as3crypto/temp/Crypto.zip>
    [unzip] Expanding: <http://apacheflexbuild.cloudapp.net:8080/job/flex-utilities_installer/ws/flex-installer/deps/as3crypto/temp/Crypto.zip> into <http://apacheflexbuild.cloudapp.net:8080/job/flex-utilities_installer/ws/flex-installer/deps/as3crypto>
   [delete] Deleting directory <http://apacheflexbuild.cloudapp.net:8080/job/flex-utilities_installer/ws/flex-installer/deps/as3crypto/temp>

simple-untar-license:
    [mkdir] Created dir: <http://apacheflexbuild.cloudapp.net:8080/job/flex-utilities_installer/ws/flex-installer/deps/as3-simple-untar>
      [get] Getting: https://raw.githubusercontent.com/thdtjsdn/as3-simple-untar/master/src/de/ketzler/utils/SimpleUntar.as
      [get] To: <http://apacheflexbuild.cloudapp.net:8080/job/flex-utilities_installer/ws/flex-installer/deps/as3-simple-untar/LICENSE>
     [java] Could not generate timestamp: Remote host closed connection during handshake
     [java] Picked up JAVA_TOOL_OPTIONS: -Dfile.encoding=UTF8

BUILD FAILED
<http://apacheflexbuild.cloudapp.net:8080/job/flex-utilities_installer/ws/flex-installer/build.xml>:406: Java returned: 10

Total time: 1 minute 37 seconds
Picked up JAVA_TOOL_OPTIONS: -Dfile.encoding=UTF8
Build step 'Invoke Ant' marked build as failure
Archiving artifacts

Build failed in Jenkins: flex-utilities_installer #1076

Posted by fl...@gmail.com.
See <http://apacheflexbuild.cloudapp.net:8080/job/flex-utilities_installer/1076/>

------------------------------------------
Started by timer
Building remotely on flex_sdk_slave2 in workspace <http://apacheflexbuild.cloudapp.net:8080/job/flex-utilities_installer/ws/>
 > C:\Program Files (x86)\Git\cmd\git.exe rev-parse --is-inside-work-tree # timeout=10
Fetching changes from the remote Git repository
 > C:\Program Files (x86)\Git\cmd\git.exe config remote.origin.url https://git-wip-us.apache.org/repos/asf/flex-utilities.git # timeout=10
Fetching upstream changes from https://git-wip-us.apache.org/repos/asf/flex-utilities.git
 > C:\Program Files (x86)\Git\cmd\git.exe --version # timeout=10
 > C:\Program Files (x86)\Git\cmd\git.exe fetch --tags --progress https://git-wip-us.apache.org/repos/asf/flex-utilities.git +refs/heads/*:refs/remotes/origin/*
 > C:\Program Files (x86)\Git\cmd\git.exe rev-parse "origin/develop^{commit}" # timeout=10
Checking out Revision 30ef5fb36374060061739c402f55b3accc7aa019 (origin/develop)
 > C:\Program Files (x86)\Git\cmd\git.exe config core.sparsecheckout # timeout=10
 > C:\Program Files (x86)\Git\cmd\git.exe checkout -f 30ef5fb36374060061739c402f55b3accc7aa019
 > C:\Program Files (x86)\Git\cmd\git.exe rev-list 30ef5fb36374060061739c402f55b3accc7aa019 # timeout=10
[ant_on_air] $ cmd.exe /C "c:\Jenkins\tools\hudson.tasks.Ant_AntInstallation\c_apache-ant-1.9.3\bin\ant.bat -file build.xml -Dplayerglobal.version=11.7 main && exit %%ERRORLEVEL%%"
Buildfile: <http://apacheflexbuild.cloudapp.net:8080/job/flex-utilities_installer/ws/flex-installer/ant_on_air/build.xml>

clean:
   [delete] Deleting directory <http://apacheflexbuild.cloudapp.net:8080/job/flex-utilities_installer/ws/flex-installer/ant_on_air/bin>

init:

check-as3commons.swc:

get-as3commons.swc:

third-party:
      [get] Destination already exists (skipping): <http://apacheflexbuild.cloudapp.net:8080/job/flex-utilities_installer/ws/flex-installer/ant_on_air/external/de/ketzler/utils/SimpleUntar.as>
      [get] Destination already exists (skipping): <http://apacheflexbuild.cloudapp.net:8080/job/flex-utilities_installer/ws/flex-installer/ant_on_air/external/de/ketzler/utils/untar/UntarFileInfo.as>
      [get] Destination already exists (skipping): <http://apacheflexbuild.cloudapp.net:8080/job/flex-utilities_installer/ws/flex-installer/ant_on_air/external/de/ketzler/utils/untar/UntarHeaderBlock.as>
      [get] Destination already exists (skipping): <http://apacheflexbuild.cloudapp.net:8080/job/flex-utilities_installer/ws/flex-installer/ant_on_air/external/com/probertson/utils/CRC32Generator.as>
      [get] Destination already exists (skipping): <http://apacheflexbuild.cloudapp.net:8080/job/flex-utilities_installer/ws/flex-installer/ant_on_air/external/com/probertson/utils/GZIPBytesEncoder.as>
      [get] Destination already exists (skipping): <http://apacheflexbuild.cloudapp.net:8080/job/flex-utilities_installer/ws/flex-installer/ant_on_air/external/com/probertson/utils/GZIPEncoder.as>
      [get] Destination already exists (skipping): <http://apacheflexbuild.cloudapp.net:8080/job/flex-utilities_installer/ws/flex-installer/ant_on_air/external/com/probertson/utils/GZIPFile.as>

compile:
    [compc] Loading configuration file C:\Jenkins\workspace\flex-sdk\frameworks\air-config.xml
    [compc] C:\Jenkins\workspace\flex-utilities_installer\flex-installer\ant_on_air\bin\ant_on_air.swc (134445 bytes)
    [compc] Picked up JAVA_TOOL_OPTIONS: -Dfile.encoding=UTF8

test:
    [mxmlc] Loading configuration file C:\Jenkins\workspace\flex-sdk\frameworks\air-config.xml
    [mxmlc] C:\Jenkins\workspace\flex-utilities_installer\flex-installer\ant_on_air\tests\AntOnAir.swf (1147465 bytes)
    [mxmlc] Picked up JAVA_TOOL_OPTIONS: -Dfile.encoding=UTF8

failuretests:

main:

BUILD SUCCESSFUL
Total time: 1 minute 24 seconds
Picked up JAVA_TOOL_OPTIONS: -Dfile.encoding=UTF8
[flex-installer] $ cmd.exe /C "c:\Jenkins\tools\hudson.tasks.Ant_AntInstallation\c_apache-ant-1.9.3\bin\ant.bat -file build.xml -Dplayerglobal.version=11.7 clean build source-package create-md5s copy-misc && exit %%ERRORLEVEL%%"
Buildfile: <http://apacheflexbuild.cloudapp.net:8080/job/flex-utilities_installer/ws/flex-installer/build.xml>

clean:
   [delete] Deleting directory <http://apacheflexbuild.cloudapp.net:8080/job/flex-utilities_installer/ws/flex-installer/build>
   [delete] Deleting directory <http://apacheflexbuild.cloudapp.net:8080/job/flex-utilities_installer/ws/flex-installer/deps>
   [delete] Deleting directory <http://apacheflexbuild.cloudapp.net:8080/job/flex-utilities_installer/ws/flex-installer/installer/libs>
   [delete] Deleting directory <http://apacheflexbuild.cloudapp.net:8080/job/flex-utilities_installer/ws/flex-installer/release>

clean:

createDirs:
     [echo] ***************************************
     [echo] Execute the update-version target once,
     [echo] and only once, when you modifiy this app.
     [echo] This will increment the version number to allow
     [echo] the app to be updated by the AIR installer.
     [echo] ***************************************
     [echo]         
    [mkdir] Created dir: <http://apacheflexbuild.cloudapp.net:8080/job/flex-utilities_installer/ws/flex-installer/build>
    [mkdir] Created dir: <http://apacheflexbuild.cloudapp.net:8080/job/flex-utilities_installer/ws/flex-installer/release>

update-version-in-xml-files:
     [echo] version in InstallApacheFlex-app.xml will be 3.3.0

init:

certificate:

generate-certificate:
     [echo] Using cert temp.p12
     [java] Picked up JAVA_TOOL_OPTIONS: -Dfile.encoding=UTF8

check-as3commons.swc:

get-as3commons.swc:
    [mkdir] Created dir: <http://apacheflexbuild.cloudapp.net:8080/job/flex-utilities_installer/ws/flex-installer/installer/libs>
      [get] Getting: https://github.com/bigosmallm/MakeApacheFlexForFlashBuilder/blob/master/libs/as3commons-zip-1.0.0-alpha.1.swc?raw=true
      [get] To: <http://apacheflexbuild.cloudapp.net:8080/job/flex-utilities_installer/ws/flex-installer/installer/libs/as3commons-zip-1.0.0-alpha.1.swc>
      [get] https://github.com/bigosmallm/MakeApacheFlexForFlashBuilder/blob/master/libs/as3commons-zip-1.0.0-alpha.1.swc?raw=true moved to https://github.com/bigosmallm/MakeApacheFlexForFlashBuilder/raw/master/libs/as3commons-zip-1.0.0-alpha.1.swc
      [get] https://github.com/bigosmallm/MakeApacheFlexForFlashBuilder/raw/master/libs/as3commons-zip-1.0.0-alpha.1.swc moved to https://raw.githubusercontent.com/bigosmallm/MakeApacheFlexForFlashBuilder/master/libs/as3commons-zip-1.0.0-alpha.1.swc
      [get] .......

check-as3httpclient.swc:

get-as3httpclient.swc:
    [mkdir] Created dir: <http://apacheflexbuild.cloudapp.net:8080/job/flex-utilities_installer/ws/flex-installer/installer/libs/temp>
      [get] Getting: https://github.com/quetwo/as3httpclient/releases/download/1.0/as3httpclient.swc
      [get] To: <http://apacheflexbuild.cloudapp.net:8080/job/flex-utilities_installer/ws/flex-installer/installer/libs/as3httpclient.swc>
      [get] https://github.com/quetwo/as3httpclient/releases/download/1.0/as3httpclient.swc moved to https://github-cloud.s3.amazonaws.com/releases/36265618/8d35f30e-07bb-11e5-821c-8d47d0b898e1.swc?X-Amz-Algorithm=AWS4-HMAC-SHA256&X-Amz-Credential=AKIAISTNZFOVBIJMK3TQ%2F20170129%2Fus-east-1%2Fs3%2Faws4_request&X-Amz-Date=20170129T091158Z&X-Amz-Expires=300&X-Amz-Signature=856bbfe837dd8b067f71dd6fd38cb893f37fa858a0e96af0035e70e272136fdb&X-Amz-SignedHeaders=host&actor_id=0&response-content-disposition=attachment%3B%20filename%3Das3httpclient.swc&response-content-type=application%2Foctet-stream

compile:
    [mxmlc] Loading configuration file C:\Jenkins\workspace\flex-sdk\frameworks\air-config.xml
    [mxmlc] Picked up JAVA_TOOL_OPTIONS: -Dfile.encoding=UTF8
    [mxmlc] C:\Jenkins\workspace\flex-utilities_installer\flex-installer\build\InstallApacheFlex.swf (1756692 bytes)

packageair:
     [echo] Using cert temp.p12
    [mkdir] Created dir: <http://apacheflexbuild.cloudapp.net:8080/job/flex-utilities_installer/ws/flex-installer/deps/as3httpclientlib>
      [get] Getting: https://raw.githubusercontent.com/quetwo/as3httpclient/as3httpclient-work/License.txt
      [get] To: <http://apacheflexbuild.cloudapp.net:8080/job/flex-utilities_installer/ws/flex-installer/deps/as3httpclientlib/License.txt>
    [mkdir] Created dir: <http://apacheflexbuild.cloudapp.net:8080/job/flex-utilities_installer/ws/flex-installer/deps/as3corelib>
      [get] Getting: https://raw.githubusercontent.com/mikechambers/as3corelib/master/README
      [get] To: <http://apacheflexbuild.cloudapp.net:8080/job/flex-utilities_installer/ws/flex-installer/deps/as3corelib/README>

check-as3crypto-license:

get-as3crypto-license:
    [mkdir] Created dir: <http://apacheflexbuild.cloudapp.net:8080/job/flex-utilities_installer/ws/flex-installer/deps/as3crypto/temp>
      [get] Getting: https://storage.googleapis.com/google-code-archive-downloads/v2/code.google.com/as3crypto/Crypto.zip
      [get] To: <http://apacheflexbuild.cloudapp.net:8080/job/flex-utilities_installer/ws/flex-installer/deps/as3crypto/temp/Crypto.zip>
    [unzip] Expanding: <http://apacheflexbuild.cloudapp.net:8080/job/flex-utilities_installer/ws/flex-installer/deps/as3crypto/temp/Crypto.zip> into <http://apacheflexbuild.cloudapp.net:8080/job/flex-utilities_installer/ws/flex-installer/deps/as3crypto>
   [delete] Deleting directory <http://apacheflexbuild.cloudapp.net:8080/job/flex-utilities_installer/ws/flex-installer/deps/as3crypto/temp>

simple-untar-license:
    [mkdir] Created dir: <http://apacheflexbuild.cloudapp.net:8080/job/flex-utilities_installer/ws/flex-installer/deps/as3-simple-untar>
      [get] Getting: https://raw.githubusercontent.com/thdtjsdn/as3-simple-untar/master/src/de/ketzler/utils/SimpleUntar.as
      [get] To: <http://apacheflexbuild.cloudapp.net:8080/job/flex-utilities_installer/ws/flex-installer/deps/as3-simple-untar/LICENSE>
     [java] Could not generate timestamp: Remote host closed connection during handshake
     [java] Picked up JAVA_TOOL_OPTIONS: -Dfile.encoding=UTF8

BUILD FAILED
<http://apacheflexbuild.cloudapp.net:8080/job/flex-utilities_installer/ws/flex-installer/build.xml>:406: Java returned: 10

Total time: 1 minute 35 seconds
Picked up JAVA_TOOL_OPTIONS: -Dfile.encoding=UTF8
Build step 'Invoke Ant' marked build as failure
Archiving artifacts

Build failed in Jenkins: flex-utilities_installer #1075

Posted by fl...@gmail.com.
See <http://apacheflexbuild.cloudapp.net:8080/job/flex-utilities_installer/1075/>

------------------------------------------
Started by timer
Building remotely on flex_sdk_slave2 in workspace <http://apacheflexbuild.cloudapp.net:8080/job/flex-utilities_installer/ws/>
 > C:\Program Files (x86)\Git\cmd\git.exe rev-parse --is-inside-work-tree # timeout=10
Fetching changes from the remote Git repository
 > C:\Program Files (x86)\Git\cmd\git.exe config remote.origin.url https://git-wip-us.apache.org/repos/asf/flex-utilities.git # timeout=10
Fetching upstream changes from https://git-wip-us.apache.org/repos/asf/flex-utilities.git
 > C:\Program Files (x86)\Git\cmd\git.exe --version # timeout=10
 > C:\Program Files (x86)\Git\cmd\git.exe fetch --tags --progress https://git-wip-us.apache.org/repos/asf/flex-utilities.git +refs/heads/*:refs/remotes/origin/*
 > C:\Program Files (x86)\Git\cmd\git.exe rev-parse "origin/develop^{commit}" # timeout=10
Checking out Revision 30ef5fb36374060061739c402f55b3accc7aa019 (origin/develop)
 > C:\Program Files (x86)\Git\cmd\git.exe config core.sparsecheckout # timeout=10
 > C:\Program Files (x86)\Git\cmd\git.exe checkout -f 30ef5fb36374060061739c402f55b3accc7aa019
 > C:\Program Files (x86)\Git\cmd\git.exe rev-list 30ef5fb36374060061739c402f55b3accc7aa019 # timeout=10
[ant_on_air] $ cmd.exe /C "c:\Jenkins\tools\hudson.tasks.Ant_AntInstallation\c_apache-ant-1.9.3\bin\ant.bat -file build.xml -Dplayerglobal.version=11.7 main && exit %%ERRORLEVEL%%"
Buildfile: <http://apacheflexbuild.cloudapp.net:8080/job/flex-utilities_installer/ws/flex-installer/ant_on_air/build.xml>

clean:
   [delete] Deleting directory <http://apacheflexbuild.cloudapp.net:8080/job/flex-utilities_installer/ws/flex-installer/ant_on_air/bin>

init:

check-as3commons.swc:

get-as3commons.swc:

third-party:
      [get] Destination already exists (skipping): <http://apacheflexbuild.cloudapp.net:8080/job/flex-utilities_installer/ws/flex-installer/ant_on_air/external/de/ketzler/utils/SimpleUntar.as>
      [get] Destination already exists (skipping): <http://apacheflexbuild.cloudapp.net:8080/job/flex-utilities_installer/ws/flex-installer/ant_on_air/external/de/ketzler/utils/untar/UntarFileInfo.as>
      [get] Destination already exists (skipping): <http://apacheflexbuild.cloudapp.net:8080/job/flex-utilities_installer/ws/flex-installer/ant_on_air/external/de/ketzler/utils/untar/UntarHeaderBlock.as>
      [get] Destination already exists (skipping): <http://apacheflexbuild.cloudapp.net:8080/job/flex-utilities_installer/ws/flex-installer/ant_on_air/external/com/probertson/utils/CRC32Generator.as>
      [get] Destination already exists (skipping): <http://apacheflexbuild.cloudapp.net:8080/job/flex-utilities_installer/ws/flex-installer/ant_on_air/external/com/probertson/utils/GZIPBytesEncoder.as>
      [get] Destination already exists (skipping): <http://apacheflexbuild.cloudapp.net:8080/job/flex-utilities_installer/ws/flex-installer/ant_on_air/external/com/probertson/utils/GZIPEncoder.as>
      [get] Destination already exists (skipping): <http://apacheflexbuild.cloudapp.net:8080/job/flex-utilities_installer/ws/flex-installer/ant_on_air/external/com/probertson/utils/GZIPFile.as>

compile:
    [compc] Loading configuration file C:\Jenkins\workspace\flex-sdk\frameworks\air-config.xml
    [compc] Picked up JAVA_TOOL_OPTIONS: -Dfile.encoding=UTF8
    [compc] C:\Jenkins\workspace\flex-utilities_installer\flex-installer\ant_on_air\bin\ant_on_air.swc (134445 bytes)

test:
    [mxmlc] Loading configuration file C:\Jenkins\workspace\flex-sdk\frameworks\air-config.xml
    [mxmlc] C:\Jenkins\workspace\flex-utilities_installer\flex-installer\ant_on_air\tests\AntOnAir.swf (1147459 bytes)
    [mxmlc] Picked up JAVA_TOOL_OPTIONS: -Dfile.encoding=UTF8

failuretests:

main:

BUILD SUCCESSFUL
Total time: 1 minute 29 seconds
Picked up JAVA_TOOL_OPTIONS: -Dfile.encoding=UTF8
[flex-installer] $ cmd.exe /C "c:\Jenkins\tools\hudson.tasks.Ant_AntInstallation\c_apache-ant-1.9.3\bin\ant.bat -file build.xml -Dplayerglobal.version=11.7 clean build source-package create-md5s copy-misc && exit %%ERRORLEVEL%%"
Buildfile: <http://apacheflexbuild.cloudapp.net:8080/job/flex-utilities_installer/ws/flex-installer/build.xml>

clean:
   [delete] Deleting directory <http://apacheflexbuild.cloudapp.net:8080/job/flex-utilities_installer/ws/flex-installer/build>
   [delete] Deleting directory <http://apacheflexbuild.cloudapp.net:8080/job/flex-utilities_installer/ws/flex-installer/deps>
   [delete] Deleting directory <http://apacheflexbuild.cloudapp.net:8080/job/flex-utilities_installer/ws/flex-installer/installer/libs>
   [delete] Deleting directory <http://apacheflexbuild.cloudapp.net:8080/job/flex-utilities_installer/ws/flex-installer/release>

clean:

createDirs:
     [echo] ***************************************
     [echo] Execute the update-version target once,
     [echo] and only once, when you modifiy this app.
     [echo] This will increment the version number to allow
     [echo] the app to be updated by the AIR installer.
     [echo] ***************************************
     [echo]         
    [mkdir] Created dir: <http://apacheflexbuild.cloudapp.net:8080/job/flex-utilities_installer/ws/flex-installer/build>
    [mkdir] Created dir: <http://apacheflexbuild.cloudapp.net:8080/job/flex-utilities_installer/ws/flex-installer/release>

update-version-in-xml-files:
     [echo] version in InstallApacheFlex-app.xml will be 3.3.0

init:

certificate:

generate-certificate:
     [echo] Using cert temp.p12
     [java] Picked up JAVA_TOOL_OPTIONS: -Dfile.encoding=UTF8

check-as3commons.swc:

get-as3commons.swc:
    [mkdir] Created dir: <http://apacheflexbuild.cloudapp.net:8080/job/flex-utilities_installer/ws/flex-installer/installer/libs>
      [get] Getting: https://github.com/bigosmallm/MakeApacheFlexForFlashBuilder/blob/master/libs/as3commons-zip-1.0.0-alpha.1.swc?raw=true
      [get] To: <http://apacheflexbuild.cloudapp.net:8080/job/flex-utilities_installer/ws/flex-installer/installer/libs/as3commons-zip-1.0.0-alpha.1.swc>
      [get] https://github.com/bigosmallm/MakeApacheFlexForFlashBuilder/blob/master/libs/as3commons-zip-1.0.0-alpha.1.swc?raw=true moved to https://github.com/bigosmallm/MakeApacheFlexForFlashBuilder/raw/master/libs/as3commons-zip-1.0.0-alpha.1.swc
      [get] https://github.com/bigosmallm/MakeApacheFlexForFlashBuilder/raw/master/libs/as3commons-zip-1.0.0-alpha.1.swc moved to https://raw.githubusercontent.com/bigosmallm/MakeApacheFlexForFlashBuilder/master/libs/as3commons-zip-1.0.0-alpha.1.swc
      [get] .......

check-as3httpclient.swc:

get-as3httpclient.swc:
    [mkdir] Created dir: <http://apacheflexbuild.cloudapp.net:8080/job/flex-utilities_installer/ws/flex-installer/installer/libs/temp>
      [get] Getting: https://github.com/quetwo/as3httpclient/releases/download/1.0/as3httpclient.swc
      [get] To: <http://apacheflexbuild.cloudapp.net:8080/job/flex-utilities_installer/ws/flex-installer/installer/libs/as3httpclient.swc>
      [get] https://github.com/quetwo/as3httpclient/releases/download/1.0/as3httpclient.swc moved to https://github-cloud.s3.amazonaws.com/releases/36265618/8d35f30e-07bb-11e5-821c-8d47d0b898e1.swc?X-Amz-Algorithm=AWS4-HMAC-SHA256&X-Amz-Credential=AKIAISTNZFOVBIJMK3TQ%2F20170128%2Fus-east-1%2Fs3%2Faws4_request&X-Amz-Date=20170128T091159Z&X-Amz-Expires=300&X-Amz-Signature=091899e1430e307b927f28ce1815ec4db4fc577df8d39fa685c0fb433e76b16d&X-Amz-SignedHeaders=host&actor_id=0&response-content-disposition=attachment%3B%20filename%3Das3httpclient.swc&response-content-type=application%2Foctet-stream

compile:
    [mxmlc] Loading configuration file C:\Jenkins\workspace\flex-sdk\frameworks\air-config.xml
    [mxmlc] C:\Jenkins\workspace\flex-utilities_installer\flex-installer\build\InstallApacheFlex.swf (1756690 bytes)
    [mxmlc] Picked up JAVA_TOOL_OPTIONS: -Dfile.encoding=UTF8

packageair:
     [echo] Using cert temp.p12
    [mkdir] Created dir: <http://apacheflexbuild.cloudapp.net:8080/job/flex-utilities_installer/ws/flex-installer/deps/as3httpclientlib>
      [get] Getting: https://raw.githubusercontent.com/quetwo/as3httpclient/as3httpclient-work/License.txt
      [get] To: <http://apacheflexbuild.cloudapp.net:8080/job/flex-utilities_installer/ws/flex-installer/deps/as3httpclientlib/License.txt>
    [mkdir] Created dir: <http://apacheflexbuild.cloudapp.net:8080/job/flex-utilities_installer/ws/flex-installer/deps/as3corelib>
      [get] Getting: https://raw.githubusercontent.com/mikechambers/as3corelib/master/README
      [get] To: <http://apacheflexbuild.cloudapp.net:8080/job/flex-utilities_installer/ws/flex-installer/deps/as3corelib/README>

check-as3crypto-license:

get-as3crypto-license:
    [mkdir] Created dir: <http://apacheflexbuild.cloudapp.net:8080/job/flex-utilities_installer/ws/flex-installer/deps/as3crypto/temp>
      [get] Getting: https://storage.googleapis.com/google-code-archive-downloads/v2/code.google.com/as3crypto/Crypto.zip
      [get] To: <http://apacheflexbuild.cloudapp.net:8080/job/flex-utilities_installer/ws/flex-installer/deps/as3crypto/temp/Crypto.zip>
    [unzip] Expanding: <http://apacheflexbuild.cloudapp.net:8080/job/flex-utilities_installer/ws/flex-installer/deps/as3crypto/temp/Crypto.zip> into <http://apacheflexbuild.cloudapp.net:8080/job/flex-utilities_installer/ws/flex-installer/deps/as3crypto>
   [delete] Deleting directory <http://apacheflexbuild.cloudapp.net:8080/job/flex-utilities_installer/ws/flex-installer/deps/as3crypto/temp>

simple-untar-license:
    [mkdir] Created dir: <http://apacheflexbuild.cloudapp.net:8080/job/flex-utilities_installer/ws/flex-installer/deps/as3-simple-untar>
      [get] Getting: https://raw.githubusercontent.com/thdtjsdn/as3-simple-untar/master/src/de/ketzler/utils/SimpleUntar.as
      [get] To: <http://apacheflexbuild.cloudapp.net:8080/job/flex-utilities_installer/ws/flex-installer/deps/as3-simple-untar/LICENSE>
     [java] Could not generate timestamp: Remote host closed connection during handshake
     [java] Picked up JAVA_TOOL_OPTIONS: -Dfile.encoding=UTF8

BUILD FAILED
<http://apacheflexbuild.cloudapp.net:8080/job/flex-utilities_installer/ws/flex-installer/build.xml>:406: Java returned: 10

Total time: 1 minute 37 seconds
Picked up JAVA_TOOL_OPTIONS: -Dfile.encoding=UTF8
Build step 'Invoke Ant' marked build as failure
Archiving artifacts

Build failed in Jenkins: flex-utilities_installer #1074

Posted by fl...@gmail.com.
See <http://apacheflexbuild.cloudapp.net:8080/job/flex-utilities_installer/1074/>

------------------------------------------
Started by timer
Building remotely on flex_sdk_slave2 in workspace <http://apacheflexbuild.cloudapp.net:8080/job/flex-utilities_installer/ws/>
 > C:\Program Files (x86)\Git\cmd\git.exe rev-parse --is-inside-work-tree # timeout=10
Fetching changes from the remote Git repository
 > C:\Program Files (x86)\Git\cmd\git.exe config remote.origin.url https://git-wip-us.apache.org/repos/asf/flex-utilities.git # timeout=10
Fetching upstream changes from https://git-wip-us.apache.org/repos/asf/flex-utilities.git
 > C:\Program Files (x86)\Git\cmd\git.exe --version # timeout=10
 > C:\Program Files (x86)\Git\cmd\git.exe fetch --tags --progress https://git-wip-us.apache.org/repos/asf/flex-utilities.git +refs/heads/*:refs/remotes/origin/*
 > C:\Program Files (x86)\Git\cmd\git.exe rev-parse "origin/develop^{commit}" # timeout=10
Checking out Revision 30ef5fb36374060061739c402f55b3accc7aa019 (origin/develop)
 > C:\Program Files (x86)\Git\cmd\git.exe config core.sparsecheckout # timeout=10
 > C:\Program Files (x86)\Git\cmd\git.exe checkout -f 30ef5fb36374060061739c402f55b3accc7aa019
 > C:\Program Files (x86)\Git\cmd\git.exe rev-list 30ef5fb36374060061739c402f55b3accc7aa019 # timeout=10
[ant_on_air] $ cmd.exe /C "c:\Jenkins\tools\hudson.tasks.Ant_AntInstallation\c_apache-ant-1.9.3\bin\ant.bat -file build.xml -Dplayerglobal.version=11.7 main && exit %%ERRORLEVEL%%"
Buildfile: <http://apacheflexbuild.cloudapp.net:8080/job/flex-utilities_installer/ws/flex-installer/ant_on_air/build.xml>

clean:
   [delete] Deleting directory <http://apacheflexbuild.cloudapp.net:8080/job/flex-utilities_installer/ws/flex-installer/ant_on_air/bin>

init:

check-as3commons.swc:

get-as3commons.swc:

third-party:
      [get] Destination already exists (skipping): <http://apacheflexbuild.cloudapp.net:8080/job/flex-utilities_installer/ws/flex-installer/ant_on_air/external/de/ketzler/utils/SimpleUntar.as>
      [get] Destination already exists (skipping): <http://apacheflexbuild.cloudapp.net:8080/job/flex-utilities_installer/ws/flex-installer/ant_on_air/external/de/ketzler/utils/untar/UntarFileInfo.as>
      [get] Destination already exists (skipping): <http://apacheflexbuild.cloudapp.net:8080/job/flex-utilities_installer/ws/flex-installer/ant_on_air/external/de/ketzler/utils/untar/UntarHeaderBlock.as>
      [get] Destination already exists (skipping): <http://apacheflexbuild.cloudapp.net:8080/job/flex-utilities_installer/ws/flex-installer/ant_on_air/external/com/probertson/utils/CRC32Generator.as>
      [get] Destination already exists (skipping): <http://apacheflexbuild.cloudapp.net:8080/job/flex-utilities_installer/ws/flex-installer/ant_on_air/external/com/probertson/utils/GZIPBytesEncoder.as>
      [get] Destination already exists (skipping): <http://apacheflexbuild.cloudapp.net:8080/job/flex-utilities_installer/ws/flex-installer/ant_on_air/external/com/probertson/utils/GZIPEncoder.as>
      [get] Destination already exists (skipping): <http://apacheflexbuild.cloudapp.net:8080/job/flex-utilities_installer/ws/flex-installer/ant_on_air/external/com/probertson/utils/GZIPFile.as>

compile:
    [compc] Loading configuration file C:\Jenkins\workspace\flex-sdk\frameworks\air-config.xml
    [compc] Picked up JAVA_TOOL_OPTIONS: -Dfile.encoding=UTF8
    [compc] C:\Jenkins\workspace\flex-utilities_installer\flex-installer\ant_on_air\bin\ant_on_air.swc (134443 bytes)

test:
    [mxmlc] Loading configuration file C:\Jenkins\workspace\flex-sdk\frameworks\air-config.xml
    [mxmlc] C:\Jenkins\workspace\flex-utilities_installer\flex-installer\ant_on_air\tests\AntOnAir.swf (1147459 bytes)
    [mxmlc] Picked up JAVA_TOOL_OPTIONS: -Dfile.encoding=UTF8

failuretests:

main:

BUILD SUCCESSFUL
Total time: 1 minute 27 seconds
Picked up JAVA_TOOL_OPTIONS: -Dfile.encoding=UTF8
[flex-installer] $ cmd.exe /C "c:\Jenkins\tools\hudson.tasks.Ant_AntInstallation\c_apache-ant-1.9.3\bin\ant.bat -file build.xml -Dplayerglobal.version=11.7 clean build source-package create-md5s copy-misc && exit %%ERRORLEVEL%%"
Buildfile: <http://apacheflexbuild.cloudapp.net:8080/job/flex-utilities_installer/ws/flex-installer/build.xml>

clean:
   [delete] Deleting directory <http://apacheflexbuild.cloudapp.net:8080/job/flex-utilities_installer/ws/flex-installer/build>
   [delete] Deleting directory <http://apacheflexbuild.cloudapp.net:8080/job/flex-utilities_installer/ws/flex-installer/deps>
   [delete] Deleting directory <http://apacheflexbuild.cloudapp.net:8080/job/flex-utilities_installer/ws/flex-installer/installer/libs>
   [delete] Deleting directory <http://apacheflexbuild.cloudapp.net:8080/job/flex-utilities_installer/ws/flex-installer/release>

clean:

createDirs:
     [echo] ***************************************
     [echo] Execute the update-version target once,
     [echo] and only once, when you modifiy this app.
     [echo] This will increment the version number to allow
     [echo] the app to be updated by the AIR installer.
     [echo] ***************************************
     [echo]         
    [mkdir] Created dir: <http://apacheflexbuild.cloudapp.net:8080/job/flex-utilities_installer/ws/flex-installer/build>
    [mkdir] Created dir: <http://apacheflexbuild.cloudapp.net:8080/job/flex-utilities_installer/ws/flex-installer/release>

update-version-in-xml-files:
     [echo] version in InstallApacheFlex-app.xml will be 3.3.0

init:

certificate:

generate-certificate:
     [echo] Using cert temp.p12
     [java] Picked up JAVA_TOOL_OPTIONS: -Dfile.encoding=UTF8

check-as3commons.swc:

get-as3commons.swc:
    [mkdir] Created dir: <http://apacheflexbuild.cloudapp.net:8080/job/flex-utilities_installer/ws/flex-installer/installer/libs>
      [get] Getting: https://github.com/bigosmallm/MakeApacheFlexForFlashBuilder/blob/master/libs/as3commons-zip-1.0.0-alpha.1.swc?raw=true
      [get] To: <http://apacheflexbuild.cloudapp.net:8080/job/flex-utilities_installer/ws/flex-installer/installer/libs/as3commons-zip-1.0.0-alpha.1.swc>
      [get] https://github.com/bigosmallm/MakeApacheFlexForFlashBuilder/blob/master/libs/as3commons-zip-1.0.0-alpha.1.swc?raw=true moved to https://github.com/bigosmallm/MakeApacheFlexForFlashBuilder/raw/master/libs/as3commons-zip-1.0.0-alpha.1.swc
      [get] https://github.com/bigosmallm/MakeApacheFlexForFlashBuilder/raw/master/libs/as3commons-zip-1.0.0-alpha.1.swc moved to https://raw.githubusercontent.com/bigosmallm/MakeApacheFlexForFlashBuilder/master/libs/as3commons-zip-1.0.0-alpha.1.swc
      [get] .......

check-as3httpclient.swc:

get-as3httpclient.swc:
    [mkdir] Created dir: <http://apacheflexbuild.cloudapp.net:8080/job/flex-utilities_installer/ws/flex-installer/installer/libs/temp>
      [get] Getting: https://github.com/quetwo/as3httpclient/releases/download/1.0/as3httpclient.swc
      [get] To: <http://apacheflexbuild.cloudapp.net:8080/job/flex-utilities_installer/ws/flex-installer/installer/libs/as3httpclient.swc>
      [get] https://github.com/quetwo/as3httpclient/releases/download/1.0/as3httpclient.swc moved to https://github-cloud.s3.amazonaws.com/releases/36265618/8d35f30e-07bb-11e5-821c-8d47d0b898e1.swc?X-Amz-Algorithm=AWS4-HMAC-SHA256&X-Amz-Credential=AKIAISTNZFOVBIJMK3TQ%2F20170127%2Fus-east-1%2Fs3%2Faws4_request&X-Amz-Date=20170127T091159Z&X-Amz-Expires=300&X-Amz-Signature=2bc8e33ef25c36e22f22994c12bc441b20cf26e461d29fac5ab9182c3071deb1&X-Amz-SignedHeaders=host&actor_id=0&response-content-disposition=attachment%3B%20filename%3Das3httpclient.swc&response-content-type=application%2Foctet-stream

compile:
    [mxmlc] Loading configuration file C:\Jenkins\workspace\flex-sdk\frameworks\air-config.xml
    [mxmlc] C:\Jenkins\workspace\flex-utilities_installer\flex-installer\build\InstallApacheFlex.swf (1756698 bytes)
    [mxmlc] Picked up JAVA_TOOL_OPTIONS: -Dfile.encoding=UTF8

packageair:
     [echo] Using cert temp.p12
    [mkdir] Created dir: <http://apacheflexbuild.cloudapp.net:8080/job/flex-utilities_installer/ws/flex-installer/deps/as3httpclientlib>
      [get] Getting: https://raw.githubusercontent.com/quetwo/as3httpclient/as3httpclient-work/License.txt
      [get] To: <http://apacheflexbuild.cloudapp.net:8080/job/flex-utilities_installer/ws/flex-installer/deps/as3httpclientlib/License.txt>
    [mkdir] Created dir: <http://apacheflexbuild.cloudapp.net:8080/job/flex-utilities_installer/ws/flex-installer/deps/as3corelib>
      [get] Getting: https://raw.githubusercontent.com/mikechambers/as3corelib/master/README
      [get] To: <http://apacheflexbuild.cloudapp.net:8080/job/flex-utilities_installer/ws/flex-installer/deps/as3corelib/README>

check-as3crypto-license:

get-as3crypto-license:
    [mkdir] Created dir: <http://apacheflexbuild.cloudapp.net:8080/job/flex-utilities_installer/ws/flex-installer/deps/as3crypto/temp>
      [get] Getting: https://storage.googleapis.com/google-code-archive-downloads/v2/code.google.com/as3crypto/Crypto.zip
      [get] To: <http://apacheflexbuild.cloudapp.net:8080/job/flex-utilities_installer/ws/flex-installer/deps/as3crypto/temp/Crypto.zip>
    [unzip] Expanding: <http://apacheflexbuild.cloudapp.net:8080/job/flex-utilities_installer/ws/flex-installer/deps/as3crypto/temp/Crypto.zip> into <http://apacheflexbuild.cloudapp.net:8080/job/flex-utilities_installer/ws/flex-installer/deps/as3crypto>
   [delete] Deleting directory <http://apacheflexbuild.cloudapp.net:8080/job/flex-utilities_installer/ws/flex-installer/deps/as3crypto/temp>

simple-untar-license:
    [mkdir] Created dir: <http://apacheflexbuild.cloudapp.net:8080/job/flex-utilities_installer/ws/flex-installer/deps/as3-simple-untar>
      [get] Getting: https://raw.githubusercontent.com/thdtjsdn/as3-simple-untar/master/src/de/ketzler/utils/SimpleUntar.as
      [get] To: <http://apacheflexbuild.cloudapp.net:8080/job/flex-utilities_installer/ws/flex-installer/deps/as3-simple-untar/LICENSE>
     [java] Could not generate timestamp: Remote host closed connection during handshake
     [java] Picked up JAVA_TOOL_OPTIONS: -Dfile.encoding=UTF8

BUILD FAILED
<http://apacheflexbuild.cloudapp.net:8080/job/flex-utilities_installer/ws/flex-installer/build.xml>:406: Java returned: 10

Total time: 1 minute 47 seconds
Picked up JAVA_TOOL_OPTIONS: -Dfile.encoding=UTF8
Build step 'Invoke Ant' marked build as failure
Archiving artifacts

Build failed in Jenkins: flex-utilities_installer #1073

Posted by fl...@gmail.com.
See <http://apacheflexbuild.cloudapp.net:8080/job/flex-utilities_installer/1073/>

------------------------------------------
Started by timer
Building remotely on flex_sdk_slave2 in workspace <http://apacheflexbuild.cloudapp.net:8080/job/flex-utilities_installer/ws/>
 > C:\Program Files (x86)\Git\cmd\git.exe rev-parse --is-inside-work-tree # timeout=10
Fetching changes from the remote Git repository
 > C:\Program Files (x86)\Git\cmd\git.exe config remote.origin.url https://git-wip-us.apache.org/repos/asf/flex-utilities.git # timeout=10
Fetching upstream changes from https://git-wip-us.apache.org/repos/asf/flex-utilities.git
 > C:\Program Files (x86)\Git\cmd\git.exe --version # timeout=10
 > C:\Program Files (x86)\Git\cmd\git.exe fetch --tags --progress https://git-wip-us.apache.org/repos/asf/flex-utilities.git +refs/heads/*:refs/remotes/origin/*
 > C:\Program Files (x86)\Git\cmd\git.exe rev-parse "origin/develop^{commit}" # timeout=10
Checking out Revision 30ef5fb36374060061739c402f55b3accc7aa019 (origin/develop)
 > C:\Program Files (x86)\Git\cmd\git.exe config core.sparsecheckout # timeout=10
 > C:\Program Files (x86)\Git\cmd\git.exe checkout -f 30ef5fb36374060061739c402f55b3accc7aa019
 > C:\Program Files (x86)\Git\cmd\git.exe rev-list 30ef5fb36374060061739c402f55b3accc7aa019 # timeout=10
[ant_on_air] $ cmd.exe /C "c:\Jenkins\tools\hudson.tasks.Ant_AntInstallation\c_apache-ant-1.9.3\bin\ant.bat -file build.xml -Dplayerglobal.version=11.7 main && exit %%ERRORLEVEL%%"
Buildfile: <http://apacheflexbuild.cloudapp.net:8080/job/flex-utilities_installer/ws/flex-installer/ant_on_air/build.xml>

clean:
   [delete] Deleting directory <http://apacheflexbuild.cloudapp.net:8080/job/flex-utilities_installer/ws/flex-installer/ant_on_air/bin>

init:

check-as3commons.swc:

get-as3commons.swc:

third-party:
      [get] Destination already exists (skipping): <http://apacheflexbuild.cloudapp.net:8080/job/flex-utilities_installer/ws/flex-installer/ant_on_air/external/de/ketzler/utils/SimpleUntar.as>
      [get] Destination already exists (skipping): <http://apacheflexbuild.cloudapp.net:8080/job/flex-utilities_installer/ws/flex-installer/ant_on_air/external/de/ketzler/utils/untar/UntarFileInfo.as>
      [get] Destination already exists (skipping): <http://apacheflexbuild.cloudapp.net:8080/job/flex-utilities_installer/ws/flex-installer/ant_on_air/external/de/ketzler/utils/untar/UntarHeaderBlock.as>
      [get] Destination already exists (skipping): <http://apacheflexbuild.cloudapp.net:8080/job/flex-utilities_installer/ws/flex-installer/ant_on_air/external/com/probertson/utils/CRC32Generator.as>
      [get] Destination already exists (skipping): <http://apacheflexbuild.cloudapp.net:8080/job/flex-utilities_installer/ws/flex-installer/ant_on_air/external/com/probertson/utils/GZIPBytesEncoder.as>
      [get] Destination already exists (skipping): <http://apacheflexbuild.cloudapp.net:8080/job/flex-utilities_installer/ws/flex-installer/ant_on_air/external/com/probertson/utils/GZIPEncoder.as>
      [get] Destination already exists (skipping): <http://apacheflexbuild.cloudapp.net:8080/job/flex-utilities_installer/ws/flex-installer/ant_on_air/external/com/probertson/utils/GZIPFile.as>

compile:
    [compc] Loading configuration file C:\Jenkins\workspace\flex-sdk\frameworks\air-config.xml
    [compc] C:\Jenkins\workspace\flex-utilities_installer\flex-installer\ant_on_air\bin\ant_on_air.swc (134440 bytes)
    [compc] Picked up JAVA_TOOL_OPTIONS: -Dfile.encoding=UTF8

test:
    [mxmlc] Loading configuration file C:\Jenkins\workspace\flex-sdk\frameworks\air-config.xml
    [mxmlc] C:\Jenkins\workspace\flex-utilities_installer\flex-installer\ant_on_air\tests\AntOnAir.swf (1147465 bytes)
    [mxmlc] Picked up JAVA_TOOL_OPTIONS: -Dfile.encoding=UTF8

failuretests:

main:

BUILD SUCCESSFUL
Total time: 1 minute 30 seconds
Picked up JAVA_TOOL_OPTIONS: -Dfile.encoding=UTF8
[flex-installer] $ cmd.exe /C "c:\Jenkins\tools\hudson.tasks.Ant_AntInstallation\c_apache-ant-1.9.3\bin\ant.bat -file build.xml -Dplayerglobal.version=11.7 clean build source-package create-md5s copy-misc && exit %%ERRORLEVEL%%"
Buildfile: <http://apacheflexbuild.cloudapp.net:8080/job/flex-utilities_installer/ws/flex-installer/build.xml>

clean:
   [delete] Deleting directory <http://apacheflexbuild.cloudapp.net:8080/job/flex-utilities_installer/ws/flex-installer/build>
   [delete] Deleting directory <http://apacheflexbuild.cloudapp.net:8080/job/flex-utilities_installer/ws/flex-installer/deps>
   [delete] Deleting directory <http://apacheflexbuild.cloudapp.net:8080/job/flex-utilities_installer/ws/flex-installer/installer/libs>
   [delete] Deleting directory <http://apacheflexbuild.cloudapp.net:8080/job/flex-utilities_installer/ws/flex-installer/release>

clean:

createDirs:
     [echo] ***************************************
     [echo] Execute the update-version target once,
     [echo] and only once, when you modifiy this app.
     [echo] This will increment the version number to allow
     [echo] the app to be updated by the AIR installer.
     [echo] ***************************************
     [echo]         
    [mkdir] Created dir: <http://apacheflexbuild.cloudapp.net:8080/job/flex-utilities_installer/ws/flex-installer/build>
    [mkdir] Created dir: <http://apacheflexbuild.cloudapp.net:8080/job/flex-utilities_installer/ws/flex-installer/release>

update-version-in-xml-files:
     [echo] version in InstallApacheFlex-app.xml will be 3.3.0

init:

certificate:

generate-certificate:
     [echo] Using cert temp.p12
     [java] Picked up JAVA_TOOL_OPTIONS: -Dfile.encoding=UTF8

check-as3commons.swc:

get-as3commons.swc:
    [mkdir] Created dir: <http://apacheflexbuild.cloudapp.net:8080/job/flex-utilities_installer/ws/flex-installer/installer/libs>
      [get] Getting: https://github.com/bigosmallm/MakeApacheFlexForFlashBuilder/blob/master/libs/as3commons-zip-1.0.0-alpha.1.swc?raw=true
      [get] To: <http://apacheflexbuild.cloudapp.net:8080/job/flex-utilities_installer/ws/flex-installer/installer/libs/as3commons-zip-1.0.0-alpha.1.swc>
      [get] https://github.com/bigosmallm/MakeApacheFlexForFlashBuilder/blob/master/libs/as3commons-zip-1.0.0-alpha.1.swc?raw=true moved to https://github.com/bigosmallm/MakeApacheFlexForFlashBuilder/raw/master/libs/as3commons-zip-1.0.0-alpha.1.swc
      [get] https://github.com/bigosmallm/MakeApacheFlexForFlashBuilder/raw/master/libs/as3commons-zip-1.0.0-alpha.1.swc moved to https://raw.githubusercontent.com/bigosmallm/MakeApacheFlexForFlashBuilder/master/libs/as3commons-zip-1.0.0-alpha.1.swc
      [get] .......

check-as3httpclient.swc:

get-as3httpclient.swc:
    [mkdir] Created dir: <http://apacheflexbuild.cloudapp.net:8080/job/flex-utilities_installer/ws/flex-installer/installer/libs/temp>
      [get] Getting: https://github.com/quetwo/as3httpclient/releases/download/1.0/as3httpclient.swc
      [get] To: <http://apacheflexbuild.cloudapp.net:8080/job/flex-utilities_installer/ws/flex-installer/installer/libs/as3httpclient.swc>
      [get] https://github.com/quetwo/as3httpclient/releases/download/1.0/as3httpclient.swc moved to https://github-cloud.s3.amazonaws.com/releases/36265618/8d35f30e-07bb-11e5-821c-8d47d0b898e1.swc?X-Amz-Algorithm=AWS4-HMAC-SHA256&X-Amz-Credential=AKIAISTNZFOVBIJMK3TQ%2F20170126%2Fus-east-1%2Fs3%2Faws4_request&X-Amz-Date=20170126T091207Z&X-Amz-Expires=300&X-Amz-Signature=cbde5ecf1c67afc7aa1159a2982ce3632b8879165959233341ae25666b4e55eb&X-Amz-SignedHeaders=host&actor_id=0&response-content-disposition=attachment%3B%20filename%3Das3httpclient.swc&response-content-type=application%2Foctet-stream

compile:
    [mxmlc] Loading configuration file C:\Jenkins\workspace\flex-sdk\frameworks\air-config.xml
    [mxmlc] C:\Jenkins\workspace\flex-utilities_installer\flex-installer\build\InstallApacheFlex.swf (1756701 bytes)
    [mxmlc] Picked up JAVA_TOOL_OPTIONS: -Dfile.encoding=UTF8

packageair:
     [echo] Using cert temp.p12
    [mkdir] Created dir: <http://apacheflexbuild.cloudapp.net:8080/job/flex-utilities_installer/ws/flex-installer/deps/as3httpclientlib>
      [get] Getting: https://raw.githubusercontent.com/quetwo/as3httpclient/as3httpclient-work/License.txt
      [get] To: <http://apacheflexbuild.cloudapp.net:8080/job/flex-utilities_installer/ws/flex-installer/deps/as3httpclientlib/License.txt>
    [mkdir] Created dir: <http://apacheflexbuild.cloudapp.net:8080/job/flex-utilities_installer/ws/flex-installer/deps/as3corelib>
      [get] Getting: https://raw.githubusercontent.com/mikechambers/as3corelib/master/README
      [get] To: <http://apacheflexbuild.cloudapp.net:8080/job/flex-utilities_installer/ws/flex-installer/deps/as3corelib/README>

check-as3crypto-license:

get-as3crypto-license:
    [mkdir] Created dir: <http://apacheflexbuild.cloudapp.net:8080/job/flex-utilities_installer/ws/flex-installer/deps/as3crypto/temp>
      [get] Getting: https://storage.googleapis.com/google-code-archive-downloads/v2/code.google.com/as3crypto/Crypto.zip
      [get] To: <http://apacheflexbuild.cloudapp.net:8080/job/flex-utilities_installer/ws/flex-installer/deps/as3crypto/temp/Crypto.zip>
    [unzip] Expanding: <http://apacheflexbuild.cloudapp.net:8080/job/flex-utilities_installer/ws/flex-installer/deps/as3crypto/temp/Crypto.zip> into <http://apacheflexbuild.cloudapp.net:8080/job/flex-utilities_installer/ws/flex-installer/deps/as3crypto>
   [delete] Deleting directory <http://apacheflexbuild.cloudapp.net:8080/job/flex-utilities_installer/ws/flex-installer/deps/as3crypto/temp>

simple-untar-license:
    [mkdir] Created dir: <http://apacheflexbuild.cloudapp.net:8080/job/flex-utilities_installer/ws/flex-installer/deps/as3-simple-untar>
      [get] Getting: https://raw.githubusercontent.com/thdtjsdn/as3-simple-untar/master/src/de/ketzler/utils/SimpleUntar.as
      [get] To: <http://apacheflexbuild.cloudapp.net:8080/job/flex-utilities_installer/ws/flex-installer/deps/as3-simple-untar/LICENSE>
     [java] Could not generate timestamp: Remote host closed connection during handshake
     [java] Picked up JAVA_TOOL_OPTIONS: -Dfile.encoding=UTF8

BUILD FAILED
<http://apacheflexbuild.cloudapp.net:8080/job/flex-utilities_installer/ws/flex-installer/build.xml>:406: Java returned: 10

Total time: 1 minute 43 seconds
Picked up JAVA_TOOL_OPTIONS: -Dfile.encoding=UTF8
Build step 'Invoke Ant' marked build as failure
Archiving artifacts