You are viewing a plain text version of this content. The canonical link for it is here.
Posted to builds@beam.apache.org by Apache Jenkins Server <je...@builds.apache.org> on 2023/06/15 02:06:48 UTC
Build failed in Jenkins: beam_PostCommit_Java_VR_Dataflow_V2_Streaming #3593
See <https://ci-beam.apache.org/job/beam_PostCommit_Java_VR_Dataflow_V2_Streaming/3593/display/redirect?page=changes>
Changes:
[noreply] Initial implementation of QuotaEvent (#27078)
------------------------------------------
[...truncated 57.46 KB...]
0 0 0 0 0 0 0 0 --:--:-- --:--:-- --:--:-- 0version.txt
NOTICES
profiler_java_agent.so
100 4182k 100 4182k 0 0 24.1M 0 --:--:-- --:--:-- --:--:-- 24.1M
> Task :sdks:java:container:goPrepare UP-TO-DATE
> Task :release:go-licenses:java:dockerRun
+ go-licenses csv github.com/apache/beam/sdks/v2/java/container
+ tee /output/licenses/list.csv
W0614 18:45:10.011035 76 library.go:101] "golang.org/x/sys/unix" contains non-Go code that can't be inspected for further dependencies:
/go/pkg/mod/golang.org/x/sys@v0.8.0/unix/asm_linux_amd64.s
> Task :sdks:java:container:goBuild
/home/jenkins/go/bin/go1.20.4 build -o ./build/target/linux_amd64/boot boot.go boot_test.go pathingjar.go pathingjar_test.go
> Task :sdks:java:container:java8:copySdkHarnessLauncher
Execution optimizations have been disabled for task ':sdks:java:container:java8:copySdkHarnessLauncher' to ensure correctness due to the following reasons:
- Gradle detected a problem with the following location: '<https://ci-beam.apache.org/job/beam_PostCommit_Java_VR_Dataflow_V2_Streaming/ws/src/sdks/java/container/build/target'.> Reason: Task ':sdks:java:container:java8:copySdkHarnessLauncher' uses this output of task ':sdks:java:container:pullLicenses' without declaring an explicit or implicit dependency. This can lead to incorrect results being produced, depending on what order the tasks are executed. Please refer to https://docs.gradle.org/7.5.1/userguide/validation_problems.html#implicit_dependency for more details about this problem.
> Task :release:go-licenses:java:dockerRun
github.com/apache/beam/sdks/v2/go,https://github.com/apache/beam/blob/sdks/v2.48.2/sdks/go/README.md,Apache-2.0
github.com/apache/beam/sdks/v2/java/container,https://github.com/apache/beam/blob/sdks/v2.48.2/sdks/LICENSE,Apache-2.0
github.com/golang/protobuf,https://github.com/golang/protobuf/blob/v1.5.3/LICENSE,BSD-3-Clause
golang.org/x/net,https://cs.opensource.google/go/x/net/+/v0.10.0:LICENSE,BSD-3-Clause
golang.org/x/sys/unix,https://cs.opensource.google/go/x/sys/+/v0.8.0:LICENSE,BSD-3-Clause
golang.org/x/text,https://cs.opensource.google/go/x/text/+/v0.9.0:LICENSE,BSD-3-Clause
google.golang.org/genproto/googleapis/rpc/status,https://github.com/googleapis/go-genproto/blob/daa745c078e1/LICENSE,Apache-2.0
google.golang.org/grpc,https://github.com/grpc/grpc-go/blob/v1.55.0/LICENSE,Apache-2.0
google.golang.org/protobuf,https://github.com/protocolbuffers/protobuf-go/blob/v1.30.0/LICENSE,BSD-3-Clause
+ chmod -R a+w /output/licenses
> Task :release:go-licenses:java:createLicenses
> Task :sdks:java:container:java8:copyGolangLicenses
> Task :sdks:java:harness:compileJava
Note: Some input files use or override a deprecated API.
Note: Recompile with -Xlint:deprecation for details.
Note: Some input files use unchecked or unsafe operations.
Note: Recompile with -Xlint:unchecked for details.
> Task :sdks:java:harness:classes
> Task :sdks:java:harness:jar
> Task :runners:java-fn-execution:compileJava FROM-CACHE
> Task :runners:java-fn-execution:classes UP-TO-DATE
> Task :runners:java-fn-execution:jar
> Task :sdks:java:expansion-service:compileJava FROM-CACHE
> Task :sdks:java:expansion-service:classes UP-TO-DATE
> Task :sdks:java:expansion-service:jar
> Task :runners:direct-java:compileJava FROM-CACHE
> Task :runners:direct-java:classes UP-TO-DATE
> Task :sdks:java:io:kafka:compileJava FROM-CACHE
> Task :sdks:java:io:kafka:classes UP-TO-DATE
> Task :sdks:java:io:kafka:jar
> Task :runners:direct-java:shadowJar FROM-CACHE
> Task :runners:direct-java:compileTestJava FROM-CACHE
> Task :runners:direct-java:testClasses UP-TO-DATE
> Task :sdks:java:io:google-cloud-platform:compileJava FROM-CACHE
> Task :sdks:java:io:google-cloud-platform:classes UP-TO-DATE
> Task :runners:direct-java:shadowTestJar FROM-CACHE
> Task :sdks:java:io:google-cloud-platform:jar
> Task :runners:google-cloud-dataflow-java:compileJava FROM-CACHE
> Task :runners:google-cloud-dataflow-java:classes
> Task :runners:google-cloud-dataflow-java:jar
> Task :sdks:java:harness:shadowJar
> Task :sdks:java:container:java8:copyDockerfileDependencies
> Task :sdks:java:io:google-cloud-platform:compileTestJava FROM-CACHE
> Task :sdks:java:io:google-cloud-platform:testClasses
> Task :sdks:java:container:java8:dockerPrepare
> Task :sdks:java:io:google-cloud-platform:testJar
> Task :runners:google-cloud-dataflow-java:compileTestJava FROM-CACHE
> Task :runners:google-cloud-dataflow-java:testClasses UP-TO-DATE
> Task :runners:google-cloud-dataflow-java:testJar
> Task :sdks:java:container:java8:docker
#1 [internal] load build definition from Dockerfile
#1 transferring dockerfile: 2.58kB done
#1 DONE 0.0s
#2 [internal] load .dockerignore
#2 transferring context: 2B done
#2 DONE 0.0s
#3 [internal] load metadata for docker.io/library/eclipse-temurin:8
#3 DONE 0.0s
#4 [ 1/16] FROM docker.io/library/eclipse-temurin:8
#4 CACHED
#5 [internal] load build context
#5 transferring context: 46.86MB 0.4s done
#5 DONE 0.4s
#6 [ 2/16] ADD target/slf4j-api.jar /opt/apache/beam/jars/
#6 DONE 3.5s
#7 [ 3/16] ADD target/slf4j-jdk14.jar /opt/apache/beam/jars/
#7 DONE 0.1s
#8 [ 4/16] ADD target/jcl-over-slf4j.jar /opt/apache/beam/jars/
#8 DONE 0.0s
#9 [ 5/16] ADD target/log4j-over-slf4j.jar /opt/apache/beam/jars/
#9 DONE 0.0s
#10 [ 6/16] ADD target/log4j-to-slf4j.jar /opt/apache/beam/jars/
#10 DONE 0.1s
#11 [ 7/16] ADD target/beam-sdks-java-harness.jar /opt/apache/beam/jars/
#11 DONE 0.1s
#12 [ 8/16] COPY target/jamm.jar target/open-module-agent*.jar /opt/apache/beam/jars/
#12 DONE 0.1s
#13 [ 9/16] COPY target/linux_amd64/boot /opt/apache/beam/
#13 DONE 0.2s
#14 [10/16] COPY target/LICENSE /opt/apache/beam/
#14 DONE 0.1s
#15 [11/16] COPY target/NOTICE /opt/apache/beam/
#15 DONE 0.0s
#16 [12/16] ADD target/third_party_licenses /opt/apache/beam/third_party_licenses/
#16 DONE 0.2s
#17 [13/16] COPY target/LICENSE target/options/* /opt/apache/beam/options/
#17 DONE 0.1s
#18 [14/16] COPY target/go-licenses/* /opt/apache/beam/third_party_licenses/golang/
#18 DONE 0.1s
#19 [15/16] RUN if [ "true" = "false" ] ; then rm -rf /opt/apache/beam/third_party_licenses ; fi
#19 DONE 0.3s
#20 [16/16] COPY target/profiler/* /opt/google_cloud_profiler/
#20 DONE 0.1s
#21 exporting to image
#21 exporting layers
#21 exporting layers 0.2s done
#21 writing image sha256:9b9bd9919cf5da52cf59710103c642d77f60bcada14983bdae6b23400faca78a
#21 writing image sha256:9b9bd9919cf5da52cf59710103c642d77f60bcada14983bdae6b23400faca78a done
#21 naming to docker.io/apache/beam_java8_sdk:2.49.0.dev done
#21 DONE 0.2s
> Task :runners:google-cloud-dataflow-java:buildAndPushDockerJavaContainer
WARNING: `gcloud docker` will not be supported for Docker client versions above 18.03.
As an alternative, use `gcloud auth configure-docker` to configure `docker` to
use `gcloud` as a credential helper, then use `docker` as you would for non-GCR
registries, e.g. `docker pull gcr.io/project-id/my-image`. Add
`--verbosity=error` to silence this warning: `gcloud docker
--verbosity=error -- pull gcr.io/project-id/my-image`.
See: https://cloud.google.com/container-registry/docs/support/deprecation-notices#gcloud-docker
The push refers to repository [us.gcr.io/apache-beam-testing/java-postcommit-it/java]
77dce7c73c71: Preparing
5f70bf18a086: Preparing
7a09922196fe: Preparing
67d5c0fce0c3: Preparing
86d9c530b3a1: Preparing
c027548f105d: Preparing
83827f6fa56d: Preparing
d40518083dc2: Preparing
9b7286fbc732: Preparing
c2064be12884: Preparing
5067d1897982: Preparing
5a853e13f4bd: Preparing
bd02641cd4ae: Preparing
b6369afa5e4e: Preparing
020a15e5409b: Preparing
71d1336de2c6: Preparing
b1b704e31e12: Preparing
dd23345671cc: Preparing
966e94ab6e16: Preparing
c027548f105d: Waiting
83827f6fa56d: Waiting
5067d1897982: Waiting
5a853e13f4bd: Waiting
bd02641cd4ae: Waiting
966e94ab6e16: Waiting
dd23345671cc: Waiting
71d1336de2c6: Waiting
b6369afa5e4e: Waiting
020a15e5409b: Waiting
b1b704e31e12: Waiting
c2064be12884: Waiting
9b7286fbc732: Waiting
5f70bf18a086: Layer already exists
7a09922196fe: Pushed
c027548f105d: Pushed
67d5c0fce0c3: Pushed
77dce7c73c71: Pushed
9b7286fbc732: Pushed
83827f6fa56d: Pushed
86d9c530b3a1: Pushed
d40518083dc2: Pushed
c2064be12884: Pushed
5067d1897982: Pushed
71d1336de2c6: Layer already exists
b1b704e31e12: Layer already exists
dd23345671cc: Layer already exists
966e94ab6e16: Layer already exists
5a853e13f4bd: Pushed
bd02641cd4ae: Pushed
b6369afa5e4e: Pushed
020a15e5409b: Pushed
20230614184444: digest: sha256:4917afde22f5f63765910779adcb4a94e8983c7cbcd283ab063da3003789300b size: 4296
> Task :runners:google-cloud-dataflow-java:validatesRunnerV2TestStreaming
org.apache.beam.sdk.transforms.ParDoTest$StateTests > testBagStateSideInput FAILED
java.lang.RuntimeException at ParDoTest.java:3583
283 tests completed, 1 failed, 3 skipped
> Task :runners:google-cloud-dataflow-java:validatesRunnerV2TestStreaming FAILED
FAILURE: Build failed with an exception.
* What went wrong:
Execution failed for task ':runners:google-cloud-dataflow-java:validatesRunnerV2TestStreaming'.
> There were failing tests. See the report at: file://<https://ci-beam.apache.org/job/beam_PostCommit_Java_VR_Dataflow_V2_Streaming/ws/src/runners/google-cloud-dataflow-java/build/reports/tests/validatesRunnerV2TestStreaming/index.html>
* Try:
> Run with --stacktrace option to get the stack trace.
> Run with --info or --debug option to get more log output.
* Get more help at https://help.gradle.org
Deprecated Gradle features were used in this build, making it incompatible with Gradle 8.0.
You can use '--warning-mode all' to show the individual deprecation warnings and determine if they come from your own scripts or plugins.
See https://docs.gradle.org/7.5.1/userguide/command_line_interface.html#sec:command_line_warnings
Execution optimizations have been disabled for 1 invalid unit(s) of work during this build to ensure correctness.
Please consult deprecation warnings for more details.
BUILD FAILED in 7h 22m 16s
152 actionable tasks: 98 executed, 50 from cache, 4 up-to-date
Publishing build scan...
https://ge.apache.org/s/3svdwbso7uis6
Build step 'Invoke Gradle script' changed build result to FAILURE
Build step 'Invoke Gradle script' marked build as failure
---------------------------------------------------------------------
To unsubscribe, e-mail: builds-unsubscribe@beam.apache.org
For additional commands, e-mail: builds-help@beam.apache.org
Jenkins build is back to normal : beam_PostCommit_Java_VR_Dataflow_V2_Streaming #3594
Posted by Apache Jenkins Server <je...@builds.apache.org>.
See <https://ci-beam.apache.org/job/beam_PostCommit_Java_VR_Dataflow_V2_Streaming/3594/display/redirect>
---------------------------------------------------------------------
To unsubscribe, e-mail: builds-unsubscribe@beam.apache.org
For additional commands, e-mail: builds-help@beam.apache.org