You are viewing a plain text version of this content. The canonical link for it is here.
Posted to commits@tuscany.apache.org by Apache Hudson Server <hu...@hudson.zones.apache.org> on 2009/11/18 01:44:34 UTC

Build failed in Hudson: Tuscany-2x » Apache Tuscany SCA Web JavaScript for DOJO #304

See <http://hudson.zones.apache.org/hudson/job/Tuscany-2x/org.apache.tuscany.sca$tuscany-web-javascript-dojo/304/>

------------------------------------------
[INFO] ------------------------------------------------------------------------
[INFO] Building Apache Tuscany SCA Web JavaScript for DOJO
[INFO]    task-segment: [clean, install]
[INFO] ------------------------------------------------------------------------
[INFO] [clean:clean]
[INFO] Deleting directory <http://hudson.zones.apache.org/hudson/job/Tuscany-2x/org.apache.tuscany.sca$tuscany-web-javascript-dojo/ws/target>
[INFO] [antrun:run {execution: clean-dojo-files}]
[INFO] Executing tasks

clean-dojo-files:
[INFO] Executed tasks
[INFO] [antrun:run {execution: install-dojo}]
[INFO] Executing tasks

check-dojo-installed:

install-dojo:
    [mkdir] Created dir: <http://hudson.zones.apache.org/hudson/job/Tuscany-2x/org.apache.tuscany.sca$tuscany-web-javascript-dojo/ws/target/dojo-download>
      [get] Getting: http://download.dojotoolkit.org/release-1.3.0/dojo-release-1.3.0.zip
      [get] To: <http://hudson.zones.apache.org/hudson/job/Tuscany-2x/org.apache.tuscany.sca$tuscany-web-javascript-dojo/ws/target/dojo-download/dojo-release-1.3.0.zip>
..............................................................................................................
      [get] last modified = Thu Mar 26 16:18:16 UTC 2009
[HUDSON] Archiving <http://hudson.zones.apache.org/hudson/job/Tuscany-2x/org.apache.tuscany.sca$tuscany-web-javascript-dojo/ws/pom.xml> to /export/home/hudson/hudson/jobs/Tuscany-2x/modules/org.apache.tuscany.sca$tuscany-web-javascript-dojo/builds/2009-11-18_00-37-38/archive/org.apache.tuscany.sca/tuscany-web-javascript-dojo/2.0-SNAPSHOT/pom.xml
[INFO] ------------------------------------------------------------------------
[ERROR] BUILD ERROR
[INFO] ------------------------------------------------------------------------
[INFO] An Ant BuildException has occured: The following error occurred while executing this line:
<http://hudson.zones.apache.org/hudson/job/Tuscany-2x/org.apache.tuscany.sca$tuscany-web-javascript-dojo/ws/build-dojo.xml>:52: Execute failed: java.io.IOException: Cannot run program "mvn" (in directory "<http://hudson.zones.apache.org/hudson/job/Tuscany-2x/org.apache.tuscany.sca$tuscany-web-javascript-dojo/ws/")>: error=2, No such file or directory

[INFO] ------------------------------------------------------------------------
[INFO] For more information, run Maven with the -e switch
[INFO] ------------------------------------------------------------------------
[INFO] Total time: 6 minutes 44 seconds
[INFO] Finished at: Wed Nov 18 00:44:29 UTC 2009
[INFO] Final Memory: 66M/752M
[INFO] ------------------------------------------------------------------------


Build failed in Hudson: Tuscany-2x » Apache Tuscany SCA Web JavaScript for DOJO #305

Posted by Apache Hudson Server <hu...@hudson.zones.apache.org>.
See <http://hudson.zones.apache.org/hudson/job/Tuscany-2x/org.apache.tuscany.sca$tuscany-web-javascript-dojo/305/>

------------------------------------------
[INFO] ------------------------------------------------------------------------
[INFO] Building Apache Tuscany SCA Web JavaScript for DOJO
[INFO]    task-segment: [clean, install]
[INFO] ------------------------------------------------------------------------
[INFO] [clean:clean]
[INFO] Deleting directory <http://hudson.zones.apache.org/hudson/job/Tuscany-2x/org.apache.tuscany.sca$tuscany-web-javascript-dojo/ws/target>
[INFO] [antrun:run {execution: clean-dojo-files}]
[INFO] Executing tasks

clean-dojo-files:
[INFO] Executed tasks
[INFO] [antrun:run {execution: install-dojo}]
[INFO] Executing tasks

check-dojo-installed:

install-dojo:
    [mkdir] Created dir: <http://hudson.zones.apache.org/hudson/job/Tuscany-2x/org.apache.tuscany.sca$tuscany-web-javascript-dojo/ws/target/dojo-download>
      [get] Getting: http://download.dojotoolkit.org/release-1.3.0/dojo-release-1.3.0.zip
      [get] To: <http://hudson.zones.apache.org/hudson/job/Tuscany-2x/org.apache.tuscany.sca$tuscany-web-javascript-dojo/ws/target/dojo-download/dojo-release-1.3.0.zip>
................................................................................................................
      [get] last modified = Thu Mar 26 16:18:16 UTC 2009
[HUDSON] Archiving <http://hudson.zones.apache.org/hudson/job/Tuscany-2x/org.apache.tuscany.sca$tuscany-web-javascript-dojo/ws/pom.xml> to /export/home/hudson/hudson/jobs/Tuscany-2x/modules/org.apache.tuscany.sca$tuscany-web-javascript-dojo/builds/2009-11-19_00-20-13/archive/org.apache.tuscany.sca/tuscany-web-javascript-dojo/2.0-SNAPSHOT/pom.xml
[INFO] ------------------------------------------------------------------------
[ERROR] BUILD ERROR
[INFO] ------------------------------------------------------------------------
[INFO] An Ant BuildException has occured: The following error occurred while executing this line:
<http://hudson.zones.apache.org/hudson/job/Tuscany-2x/org.apache.tuscany.sca$tuscany-web-javascript-dojo/ws/build-dojo.xml>:52: Execute failed: java.io.IOException: Cannot run program "mvn" (in directory "<http://hudson.zones.apache.org/hudson/job/Tuscany-2x/org.apache.tuscany.sca$tuscany-web-javascript-dojo/ws/")>: error=2, No such file or directory

[INFO] ------------------------------------------------------------------------
[INFO] For more information, run Maven with the -e switch
[INFO] ------------------------------------------------------------------------
[INFO] Total time: 6 minutes 48 seconds
[INFO] Finished at: Thu Nov 19 00:27:07 UTC 2009
[INFO] Final Memory: 66M/751M
[INFO] ------------------------------------------------------------------------