You are viewing a plain text version of this content. The canonical link for it is here.
Posted to builds@cassandra.apache.org by Apache Jenkins Server <je...@builds.apache.org> on 2025/10/14 08:42:36 UTC

Build complete: Cassandra-5.0 #519 [UNSTABLE] 98e7cd5d999f9e6d9323bc8d4301751814b66059

-------------------------------------------------------------------------------
  Build Cassandra-5.0 #519 Still Unstable
  URL: https://ci-cassandra.apache.org/job/Cassandra-5.0/519/
  -------------------------------------------------------------------------------
  Changes:
  [Caleb Rackliffe] Flush SAI segment builder when current SSTable writer is switched


  -------------------------------------------------------------------------------
  Failed Tests:
  16 tests failed.
FAILED:  dtest-novnode.rebuild_test.TestRebuild.Tests / dtest-novnode jdk17 24/64 / test_simple_rebuild
FAILED:  dtest-upgrade-large.upgrade_tests.upgrade_through_versions_test.TestProtoV4Upgrade_AllVersions_RandomPartitioner_EndsAt_Trunk_HEAD.Tests / dtest-upgrade-large jdk11 18/32 / test_rolling_upgrade
FAILED:  dtest-upgrade-novnode.upgrade_tests.cql_tests.TestCQLNodes3RF3_Upgrade_current_4_1_x_To_indev_5_0_x.Tests / dtest-upgrade-novnode jdk11 7/128 / test_composite_index_collections
FAILED:  dtest-upgrade-novnode.upgrade_tests.cql_tests.TestCQLNodes3RF3_Upgrade_indev_4_0_x_To_indev_5_0_x.Tests / dtest-upgrade-novnode jdk11 35/128 / test_order_by_multikey
FAILED:  dtest-upgrade.upgrade_tests.cql_tests.TestCQLNodes3RF3_Upgrade_current_4_1_x_To_indev_5_0_x.Tests / dtest-upgrade jdk11 45/128 / test_SIM_assertion_error
FAILED:  dtest-upgrade.upgrade_tests.cql_tests.TestCQLNodes3RF3_Upgrade_current_5_0_x_To_indev_5_0_x.Tests / dtest-upgrade jdk11 55/128 / test_SIM_assertion_error
FAILED:  dtest-upgrade.upgrade_tests.cql_tests.TestCQLNodes3RF3_Upgrade_current_5_0_x_To_indev_5_0_x.Tests / dtest-upgrade jdk11 24/128 / test_intersection_logic_returns_empty_result
FAILED:  dtest-upgrade.upgrade_tests.cql_tests.TestCQLNodes3RF3_Upgrade_current_5_0_x_To_indev_5_0_x.Tests / dtest-upgrade jdk11 66/128 / test_simple_tuple_query
FAILED:  dtest-upgrade.upgrade_tests.cql_tests.TestCQLNodes3RF3_Upgrade_current_5_0_x_To_indev_5_0_x.Tests / dtest-upgrade jdk11 83/128 / test_token_range
FAILED:  dtest.bootstrap_test.TestBootstrap.Tests / dtest jdk11 2/64 / test_read_from_bootstrapped_node
FAILED:  org.apache.cassandra.distributed.test.CASTest.Tests / jvm-dtest jdk17 4/12 / fastReadsAndFailedWrites-_jdk17_x86_64
FAILED:  org.apache.cassandra.io.sstable.format.bti.PartitionIndexTest.Tests / test-system-keyspace-directory jdk11 12/16 / testConstrainedIteration[1]-cassandra.testtag_IS_UNDEFINED
FAILED:  org.apache.cassandra.net.ProxyHandlerConnectionsTest.Tests / test-oa jdk11 16/16 / testExpireSome-oa_jdk11_x86_64
FAILED:  org.apache.cassandra.transport.AuthMessageSizeLimitTest.Tests / test-cdc jdk17 5/8 / sendTooBigAuthMultiFrameMessage-cdc_jdk17_x86_64
FAILED:  org.apache.cassandra.transport.AuthMessageSizeLimitTest.Tests / test-compression jdk17 5/16 / sendTooBigAuthMultiFrameMessage-compression_jdk17_x86_64
FAILED:  dtest-upgrade.upgrade_tests.cql_tests.TestCQLNodes3RF3_Upgrade_current_4_1_x_To_indev_5_0_x.Tests / dtest-upgrade jdk11 55/128 / test_limit_multiget

  -------------------------------------------------------------------------------
  For complete test report and logs see https://nightlies.apache.org/cassandra/Cassandra-5.0/519/