You are viewing a plain text version of this content. The canonical link for it is here.
Posted to builds@solr.apache.org by Apache Jenkins Server <je...@builds.apache.org> on 2024/11/16 15:38:30 UTC
[JENKINS] Solr ยป Solr-Smoketest-9.7 - Build # 65 - Failure!
Build: https://ci-builds.apache.org/job/Solr/job/Solr-Smoketest-9.7/65/
Log:
Started by timer
Running as SYSTEM
[EnvInject] - Loading node environment variables.
Building remotely on lucene-solr-1 (solr lucene) in workspace /home/jenkins/jenkins-slave/workspace/Solr/Solr-Smoketest-9.7
[WS-CLEANUP] Deleting project workspace...
[WS-CLEANUP] Deferred wipeout is used...
[WS-CLEANUP] Done
The recommended git tool is: NONE
No credentials specified
Cloning the remote Git repository
Cloning repository https://github.com/apache/solr.git
> git init /home/jenkins/jenkins-slave/workspace/Solr/Solr-Smoketest-9.7 # timeout=10
Fetching upstream changes from https://github.com/apache/solr.git
> git --version # timeout=10
> git --version # 'git version 2.17.1'
> git fetch --tags --progress -- https://github.com/apache/solr.git +refs/heads/*:refs/remotes/origin/* # timeout=10
> git config remote.origin.url https://github.com/apache/solr.git # timeout=10
> git config --add remote.origin.fetch +refs/heads/*:refs/remotes/origin/* # timeout=10
Avoid second fetch
> git rev-parse origin/branch_9_7^{commit} # timeout=10
Checking out Revision 774891d134b41132dafcdabce99564953c4957fd (origin/branch_9_7)
> git config core.sparsecheckout # timeout=10
> git checkout -f 774891d134b41132dafcdabce99564953c4957fd # timeout=10
> git branch -a -v --no-abbrev # timeout=10
> git checkout -b branch_9_7 774891d134b41132dafcdabce99564953c4957fd # timeout=10
Commit message: "SOLR-17543: Input validation in FSConfigSetService"
> git rev-list --no-walk 774891d134b41132dafcdabce99564953c4957fd # timeout=10
No emails were triggered.
provisioning config files...
copy managed file [gradle.properties] to file:/home/jenkins/jenkins-slave/workspace/Solr/Solr-Smoketest-9.7/gradle.properties
[Gradle] - Launching build.
[Solr-Smoketest-9.7] $ /home/jenkins/jenkins-slave/workspace/Solr/Solr-Smoketest-9.7/gradlew -Dversion.suffix= -Dgradle.user.home=/home/jenkins/jenkins-slave/workspace/Solr/.gradle -Porg.gradle.daemon=false -Pvalidation.git.failOnModified=false --continue -x signJarsPublication clean assembleRelease
Downloading gradle-wrapper.jar from https://raw.githubusercontent.com/gradle/gradle/v8.4.0/gradle/wrapper/gradle-wrapper.jar
To honour the JVM settings for this build a single-use Daemon process will be forked. For more on this, please refer to https://docs.gradle.org/8.4/userguide/gradle_daemon.html#sec:disabling_the_daemon in the Gradle documentation.
Daemon will be stopped at the end of the build
> Task :buildSrc:compileJava
Note: /home/jenkins/jenkins-slave/workspace/Solr/Solr-Smoketest-9.7/buildSrc/src/main/java/org/apache/lucene/gradle/Checksum.java uses or overrides a deprecated API.
Note: Recompile with -Xlint:deprecation for details.
> Task :buildSrc:compileGroovy NO-SOURCE
> Task :buildSrc:processResources NO-SOURCE
> Task :buildSrc:classes
> Task :buildSrc:jar
> Task :clean
> Task :solr:clean UP-TO-DATE
> Task :solr:api:clean
> Task :solr:benchmark:clean
> Task :solr:core:clean
> Task :solr:distribution:clean UP-TO-DATE
> Task :solr:docker:clean UP-TO-DATE
> Task :solr:documentation:clean UP-TO-DATE
> Task :solr:example:clean UP-TO-DATE
> Task :solr:modules:clean UP-TO-DATE
> Task :solr:packaging:clean UP-TO-DATE
> Task :solr:prometheus-exporter:clean
> Task :solr:server:clean
> Task :solr:solr-ref-guide:clean
> Task :solr:solrj:clean
> Task :solr:solrj-streaming:clean
> Task :solr:solrj-zookeeper:clean
> Task :solr:test-framework:clean
> Task :solr:webapp:clean
> Task :solr:modules:analysis-extras:clean
> Task :solr:modules:analytics:clean
> Task :solr:modules:clustering:clean
> Task :solr:modules:extraction:clean
> Task :solr:modules:gcs-repository:clean
> Task :solr:modules:hadoop-auth:clean
> Task :solr:modules:hdfs:clean
> Task :solr:modules:jaegertracer-configurator:clean
> Task :solr:modules:jwt-auth:clean
> Task :solr:modules:langid:clean
> Task :solr:modules:ltr:clean
> Task :solr:modules:opentelemetry:clean
> Task :solr:modules:s3-repository:clean
> Task :solr:modules:scripting:clean
> Task :solr:modules:sql:clean
> Task :mavenLocalClean UP-TO-DATE
> Task :solr-missing-doclet:compileJava
> Task :solr-missing-doclet:processResources NO-SOURCE
> Task :solr-missing-doclet:classes
> Task :solr-missing-doclet:jar
> Task :gitStatus
> Task :checkJdkInternalsExportedToGradle
> Task :solr:api:compileJava
> Task :solr:api:processResources NO-SOURCE
> Task :solr:api:classes
> Task :solr:api:jar
> Task :solr:api:generateMetadataFileForJarsPublication SKIPPED
> Task :solr:api:generatePomFileForJarsPublication
> Task :solr:api:renderJavadoc
> Task :solr:api:javadoc SKIPPED
> Task :solr:api:javadocJar
> Task :solr:api:sourcesJar
> Task :solr:api:publishJarsPublicationToBuildRepository
> Task :solr:api:resolve
SLF4J(W): No SLF4J providers were found.
SLF4J(W): Defaulting to no-operation (NOP) logger implementation
SLF4J(W): See https://www.slf4j.org/codes.html#noProviders for further details.
> Task :solr:solrj:openApiGenerate
Cleaned up output directory /home/jenkins/jenkins-slave/workspace/Solr/Solr-Smoketest-9.7/solr/solrj/build/generated/ before code generation (cleanupOutput set to true).
################################################################################
# Thanks for using OpenAPI Generator. #
# Please consider donation to help us maintain this project ๐ #
# https://opencollective.com/openapi_generator/donate #
################################################################################
Successfully generated code to /home/jenkins/jenkins-slave/workspace/Solr/Solr-Smoketest-9.7/solr/solrj/build/generated/
> Task :spotlessInternalRegisterDependencies
> Task :solr:solrj:generatedSpotlessHelper
> Task :solr:solrj:generatedSpotless
> Task :solr:solrj:compileJava
Note: Some input files use or override a deprecated API.
Note: Recompile with -Xlint:deprecation for details.
> Task :solr:solrj-streaming:compileJava
Note: Some input files use or override a deprecated API.
Note: Recompile with -Xlint:deprecation for details.
> Task :solr:solrj-zookeeper:compileJava
Note: Some input files use or override a deprecated API.
Note: Recompile with -Xlint:deprecation for details.
> Task :solr:core:compileJava
Note: Some input files use or override a deprecated API.
Note: Recompile with -Xlint:deprecation for details.
> Task :solr:core:processResources
> Task :solr:core:classes
> Task :solr:core:jar
> Task :solr:core:generateMetadataFileForJarsPublication SKIPPED
> Task :solr:core:generatePomFileForJarsPublication
> Task :solr:solrj:renderJavadoc
> Task :solr:solrj-streaming:renderJavadoc
> Task :solr:solrj-zookeeper:renderJavadoc
> Task :solr:core:renderJavadoc
> Task :solr:core:javadoc SKIPPED
> Task :solr:core:javadocJar
> Task :solr:core:sourcesJar
> Task :solr:core:publishJarsPublicationToBuildRepository
> Task :solr:prometheus-exporter:compileJava
Note: Some input files use or override a deprecated API.
Note: Recompile with -Xlint:deprecation for details.
> Task :solr:prometheus-exporter:processResources NO-SOURCE
> Task :solr:prometheus-exporter:classes
> Task :solr:prometheus-exporter:jar
> Task :solr:prometheus-exporter:generateMetadataFileForJarsPublication SKIPPED
> Task :solr:prometheus-exporter:generatePomFileForJarsPublication
> Task :solr:prometheus-exporter:renderJavadoc
> Task :solr:prometheus-exporter:javadoc SKIPPED
> Task :solr:prometheus-exporter:javadocJar
> Task :solr:prometheus-exporter:sourcesJar
> Task :solr:prometheus-exporter:publishJarsPublicationToBuildRepository
> Task :solr:solrj:processResources
> Task :solr:solrj:classes
> Task :solr:solrj:jar
> Task :solr:solrj:generateMetadataFileForJarsPublication SKIPPED
> Task :solr:solrj:generatePomFileForJarsPublication
> Task :solr:solrj:javadoc SKIPPED
> Task :solr:solrj:javadocJar
> Task :solr:solrj:sourcesJar
> Task :solr:solrj:publishJarsPublicationToBuildRepository
> Task :solr:solrj-streaming:processResources
> Task :solr:solrj-streaming:classes
> Task :solr:solrj-streaming:jar
> Task :solr:solrj-streaming:generateMetadataFileForJarsPublication SKIPPED
> Task :solr:solrj-streaming:generatePomFileForJarsPublication
> Task :solr:solrj-streaming:javadoc SKIPPED
> Task :solr:solrj-streaming:javadocJar
> Task :solr:solrj-streaming:sourcesJar
> Task :solr:solrj-streaming:publishJarsPublicationToBuildRepository
> Task :solr:solrj-zookeeper:processResources NO-SOURCE
> Task :solr:solrj-zookeeper:classes
> Task :solr:solrj-zookeeper:jar
> Task :solr:solrj-zookeeper:generateMetadataFileForJarsPublication SKIPPED
> Task :solr:solrj-zookeeper:generatePomFileForJarsPublication
> Task :solr:solrj-zookeeper:javadoc SKIPPED
> Task :solr:solrj-zookeeper:javadocJar
> Task :solr:solrj-zookeeper:sourcesJar
> Task :solr:solrj-zookeeper:publishJarsPublicationToBuildRepository
> Task :solr:test-framework:compileJava
Note: Some input files use or override a deprecated API.
Note: Recompile with -Xlint:deprecation for details.
> Task :solr:test-framework:processResources
> Task :solr:test-framework:classes
> Task :solr:test-framework:jar
> Task :solr:test-framework:generateMetadataFileForJarsPublication SKIPPED
> Task :solr:test-framework:generatePomFileForJarsPublication
> Task :solr:test-framework:renderJavadoc
> Task :solr:test-framework:javadoc SKIPPED
> Task :solr:test-framework:javadocJar
> Task :solr:test-framework:sourcesJar
> Task :solr:test-framework:publishJarsPublicationToBuildRepository
> Task :solr:modules:analysis-extras:compileJava
Note: /home/jenkins/jenkins-slave/workspace/Solr/Solr-Smoketest-9.7/solr/modules/analysis-extras/src/java/org/apache/solr/schema/ICUCollationField.java uses or overrides a deprecated API.
Note: Recompile with -Xlint:deprecation for details.
> Task :solr:modules:analysis-extras:processResources NO-SOURCE
> Task :solr:modules:analysis-extras:classes
> Task :solr:modules:analysis-extras:jar
> Task :solr:modules:analysis-extras:generateMetadataFileForJarsPublication SKIPPED
> Task :solr:modules:analysis-extras:generatePomFileForJarsPublication
> Task :solr:modules:analysis-extras:renderJavadoc
> Task :solr:modules:analysis-extras:javadoc SKIPPED
> Task :solr:modules:analysis-extras:javadocJar
> Task :solr:modules:analysis-extras:sourcesJar
> Task :solr:modules:analysis-extras:publishJarsPublicationToBuildRepository
> Task :solr:modules:analytics:compileJava
Note: Some input files use or override a deprecated API.
Note: Recompile with -Xlint:deprecation for details.
> Task :solr:modules:analytics:processResources NO-SOURCE
> Task :solr:modules:analytics:classes
> Task :solr:modules:analytics:jar
> Task :solr:modules:analytics:generateMetadataFileForJarsPublication SKIPPED
> Task :solr:modules:analytics:generatePomFileForJarsPublication
> Task :solr:modules:analytics:renderJavadoc
> Task :solr:modules:analytics:javadoc SKIPPED
> Task :solr:modules:analytics:javadocJar
> Task :solr:modules:analytics:sourcesJar
> Task :solr:modules:analytics:publishJarsPublicationToBuildRepository
> Task :solr:modules:clustering:compileJava
> Task :solr:modules:clustering:processResources NO-SOURCE
> Task :solr:modules:clustering:classes
> Task :solr:modules:clustering:jar
> Task :solr:modules:clustering:generateMetadataFileForJarsPublication SKIPPED
> Task :solr:modules:clustering:generatePomFileForJarsPublication
> Task :solr:modules:clustering:renderJavadoc
> Task :solr:modules:clustering:javadoc SKIPPED
> Task :solr:modules:clustering:javadocJar
> Task :solr:modules:clustering:sourcesJar
> Task :solr:modules:clustering:publishJarsPublicationToBuildRepository
> Task :solr:modules:extraction:compileJava
Note: /home/jenkins/jenkins-slave/workspace/Solr/Solr-Smoketest-9.7/solr/modules/extraction/src/java/org/apache/solr/handler/extraction/ExtractingDocumentLoader.java uses or overrides a deprecated API.
Note: Recompile with -Xlint:deprecation for details.
> Task :solr:modules:extraction:processResources
> Task :solr:modules:extraction:classes
> Task :solr:modules:extraction:jar
> Task :solr:modules:extraction:generateMetadataFileForJarsPublication SKIPPED
> Task :solr:modules:extraction:generatePomFileForJarsPublication
> Task :solr:modules:extraction:renderJavadoc
> Task :solr:modules:extraction:javadoc SKIPPED
> Task :solr:modules:extraction:javadocJar
> Task :solr:modules:extraction:sourcesJar
> Task :solr:modules:extraction:publishJarsPublicationToBuildRepository
> Task :solr:modules:gcs-repository:compileJava
Note: /home/jenkins/jenkins-slave/workspace/Solr/Solr-Smoketest-9.7/solr/modules/gcs-repository/src/java/org/apache/solr/gcs/GCSConfigParser.java uses or overrides a deprecated API.
Note: Recompile with -Xlint:deprecation for details.
> Task :solr:modules:gcs-repository:processResources NO-SOURCE
> Task :solr:modules:gcs-repository:classes
> Task :solr:modules:gcs-repository:jar
> Task :solr:modules:gcs-repository:generateMetadataFileForJarsPublication SKIPPED
> Task :solr:modules:gcs-repository:generatePomFileForJarsPublication
> Task :solr:modules:gcs-repository:renderJavadoc
> Task :solr:modules:gcs-repository:javadoc SKIPPED
> Task :solr:modules:gcs-repository:javadocJar
> Task :solr:modules:gcs-repository:sourcesJar
> Task :solr:modules:gcs-repository:publishJarsPublicationToBuildRepository
> Task :solr:modules:hadoop-auth:compileJava
Note: Some input files use or override a deprecated API.
Note: Recompile with -Xlint:deprecation for details.
> Task :solr:modules:hadoop-auth:processResources NO-SOURCE
> Task :solr:modules:hadoop-auth:classes
> Task :solr:modules:hadoop-auth:jar
> Task :solr:modules:hadoop-auth:generateMetadataFileForJarsPublication SKIPPED
> Task :solr:modules:hadoop-auth:generatePomFileForJarsPublication
> Task :solr:modules:hadoop-auth:renderJavadoc
> Task :solr:modules:hadoop-auth:javadoc SKIPPED
> Task :solr:modules:hadoop-auth:javadocJar
> Task :solr:modules:hadoop-auth:sourcesJar
> Task :solr:modules:hadoop-auth:publishJarsPublicationToBuildRepository
> Task :solr:modules:hdfs:compileJava
Note: Some input files use or override a deprecated API.
Note: Recompile with -Xlint:deprecation for details.
> Task :solr:modules:hdfs:processResources NO-SOURCE
> Task :solr:modules:hdfs:classes
> Task :solr:modules:hdfs:jar
> Task :solr:modules:hdfs:generateMetadataFileForJarsPublication SKIPPED
> Task :solr:modules:hdfs:generatePomFileForJarsPublication
> Task :solr:modules:hdfs:renderJavadoc
> Task :solr:modules:hdfs:javadoc SKIPPED
> Task :solr:modules:hdfs:javadocJar
> Task :solr:modules:hdfs:sourcesJar
> Task :solr:modules:hdfs:publishJarsPublicationToBuildRepository
> Task :solr:modules:jaegertracer-configurator:compileJava
> Task :solr:modules:jaegertracer-configurator:processResources NO-SOURCE
> Task :solr:modules:jaegertracer-configurator:classes
> Task :solr:modules:jaegertracer-configurator:jar
> Task :solr:modules:jaegertracer-configurator:generateMetadataFileForJarsPublication SKIPPED
> Task :solr:modules:jaegertracer-configurator:generatePomFileForJarsPublication
> Task :solr:modules:jaegertracer-configurator:renderJavadoc
> Task :solr:modules:jaegertracer-configurator:javadoc SKIPPED
> Task :solr:modules:jaegertracer-configurator:javadocJar
> Task :solr:modules:jaegertracer-configurator:sourcesJar
> Task :solr:modules:jaegertracer-configurator:publishJarsPublicationToBuildRepository
> Task :solr:modules:jwt-auth:compileJava
> Task :solr:modules:jwt-auth:processResources NO-SOURCE
> Task :solr:modules:jwt-auth:classes
> Task :solr:modules:jwt-auth:jar
> Task :solr:modules:jwt-auth:generateMetadataFileForJarsPublication SKIPPED
> Task :solr:modules:jwt-auth:generatePomFileForJarsPublication
> Task :solr:modules:jwt-auth:renderJavadoc
> Task :solr:modules:jwt-auth:javadoc SKIPPED
> Task :solr:modules:jwt-auth:javadocJar
> Task :solr:modules:jwt-auth:sourcesJar
> Task :solr:modules:jwt-auth:publishJarsPublicationToBuildRepository
> Task :solr:modules:langid:compileJava
Note: Some input files use or override a deprecated API.
Note: Recompile with -Xlint:deprecation for details.
> Task :solr:modules:langid:processResources
> Task :solr:modules:langid:classes
> Task :solr:modules:langid:jar
> Task :solr:modules:langid:generateMetadataFileForJarsPublication SKIPPED
> Task :solr:modules:langid:generatePomFileForJarsPublication
> Task :solr:modules:langid:renderJavadoc
> Task :solr:modules:langid:javadoc SKIPPED
> Task :solr:modules:langid:javadocJar
> Task :solr:modules:langid:sourcesJar
> Task :solr:modules:langid:publishJarsPublicationToBuildRepository
> Task :solr:modules:ltr:compileJava
Note: Some input files use or override a deprecated API.
Note: Recompile with -Xlint:deprecation for details.
> Task :solr:modules:ltr:processResources NO-SOURCE
> Task :solr:modules:ltr:classes
> Task :solr:modules:ltr:jar
> Task :solr:modules:ltr:generateMetadataFileForJarsPublication SKIPPED
> Task :solr:modules:ltr:generatePomFileForJarsPublication
> Task :solr:modules:ltr:renderJavadoc
> Task :solr:modules:ltr:javadoc SKIPPED
> Task :solr:modules:ltr:javadocJar
> Task :solr:modules:ltr:sourcesJar
> Task :solr:modules:ltr:publishJarsPublicationToBuildRepository
> Task :solr:modules:opentelemetry:compileJava
> Task :solr:modules:opentelemetry:processResources NO-SOURCE
> Task :solr:modules:opentelemetry:classes
> Task :solr:modules:opentelemetry:jar
> Task :solr:modules:opentelemetry:generateMetadataFileForJarsPublication SKIPPED
> Task :solr:modules:opentelemetry:generatePomFileForJarsPublication
> Task :solr:modules:opentelemetry:renderJavadoc
> Task :solr:modules:opentelemetry:javadoc SKIPPED
> Task :solr:modules:opentelemetry:javadocJar
> Task :solr:modules:opentelemetry:sourcesJar
> Task :solr:modules:opentelemetry:publishJarsPublicationToBuildRepository
> Task :solr:modules:s3-repository:compileJava
Note: /home/jenkins/jenkins-slave/workspace/Solr/Solr-Smoketest-9.7/solr/modules/s3-repository/src/java/org/apache/solr/s3/S3StorageClient.java uses or overrides a deprecated API.
Note: Recompile with -Xlint:deprecation for details.
> Task :solr:modules:s3-repository:processResources NO-SOURCE
> Task :solr:modules:s3-repository:classes
> Task :solr:modules:s3-repository:jar
> Task :solr:modules:s3-repository:generateMetadataFileForJarsPublication SKIPPED
> Task :solr:modules:s3-repository:generatePomFileForJarsPublication
> Task :solr:modules:s3-repository:renderJavadoc
> Task :solr:modules:s3-repository:javadoc SKIPPED
> Task :solr:modules:s3-repository:javadocJar
> Task :solr:modules:s3-repository:sourcesJar
> Task :solr:modules:s3-repository:publishJarsPublicationToBuildRepository
> Task :solr:modules:scripting:compileJava
Note: /home/jenkins/jenkins-slave/workspace/Solr/Solr-Smoketest-9.7/solr/modules/scripting/src/java/org/apache/solr/scripting/xslt/XSLTUpdateRequestHandler.java uses or overrides a deprecated API.
Note: Recompile with -Xlint:deprecation for details.
> Task :solr:modules:scripting:processResources NO-SOURCE
> Task :solr:modules:scripting:classes
> Task :solr:modules:scripting:jar
> Task :solr:modules:scripting:generateMetadataFileForJarsPublication SKIPPED
> Task :solr:modules:scripting:generatePomFileForJarsPublication
> Task :solr:modules:scripting:renderJavadoc
> Task :solr:modules:scripting:javadoc SKIPPED
> Task :solr:modules:scripting:javadocJar
> Task :solr:modules:scripting:sourcesJar
> Task :solr:modules:scripting:publishJarsPublicationToBuildRepository
> Task :solr:modules:sql:compileJava
Note: Some input files use or override a deprecated API.
Note: Recompile with -Xlint:deprecation for details.
> Task :solr:modules:sql:processResources
> Task :solr:modules:sql:classes
> Task :solr:modules:sql:jar
> Task :solr:modules:sql:generateMetadataFileForJarsPublication SKIPPED
> Task :solr:modules:sql:generatePomFileForJarsPublication
> Task :solr:modules:sql:renderJavadoc
> Task :solr:modules:sql:javadoc SKIPPED
> Task :solr:modules:sql:javadocJar
> Task :solr:modules:sql:sourcesJar
> Task :solr:modules:sql:publishJarsPublicationToBuildRepository
> Task :mavenToLocalFolder
Local maven artifacts (poms, jars) created at: /home/jenkins/jenkins-slave/workspace/Solr/Solr-Smoketest-9.7/build/maven-local
> Task :checkWorkingCopyClean
> Task :solr:distribution:assembleSourceTgz
> Task :solr:docker:createBodySnippetDockerfile
> Task :solr:docker:createDockerfileLocal
> Task :solr:docker:assemblePackaging
> Task :solr:documentation:changesToHtml
> Task :solr:documentation:copyDocumentationAssets
> Task :solr:documentation:markdownToHtml
> Task :solr:documentation:copyChangesToHtmlForMiniSite
> Task :solr:documentation:copyMiniDocumentationAssets
> Task :solr:documentation:createMiniDocumentationIndex
> Task :solr:documentation:documentationMinimal
> Task :solr:core:assemblePostJar
> Task :solr:example:assemblePackaging
> Task :solr:prometheus-exporter:assemblePackaging
> Task :solr:webapp:compileJava NO-SOURCE
> Task :solr:webapp:processResources NO-SOURCE
> Task :solr:webapp:classes UP-TO-DATE
> Task :solr:api:buildJSClient
################################################################################
# Thanks for using OpenAPI Generator. #
# Please consider donation to help us maintain this project ๐ #
# https://opencollective.com/openapi_generator/donate #
################################################################################
Successfully generated code to /home/jenkins/jenkins-slave/workspace/Solr/Solr-Smoketest-9.7/solr/api/build/generated/js
> Task :solr:webapp:nodeSetup
> Task :solr:webapp:npmSetup SKIPPED
> Task :solr:webapp:downloadBrowserify
npm WARN deprecated inflight@1.0.6: This module is not supported, and leaks memory. Do not use it. Check out lru-cache if you want a good and tested way to coalesce async requests by a key value, which is much more comprehensive and powerful.
npm WARN deprecated glob@7.2.3: Glob versions prior to v9 are no longer supported
added 163 packages, changed 1 package, and audited 165 packages in 6s
32 packages are looking for funding
run `npm fund` for details
found 0 vulnerabilities
> Task :solr:webapp:syncJSClientSourceCode
> Task :solr:webapp:jsClientDownloadDeps
npm WARN deprecated inflight@1.0.6: This module is not supported, and leaks memory. Do not use it. Check out lru-cache if you want a good and tested way to coalesce async requests by a key value, which is much more comprehensive and powerful.
npm WARN deprecated @babel/plugin-proposal-nullish-coalescing-operator@7.18.6: This proposal has been merged to the ECMAScript standard and thus this plugin is no longer maintained. Please use @babel/plugin-transform-nullish-coalescing-operator instead.
npm WARN deprecated @babel/plugin-proposal-numeric-separator@7.18.6: This proposal has been merged to the ECMAScript standard and thus this plugin is no longer maintained. Please use @babel/plugin-transform-numeric-separator instead.
npm WARN deprecated @babel/plugin-proposal-export-namespace-from@7.18.9: This proposal has been merged to the ECMAScript standard and thus this plugin is no longer maintained. Please use @babel/plugin-transform-export-namespace-from instead.
npm WARN deprecated @babel/plugin-proposal-json-strings@7.18.6: This proposal has been merged to the ECMAScript standard and thus this plugin is no longer maintained. Please use @babel/plugin-transform-json-strings instead.
npm WARN deprecated @babel/plugin-proposal-class-properties@7.18.6: This proposal has been merged to the ECMAScript standard and thus this plugin is no longer maintained. Please use @babel/plugin-transform-class-properties instead.
npm WARN deprecated @babel/plugin-proposal-logical-assignment-operators@7.20.7: This proposal has been merged to the ECMAScript standard and thus this plugin is no longer maintained. Please use @babel/plugin-transform-logical-assignment-operators instead.
npm WARN deprecated @babel/plugin-proposal-optional-chaining@7.21.0: This proposal has been merged to the ECMAScript standard and thus this plugin is no longer maintained. Please use @babel/plugin-transform-optional-chaining instead.
npm WARN deprecated glob@7.2.3: Glob versions prior to v9 are no longer supported
npm WARN deprecated glob@7.1.6: Glob versions prior to v9 are no longer supported
npm WARN deprecated formidable@1.2.6: Please upgrade to latest, formidable@v2 or formidable@v3! Check these notes: https://bit.ly/2ZEqIau
npm WARN deprecated superagent@5.3.1: Please upgrade to v9.0.0+ as we have fixed a public vulnerability with formidable dependency. Note that v9.0.0+ requires Node.js v14.18.0+. See https://github.com/ladjs/superagent/pull/1800 for insight. This project is supported and maintained by the team at Forward Email @ https://forwardemail.net
npm WARN deprecated sinon@7.5.0: 16.1.1
> v2_api@9.7.1 prepare
> npm run build
> v2_api@9.7.1 build
> babel src -d dist
Successfully compiled 82 files with Babel (1823ms).
added 329 packages, and audited 330 packages in 14s
42 packages are looking for funding
run `npm fund` for details
3 vulnerabilities (1 moderate, 2 high)
To address all issues (including breaking changes), run:
npm audit fix --force
Run `npm audit` for details.
> Task :solr:webapp:jsClientBuild
> v2_api@9.7.1 build
> babel src -d dist
Successfully compiled 82 files with Babel (1817ms).
> Task :solr:webapp:generateJsClientBundle
> Task :solr:webapp:finalizeJsBundleDir
> Task :solr:webapp:war
> Task :solr:server:assemblePackaging
> Task :solr:modules:analysis-extras:assemblePackaging
> Task :solr:modules:analytics:assemblePackaging
> Task :solr:modules:clustering:assemblePackaging
> Task :solr:modules:extraction:assemblePackaging
> Task :solr:modules:gcs-repository:assemblePackaging
> Task :solr:modules:hadoop-auth:assemblePackaging
> Task :solr:modules:hdfs:assemblePackaging
> Task :solr:modules:jaegertracer-configurator:assemblePackaging
> Task :solr:modules:jwt-auth:assemblePackaging
> Task :solr:modules:langid:assemblePackaging
> Task :solr:modules:ltr:assemblePackaging
> Task :solr:modules:opentelemetry:assemblePackaging
> Task :solr:modules:s3-repository:assemblePackaging
> Task :solr:modules:scripting:assemblePackaging
> Task :solr:modules:sql:assemblePackaging
> Task :solr:packaging:fullDistTar
> Task :solr:packaging:slimDistTar
> Task :solr:distribution:computeChecksums
> Task :solr:distribution:prepareGitRev
> Task :solr:docker:createDockerfileOfficialFull
> Task :solr:docker:createDockerfileOfficialSlim
> Task :solr:distribution:assembleRelease
Deprecated Gradle features were used in this build, making it incompatible with Gradle 9.0.
You can use '--warning-mode all' to show the individual deprecation warnings and determine if they come from your own scripts or plugins.
For more on this, please refer to https://docs.gradle.org/8.4/userguide/command_line_interface.html#sec:command_line_warnings in the Gradle documentation.
BUILD SUCCESSFUL in 5m 7s
254 actionable tasks: 246 executed, 8 up-to-date
Publishing build scan...
https://ge.apache.org/s/wlpd6c3acc3gq
Build step 'Invoke Gradle script' changed build result to SUCCESS
Run condition [Always] enabling perform for step [Execute shell]
[Solr-Smoketest-9.7] $ /bin/bash /tmp/jenkins7773239769589515499.sh
Installing Python script requirements
Defaulting to user installation because normal site-packages is not writeable
Collecting six~=1.16.0
Using cached six-1.16.0-py2.py3-none-any.whl (11 kB)
ERROR: Could not find a version that satisfies the requirement Jinja2~=3.1.1 (from versions: 2.0rc1, 2.0, 2.1, 2.1.1, 2.2, 2.2.1, 2.3, 2.3.1, 2.4, 2.4.1, 2.5, 2.5.1, 2.5.2, 2.5.3, 2.5.4, 2.5.5, 2.6, 2.7, 2.7.1, 2.7.2, 2.7.3, 2.8, 2.8.1, 2.9, 2.9.1, 2.9.2, 2.9.3, 2.9.4, 2.9.5, 2.9.6, 2.10, 2.10.1, 2.10.2, 2.10.3, 2.11.0, 2.11.1, 2.11.2, 2.11.3, 3.0.0a1, 3.0.0rc1, 3.0.0rc2, 3.0.0, 3.0.1, 3.0.2, 3.0.3)
ERROR: No matching distribution found for Jinja2~=3.1.1
Starting Smoke tester in folder /home/jenkins/jenkins-slave/workspace/Solr/Solr-Smoketest-9.7
Java 11 JAVA_HOME=/home/jenkins/tools/java/latest11
NOTE: output encoding is UTF-8
NOTE: Not running @Nightly or @BadApple tests. Please verify that recent Jenkins runs have passed.
Load release URL "file:///home/jenkins/jenkins-slave/workspace/Solr/Solr-Smoketest-9.7/solr/distribution/build/release"...
Get KEYS...
Downloading online KEYS file https://archive.apache.org/dist/solr/KEYS
Downloading https://archive.apache.org/dist/solr/KEYS
0.3 MB in 1.13 sec (0.3 MB/sec)
Test Solr...
test basics...
check changes HTML...
check OpenAPI specification...
download solr-9.7.1-slim.tgz...
Downloading file:///home/jenkins/jenkins-slave/workspace/Solr/Solr-Smoketest-9.7/solr/distribution/build/release/solr-9.7.1-slim.tgz
61.7 MB in 0.04 sec (1373.1 MB/sec)
verify sha512 digest
download solr-9.7.1-src.tgz...
Downloading file:///home/jenkins/jenkins-slave/workspace/Solr/Solr-Smoketest-9.7/solr/distribution/build/release/solr-9.7.1-src.tgz
86.1 MB in 0.07 sec (1312.9 MB/sec)
verify sha512 digest
download solr-9.7.1.tgz...
Downloading file:///home/jenkins/jenkins-slave/workspace/Solr/Solr-Smoketest-9.7/solr/distribution/build/release/solr-9.7.1.tgz
269.7 MB in 0.19 sec (1417.3 MB/sec)
verify sha512 digest
unpack solr-9.7.1.tgz...
solr-9.7.1.tgz
Checking LICENSE.txt
Checking NOTICE.txt
Checking README.txt
Checking CHANGES.txt
Checking bin
Checking modules
Checking docker
Checking prometheus-exporter
Checking docs
Checking example
Checking licenses
Checking server
Checking lib
verify JAR metadata/identity/no javax.* or java.* classes...
**WARNING**: skipping check of /home/jenkins/jenkins-slave/workspace/Solr/Solr-Smoketest-9.7/_tmp/smoke_1731768553/unpack/solr-9.7.1/server/solr-webapp/webapp/WEB-INF/lib/jakarta.ws.rs-api-3.1.0.jar: it has javax.* classes
**WARNING**: skipping check of /home/jenkins/jenkins-slave/workspace/Solr/Solr-Smoketest-9.7/_tmp/smoke_1731768553/unpack/solr-9.7.1/server/solr-webapp/webapp/WEB-INF/lib/jakarta.annotation-api-2.1.1.jar: it has javax.* classes
**WARNING**: skipping check of /home/jenkins/jenkins-slave/workspace/Solr/Solr-Smoketest-9.7/_tmp/smoke_1731768553/unpack/solr-9.7.1/server/solr-webapp/webapp/WEB-INF/lib/jakarta.validation-api-3.0.2.jar: it has javax.* classes
**WARNING**: skipping check of /home/jenkins/jenkins-slave/workspace/Solr/Solr-Smoketest-9.7/_tmp/smoke_1731768553/unpack/solr-9.7.1/server/solr-webapp/webapp/WEB-INF/lib/jakarta.inject-api-2.0.1.jar: it has javax.* classes
**WARNING**: skipping check of /home/jenkins/jenkins-slave/workspace/Solr/Solr-Smoketest-9.7/_tmp/smoke_1731768553/unpack/solr-9.7.1/server/lib/ext/jetty-servlet-api-4.0.6.jar: it has javax.* classes
**WARNING**: skipping check of /home/jenkins/jenkins-slave/workspace/Solr/Solr-Smoketest-9.7/_tmp/smoke_1731768553/unpack/solr-9.7.1/modules/extraction/lib/jakarta.activation-1.2.2.jar: it has javax.* classes
**WARNING**: skipping check of /home/jenkins/jenkins-slave/workspace/Solr/Solr-Smoketest-9.7/_tmp/smoke_1731768553/unpack/solr-9.7.1/modules/extraction/lib/jakarta.xml.bind-api-2.3.3.jar: it has javax.* classes
**WARNING**: skipping check of /home/jenkins/jenkins-slave/workspace/Solr/Solr-Smoketest-9.7/_tmp/smoke_1731768553/unpack/solr-9.7.1/modules/extraction/lib/jakarta.activation-api-1.2.2.jar: it has javax.* classes
**WARNING**: skipping check of /home/jenkins/jenkins-slave/workspace/Solr/Solr-Smoketest-9.7/_tmp/smoke_1731768553/unpack/solr-9.7.1/modules/extraction/lib/unit-api-1.0.jar: it has javax.* classes
copying unpacked distribution for Java 11 ...
test solr example w/ Java 11...
start Solr instance (log=/home/jenkins/jenkins-slave/workspace/Solr/Solr-Smoketest-9.7/_tmp/smoke_1731768553/unpack/solr-9.7.1-java11/solr-example.log)...
No process found for Solr node running on port 8983
Running techproducts example on port 8983 from /home/jenkins/jenkins-slave/workspace/Solr/Solr-Smoketest-9.7/_tmp/smoke_1731768553/unpack/solr-9.7.1-java11
*** [WARN] *** Your open file limit is currently 60000.
It should be set to 65000 to avoid operational disruption.
If you no longer wish to see this warning, set SOLR_ULIMIT_CHECKS to false in your profile or solr.in.sh
*** [WARN] *** Your Max Processes Limit is currently 30000.
It should be set to 65000 to avoid operational disruption.
If you no longer wish to see this warning, set SOLR_ULIMIT_CHECKS to false in your profile or solr.in.sh
Creating Solr home directory /home/jenkins/jenkins-slave/workspace/Solr/Solr-Smoketest-9.7/_tmp/smoke_1731768553/unpack/solr-9.7.1-java11/example/techproducts/solr
Starting up Solr on port 8983 using command:
"bin/solr" start -p 8983 -s "example/techproducts/solr"
*** [WARN] *** Your open file limit is currently 60000.
It should be set to 65000 to avoid operational disruption.
If you no longer wish to see this warning, set SOLR_ULIMIT_CHECKS to false in your profile or solr.in.sh
*** [WARN] *** Your Max Processes Limit is currently 30000.
It should be set to 65000 to avoid operational disruption.
If you no longer wish to see this warning, set SOLR_ULIMIT_CHECKS to false in your profile or solr.in.sh
Waiting up to 180 seconds to see Solr running on port 8983 [|] [/] [-] [\] [|]
Started Solr server on port 8983 (pid=16834). Happy searching!
WARNING: URLs provided to this tool needn't include Solr's context-root (e.g. "/solr"). Such URLs are deprecated and support for them will be removed in a future release. Correcting from [http://localhost:8983/solr/] to [http://localhost:8983/].
WARNING: URLs provided to this tool needn't include Solr's context-root (e.g. "/solr"). Such URLs are deprecated and support for them will be removed in a future release. Correcting from [http://localhost:8983/solr] to [http://localhost:8983/].
WARNING: URLs provided to this tool needn't include Solr's context-root (e.g. "/solr"). Such URLs are deprecated and support for them will be removed in a future release. Correcting from [http://localhost:8983/solr] to [http://localhost:8983/].
WARNING: URLs provided to this tool needn't include Solr's context-root (e.g. "/solr"). Such URLs are deprecated and support for them will be removed in a future release. Correcting from [http://localhost:8983/solr] to [http://localhost:8983/].
Created new core 'techproducts'
Indexing tech product example docs from /home/jenkins/jenkins-slave/workspace/Solr/Solr-Smoketest-9.7/_tmp/smoke_1731768553/unpack/solr-9.7.1-java11/example/exampledocs
Posting files to [base] url http://localhost:8983/solr/techproducts/update using content-type application/xml...
POSTing file mp500.xml to [base]
POSTing file ipod_video.xml to [base]
POSTing file monitor2.xml to [base]
POSTing file gb18030-example.xml to [base]
POSTing file vidcard.xml to [base]
POSTing file money.xml to [base]
POSTing file hd.xml to [base]
POSTing file ipod_other.xml to [base]
POSTing file sd500.xml to [base]
POSTing file solr.xml to [base]
POSTing file utf8-example.xml to [base]
POSTing file monitor.xml to [base]
POSTing file manufacturers.xml to [base]
POSTing file mem.xml to [base]
14 files indexed.
COMMITting Solr index changes to http://localhost:8983/solr/techproducts/update...
WARNING: URLs provided to this tool needn't include Solr's context-root (e.g. "/solr"). Such URLs are deprecated and support for them will be removed in a future release. Correcting from [http://localhost:8983/solr] to [http://localhost:8983/].
Time spent: 0:00:00.717
test utf8...
run query...
stop server using: bin/solr stop -p 8983
Sending stop command to Solr running on port 8983 ... waiting up to 180 seconds to allow Jetty process 16834 to stop gracefully.
[|] [/] [-] [\] unpack solr-9.7.1-slim.tgz...
solr-9.7.1-slim.tgz
Checking LICENSE.txt
Checking NOTICE.txt
Checking README.txt
Checking CHANGES.txt
Checking bin
Checking docker
Checking docs
Checking example
Checking licenses
Checking server
Checking lib
verify JAR metadata/identity/no javax.* or java.* classes...
**WARNING**: skipping check of /home/jenkins/jenkins-slave/workspace/Solr/Solr-Smoketest-9.7/_tmp/smoke_1731768553/unpack/solr-9.7.1-slim/server/solr-webapp/webapp/WEB-INF/lib/jakarta.ws.rs-api-3.1.0.jar: it has javax.* classes
**WARNING**: skipping check of /home/jenkins/jenkins-slave/workspace/Solr/Solr-Smoketest-9.7/_tmp/smoke_1731768553/unpack/solr-9.7.1-slim/server/solr-webapp/webapp/WEB-INF/lib/jakarta.annotation-api-2.1.1.jar: it has javax.* classes
**WARNING**: skipping check of /home/jenkins/jenkins-slave/workspace/Solr/Solr-Smoketest-9.7/_tmp/smoke_1731768553/unpack/solr-9.7.1-slim/server/solr-webapp/webapp/WEB-INF/lib/jakarta.validation-api-3.0.2.jar: it has javax.* classes
**WARNING**: skipping check of /home/jenkins/jenkins-slave/workspace/Solr/Solr-Smoketest-9.7/_tmp/smoke_1731768553/unpack/solr-9.7.1-slim/server/solr-webapp/webapp/WEB-INF/lib/jakarta.inject-api-2.0.1.jar: it has javax.* classes
**WARNING**: skipping check of /home/jenkins/jenkins-slave/workspace/Solr/Solr-Smoketest-9.7/_tmp/smoke_1731768553/unpack/solr-9.7.1-slim/server/lib/ext/jetty-servlet-api-4.0.6.jar: it has javax.* classes
copying unpacked distribution for Java 11 ...
test solr example w/ Java 11...
start Solr instance (log=/home/jenkins/jenkins-slave/workspace/Solr/Solr-Smoketest-9.7/_tmp/smoke_1731768553/unpack/solr-9.7.1-slim-java11/solr-example.log)...
No process found for Solr node running on port 8983
Running techproducts example on port 8983 from /home/jenkins/jenkins-slave/workspace/Solr/Solr-Smoketest-9.7/_tmp/smoke_1731768553/unpack/solr-9.7.1-slim-java11
*** [WARN] *** Your open file limit is currently 60000.
It should be set to 65000 to avoid operational disruption.
If you no longer wish to see this warning, set SOLR_ULIMIT_CHECKS to false in your profile or solr.in.sh
*** [WARN] *** Your Max Processes Limit is currently 30000.
It should be set to 65000 to avoid operational disruption.
If you no longer wish to see this warning, set SOLR_ULIMIT_CHECKS to false in your profile or solr.in.sh
Creating Solr home directory /home/jenkins/jenkins-slave/workspace/Solr/Solr-Smoketest-9.7/_tmp/smoke_1731768553/unpack/solr-9.7.1-slim-java11/example/techproducts/solr
Starting up Solr on port 8983 using command:
"bin/solr" start -p 8983 -s "example/techproducts/solr"
*** [WARN] *** Your open file limit is currently 60000.
It should be set to 65000 to avoid operational disruption.
If you no longer wish to see this warning, set SOLR_ULIMIT_CHECKS to false in your profile or solr.in.sh
*** [WARN] *** Your Max Processes Limit is currently 30000.
It should be set to 65000 to avoid operational disruption.
If you no longer wish to see this warning, set SOLR_ULIMIT_CHECKS to false in your profile or solr.in.sh
Waiting up to 180 seconds to see Solr running on port 8983 [|] [/] [-] [\] [|]
Started Solr server on port 8983 (pid=17296). Happy searching!
WARNING: URLs provided to this tool needn't include Solr's context-root (e.g. "/solr"). Such URLs are deprecated and support for them will be removed in a future release. Correcting from [http://localhost:8983/solr/] to [http://localhost:8983/].
WARNING: URLs provided to this tool needn't include Solr's context-root (e.g. "/solr"). Such URLs are deprecated and support for them will be removed in a future release. Correcting from [http://localhost:8983/solr] to [http://localhost:8983/].
WARNING: URLs provided to this tool needn't include Solr's context-root (e.g. "/solr"). Such URLs are deprecated and support for them will be removed in a future release. Correcting from [http://localhost:8983/solr] to [http://localhost:8983/].
WARNING: URLs provided to this tool needn't include Solr's context-root (e.g. "/solr"). Such URLs are deprecated and support for them will be removed in a future release. Correcting from [http://localhost:8983/solr] to [http://localhost:8983/].
Created new core 'techproducts'
Indexing tech product example docs from /home/jenkins/jenkins-slave/workspace/Solr/Solr-Smoketest-9.7/_tmp/smoke_1731768553/unpack/solr-9.7.1-slim-java11/example/exampledocs
Posting files to [base] url http://localhost:8983/solr/techproducts/update using content-type application/xml...
POSTing file mp500.xml to [base]
POSTing file ipod_video.xml to [base]
POSTing file monitor2.xml to [base]
POSTing file gb18030-example.xml to [base]
POSTing file vidcard.xml to [base]
POSTing file money.xml to [base]
POSTing file hd.xml to [base]
POSTing file ipod_other.xml to [base]
POSTing file sd500.xml to [base]
POSTing file solr.xml to [base]
POSTing file utf8-example.xml to [base]
POSTing file monitor.xml to [base]
POSTing file manufacturers.xml to [base]
POSTing file mem.xml to [base]
14 files indexed.
COMMITting Solr index changes to http://localhost:8983/solr/techproducts/update...
WARNING: URLs provided to this tool needn't include Solr's context-root (e.g. "/solr"). Such URLs are deprecated and support for them will be removed in a future release. Correcting from [http://localhost:8983/solr] to [http://localhost:8983/].
Time spent: 0:00:00.707
test utf8...
run query...
stop server using: bin/solr stop -p 8983
Sending stop command to Solr running on port 8983 ... waiting up to 180 seconds to allow Jetty process 17296 to stop gracefully.
[|] [/] [-] [\] unpack solr-9.7.1-src.tgz...
solr-9.7.1-src.tgz
Checking LICENSE.txt
Checking NOTICE.txt
Checking README.md
Checking CONTRIBUTING.md
Checking CHANGES.txt
Checking README.adoc
Checking buildSrc
Checking dev-docs
Checking dev-tools
Checking gradle
Checking help
Checking solr
Checking build.gradle
Checking gradlew
Checking gradlew.bat
Checking settings.gradle
Checking versions.lock
Checking versions.props
Checking benchmark
Checking bin
Checking modules
Checking api
Checking core
Checking docker
Checking documentation
Checking example
Checking licenses
Checking packaging
Checking distribution
Checking prometheus-exporter
Checking server
Checking solr-ref-guide
Checking solrj
Checking solrj-streaming
Checking solrj-zookeeper
Checking test-framework
Checking webapp
Checking .gitignore
Checking .gitattributes
Checking build.gradle
make sure no JARs/WARs in src dist...
run "./gradlew --no-daemon check -p solr/documentation"
run tests w/ Java 11 and testArgs='-Dtests.nightly=false -Dtests.badapples=false '...
command "export JAVA_HOME="/home/jenkins/tools/java/latest11" PATH="/home/jenkins/tools/java/latest11/bin:$PATH" JAVACMD="/home/jenkins/tools/java/latest11/bin/java"; ./gradlew --no-daemon test -Dtests.nightly=false -Dtests.badapples=false " failed:
To honour the JVM settings for this build a single-use Daemon process will be forked. For more on this, please refer to https://docs.gradle.org/8.4/userguide/gradle_daemon.html#sec:disabling_the_daemon in the Gradle documentation.
Daemon will be stopped at the end of the build
> Task :buildSrc:compileJava UP-TO-DATE
> Task :buildSrc:compileGroovy NO-SOURCE
> Task :buildSrc:processResources NO-SOURCE
> Task :buildSrc:classes UP-TO-DATE
> Task :buildSrc:jar UP-TO-DATE
> Task :solr:api:processResources NO-SOURCE
> Task :solr:api:processTestResources
> Task :solr:core:processResources UP-TO-DATE
> Task :solr:solrj:processResources UP-TO-DATE
> Task :solr:solrj-streaming:processResources UP-TO-DATE
> Task :solr:solrj-zookeeper:processResources NO-SOURCE
> Task :solr:test-framework:processResources
> Task :solr:benchmark:processResources
> Task :solr:benchmark:processTestResources
> Task :gitStatus
> Task :checkJdkInternalsExportedToGradle
> Task :solr:api:compileJava UP-TO-DATE
> Task :solr:api:classes UP-TO-DATE
> Task :solr:api:jar UP-TO-DATE
> Task :ensureJdkSupported
> Task :randomizationInfo
Running tests with randomization seed: tests.seed=8DC2255ED43A5CAF
> Task :solr:api:resolve UP-TO-DATE
> Task :solr:core:processTestResources
> Task :solr:modules:analysis-extras:processResources NO-SOURCE
> Task :solr:prometheus-exporter:processResources NO-SOURCE
> Task :solr:prometheus-exporter:processTestResources
> Task :solr:server:compileJava SKIPPED
> Task :solr:server:processResources NO-SOURCE
> Task :solr:server:classes UP-TO-DATE
> Task :solr:server:compileTestJava NO-SOURCE
> Task :solr:server:processTestResources NO-SOURCE
> Task :solr:server:testClasses UP-TO-DATE
> Task :solr:server:test NO-SOURCE
> Task :solr:server:wipeTaskTemp
> Task :solr:solr-ref-guide:compileJava NO-SOURCE
> Task :solr:solr-ref-guide:processResources NO-SOURCE
> Task :solr:solr-ref-guide:classes UP-TO-DATE
> Task :solr:solr-ref-guide:copySolrjTestResources
> Task :solr:solr-ref-guide:processTestResources NO-SOURCE
> Task :solr:solrj-streaming:processTestResources
> Task :solr:modules:sql:processResources
> Task :solr:solrj-zookeeper:processTestResources
> Task :solr:test-framework:processTestResources
> Task :solr:webapp:processResources NO-SOURCE
> Task :solr:webapp:processTestResources NO-SOURCE
> Task :solr:modules:analysis-extras:processTestResources
> Task :solr:modules:analytics:processResources NO-SOURCE
> Task :solr:modules:analytics:processTestResources
> Task :solr:modules:clustering:processResources NO-SOURCE
> Task :solr:modules:clustering:processTestResources
> Task :solr:modules:extraction:processResources
> Task :solr:modules:extraction:processTestResources
> Task :solr:modules:gcs-repository:processResources NO-SOURCE
> Task :solr:modules:gcs-repository:processTestResources
> Task :solr:modules:hadoop-auth:processResources NO-SOURCE
> Task :solr:modules:hadoop-auth:copySolrCoreTestResources
> Task :solr:modules:hadoop-auth:processTestResources
> Task :solr:modules:hdfs:processResources NO-SOURCE
> Task :solr:modules:hdfs:copySolrCoreTestResources
> Task :solr:modules:hdfs:processTestResources
> Task :solr:modules:jaegertracer-configurator:processResources NO-SOURCE
> Task :solr:modules:jaegertracer-configurator:processTestResources
> Task :solr:modules:jwt-auth:processResources NO-SOURCE
> Task :solr:modules:jwt-auth:processTestResources
> Task :solr:modules:langid:processResources
> Task :solr:modules:langid:processTestResources
> Task :solr:modules:ltr:processResources NO-SOURCE
> Task :solr:modules:ltr:processTestResources
> Task :solr:modules:opentelemetry:processResources NO-SOURCE
> Task :solr:modules:opentelemetry:processTestResources
> Task :solr:modules:s3-repository:processResources NO-SOURCE
> Task :solr:modules:s3-repository:processTestResources
> Task :solr:modules:scripting:processResources NO-SOURCE
> Task :solr:modules:scripting:processTestResources
> Task :solr:modules:sql:copySolrCoreTestResources
> Task :solr:modules:sql:processTestResources
> Task :solr:solrj:openApiGenerate
Cleaned up output directory /home/jenkins/jenkins-slave/workspace/Solr/Solr-Smoketest-9.7/_tmp/smoke_1731768553/unpack/solr-9.7.1/solr/solrj/build/generated/ before code generation (cleanupOutput set to true).
################################################################################
# Thanks for using OpenAPI Generator. #
# Please consider donation to help us maintain this project ๐ #
# https://opencollective.com/openapi_generator/donate #
################################################################################
Successfully generated code to /home/jenkins/jenkins-slave/workspace/Solr/Solr-Smoketest-9.7/_tmp/smoke_1731768553/unpack/solr-9.7.1/solr/solrj/build/generated/
> Task :spotlessInternalRegisterDependencies UP-TO-DATE
> Task :solr:solrj:compileJava
Note: Some input files use or override a deprecated API.
Note: Recompile with -Xlint:deprecation for details.
> Task :solr:solrj-streaming:compileJava UP-TO-DATE
> Task :solr:solrj-zookeeper:compileJava UP-TO-DATE
> Task :solr:core:compileJava UP-TO-DATE
> Task :solr:test-framework:compileJava UP-TO-DATE
> Task :solr:solrj:generatedSpotlessHelper
> Task :solr:solrj:generatedSpotless
> Task :solr:core:classes UP-TO-DATE
> Task :solr:core:jar UP-TO-DATE
> Task :solr:solrj:classes
> Task :solr:solrj:jar UP-TO-DATE
> Task :solr:solrj-streaming:classes UP-TO-DATE
> Task :solr:solrj-streaming:jar UP-TO-DATE
> Task :solr:solrj-zookeeper:classes UP-TO-DATE
> Task :solr:solrj-zookeeper:jar UP-TO-DATE
> Task :solr:test-framework:classes
> Task :solr:test-framework:jar
> Task :solr:api:compileTestJava
> Task :solr:api:testClasses
> Task :solr:benchmark:compileJava
Note: Some input files use or override a deprecated API.
Note: Recompile with -Xlint:deprecation for details.
> Task :solr:benchmark:classes
> Task :solr:benchmark:compileTestJava
Note: /home/jenkins/jenkins-slave/workspace/Solr/Solr-Smoketest-9.7/_tmp/smoke_1731768553/unpack/solr-9.7.1/solr/benchmark/src/test/org/apache/solr/bench/MiniClusterBenchStateTest.java uses or overrides a deprecated API.
Note: Recompile with -Xlint:deprecation for details.
> Task :solr:benchmark:testClasses
> Task :solr:api:test
:solr:api:test (SUCCESS): 6 test(s)
> Task :solr:api:wipeTaskTemp
> Task :solr:benchmark:test
:solr:benchmark:test (SUCCESS): 11 test(s)
> Task :solr:benchmark:wipeTaskTemp
> Task :solr:modules:analysis-extras:compileJava
Note: /home/jenkins/jenkins-slave/workspace/Solr/Solr-Smoketest-9.7/_tmp/smoke_1731768553/unpack/solr-9.7.1/solr/modules/analysis-extras/src/java/org/apache/solr/schema/ICUCollationField.java uses or overrides a deprecated API.
Note: Recompile with -Xlint:deprecation for details.
> Task :solr:modules:analysis-extras:classes
> Task :solr:modules:analysis-extras:jar
> Task :solr:prometheus-exporter:compileJava
Note: Some input files use or override a deprecated API.
Note: Recompile with -Xlint:deprecation for details.
> Task :solr:prometheus-exporter:classes
> Task :solr:prometheus-exporter:compileTestJava
Note: /home/jenkins/jenkins-slave/workspace/Solr/Solr-Smoketest-9.7/_tmp/smoke_1731768553/unpack/solr-9.7.1/solr/prometheus-exporter/src/test/org/apache/solr/prometheus/exporter/MetricsQueryTemplateTest.java uses or overrides a deprecated API.
Note: Recompile with -Xlint:deprecation for details.
> Task :solr:prometheus-exporter:testClasses
> Task :solr:core:compileTestJava
> Task :solr:prometheus-exporter:test
:solr:prometheus-exporter:test (SUCCESS): 23 test(s)
> Task :solr:prometheus-exporter:wipeTaskTemp
> Task :solr:solr-ref-guide:compileTestJava
Note: Some input files use or override a deprecated API.
Note: Recompile with -Xlint:deprecation for details.
> Task :solr:solr-ref-guide:testClasses
> Task :solr:solr-ref-guide:test
:solr:solr-ref-guide:test (SUCCESS): 32 test(s)
> Task :solr:solr-ref-guide:wipeTaskTemp
> Task :solr:core:compileTestJava
Note: Some input files use or override a deprecated API.
Note: Recompile with -Xlint:deprecation for details.
> Task :solr:core:testClasses
> Task :solr:solrj:compileTestJava
Note: Some input files use or override a deprecated API.
Note: Recompile with -Xlint:deprecation for details.
> Task :solr:core:test
WARNING: Test org.apache.solr.TestRandomFaceting wrote 11,051,263 bytes of output.
WARNING: Test org.apache.solr.schema.TestCloudSchemaless wrote 13,162,313 bytes of output.
org.apache.solr.search.TestRealTimeGet > testStressGetRealtime FAILED
com.carrotsearch.randomizedtesting.UncaughtExceptionError: Captured an uncaught exception in thread: Thread[id=38330, name=READER6, state=RUNNABLE, group=TGRP-TestRealTimeGet]
at __randomizedtesting.SeedInfo.seed([8DC2255ED43A5CAF:17CC2F3CF2493F0D]:0)
Caused by:
java.lang.RuntimeException: java.util.concurrent.RejectedExecutionException: Task org.apache.solr.common.util.ExecutorUtil$MDCAwareThreadPoolExecutor$$Lambda$385/0x0000000100573440@1a825074 rejected from org.apache.solr.common.util.ExecutorUtil$MDCAwareThreadPoolExecutor@3470c385[Running, pool size = 1, active threads = 1, queued tasks = 1000, completed tasks = 25136]
at __randomizedtesting.SeedInfo.seed([8DC2255ED43A5CAF]:0)
at org.apache.solr.search.TestRealTimeGet$2.run(TestRealTimeGet.java:923)
Caused by:
java.util.concurrent.RejectedExecutionException: Task org.apache.solr.common.util.ExecutorUtil$MDCAwareThreadPoolExecutor$$Lambda$385/0x0000000100573440@1a825074 rejected from org.apache.solr.common.util.ExecutorUtil$MDCAwareThreadPoolExecutor@3470c385[Running, pool size = 1, active threads = 1, queued tasks = 1000, completed tasks = 25136]
at java.base/java.util.concurrent.ThreadPoolExecutor$AbortPolicy.rejectedExecution(ThreadPoolExecutor.java:2055)
at java.base/java.util.concurrent.ThreadPoolExecutor.reject(ThreadPoolExecutor.java:825)
at java.base/java.util.concurrent.ThreadPoolExecutor.execute(ThreadPoolExecutor.java:1355)
at org.apache.solr.common.util.ExecutorUtil$MDCAwareThreadPoolExecutor.execute(ExecutorUtil.java:430)
at org.apache.lucene.search.TaskExecutor$TaskGroup.invokeAll(TaskExecutor.java:152)
at org.apache.lucene.search.TaskExecutor.invokeAll(TaskExecutor.java:76)
at org.apache.lucene.index.TermStates.build(TermStates.java:116)
at org.apache.lucene.search.TermQuery.createWeight(TermQuery.java:275)
at org.apache.lucene.search.IndexSearcher.createWeight(IndexSearcher.java:882)
at org.apache.lucene.search.IndexSearcher.search(IndexSearcher.java:560)
at org.apache.solr.search.SolrIndexSearcher.buildAndRunCollectorChain(SolrIndexSearcher.java:276)
at org.apache.solr.search.SolrIndexSearcher.getDocListNC(SolrIndexSearcher.java:1932)
at org.apache.solr.search.SolrIndexSearcher.getDocListC(SolrIndexSearcher.java:1729)
at org.apache.solr.search.SolrIndexSearcher.search(SolrIndexSearcher.java:726)
at org.apache.solr.search.SolrIndexSearcher.search(SolrIndexSearcher.java:721)
at org.apache.solr.handler.component.QueryComponent.doProcessUngroupedSearch(QueryComponent.java:1690)
at org.apache.solr.handler.component.QueryComponent.process(QueryComponent.java:432)
at org.apache.solr.handler.component.SearchHandler.handleRequestBody(SearchHandler.java:456)
at org.apache.solr.handler.RequestHandlerBase.handleRequest(RequestHandlerBase.java:226)
at org.apache.solr.core.SolrCore.execute(SolrCore.java:2880)
at org.apache.solr.util.TestHarness.query(TestHarness.java:355)
at org.apache.solr.util.TestHarness.query(TestHarness.java:335)
at org.apache.solr.search.TestRealTimeGet$2.run(TestRealTimeGet.java:899)
org.apache.solr.search.TestRealTimeGet > test suite's output saved to /home/jenkins/jenkins-slave/workspace/Solr/Solr-Smoketest-9.7/_tmp/smoke_1731768553/unpack/solr-9.7.1/solr/core/build/test-results/test/outputs/OUTPUT-org.apache.solr.search.TestRealTimeGet.txt, copied below:
2> 1752337 INFO (SUITE-TestRealTimeGet-seed#[8DC2255ED43A5CAF]-worker) [n: c: s: r: x: t:] o.a.s.SolrTestCase Setting 'solr.default.confdir' system property to test-framework derived value of '/home/jenkins/jenkins-slave/workspace/Solr/Solr-Smoketest-9.7/_tmp/smoke_1731768553/unpack/solr-9.7.1/solr/server/solr/configsets/_default/conf'
2> 1752338 INFO (SUITE-TestRealTimeGet-seed#[8DC2255ED43A5CAF]-worker) [n: c: s: r: x: t:] o.a.s.u.ErrorLogMuter Closing ErrorLogMuter-regex-1748 after mutting 0 log messages
2> 1752338 INFO (SUITE-TestRealTimeGet-seed#[8DC2255ED43A5CAF]-worker) [n: c: s: r: x: t:] o.a.s.u.ErrorLogMuter Creating ErrorLogMuter-regex-1749 for ERROR logs matching regex: ignore_exception
2> 1752339 INFO (SUITE-TestRealTimeGet-seed#[8DC2255ED43A5CAF]-worker) [n: c: s: r: x: t:] o.a.s.SolrTestCaseJ4 Created dataDir: /home/jenkins/jenkins-slave/workspace/Solr/Solr-Smoketest-9.7/_tmp/smoke_1731768553/unpack/solr-9.7.1/solr/core/build/tmp/tests-tmp/org.apache.solr.search.TestRealTimeGet_8DC2255ED43A5CAF-001/data-dir-409-001
2> 1752339 WARN (SUITE-TestRealTimeGet-seed#[8DC2255ED43A5CAF]-worker) [n: c: s: r: x: t:] o.a.s.SolrTestCaseJ4 startTrackingSearchers: numOpens=36 numCloses=36
2> 1752339 INFO (SUITE-TestRealTimeGet-seed#[8DC2255ED43A5CAF]-worker) [n: c: s: r: x: t:] o.a.s.SolrTestCaseJ4 Using PointFields (NUMERIC_POINTS_SYSPROP=true) w/NUMERIC_DOCVALUES_SYSPROP=false
2> 1752340 INFO (SUITE-TestRealTimeGet-seed#[8DC2255ED43A5CAF]-worker) [n: c: s: r: x: t:] o.a.s.SolrTestCaseJ4 Randomized ssl (false) and clientAuth (false) via: @org.apache.solr.util.RandomizeSSL(reason="", ssl=0.0/0.0, value=0.0/0.0, clientAuth=0.0/0.0)
2> 1752340 INFO (SUITE-TestRealTimeGet-seed#[8DC2255ED43A5CAF]-worker) [n: c: s: r: x: t:] o.a.s.SolrTestCaseJ4 SecureRandom sanity checks: test.solr.allowed.securerandom=null & java.security.egd=file:/dev/./urandom
2> 1752340 INFO (SUITE-TestRealTimeGet-seed#[8DC2255ED43A5CAF]-worker) [n: c: s: r: x: t:] o.a.s.SolrTestCaseJ4 ####initCore
2> 1752343 INFO (SUITE-TestRealTimeGet-seed#[8DC2255ED43A5CAF]-worker) [n: c: s: r: x: t:] o.a.s.c.SolrResourceLoader Added 2 libs to classloader, from paths: [/home/jenkins/jenkins-slave/workspace/Solr/Solr-Smoketest-9.7/_tmp/smoke_1731768553/unpack/solr-9.7.1/solr/core/build/resources/test/solr/collection1/lib, /home/jenkins/jenkins-slave/workspace/Solr/Solr-Smoketest-9.7/_tmp/smoke_1731768553/unpack/solr-9.7.1/solr/core/build/resources/test/solr/collection1/lib/classes]
2> 1752355 INFO (SUITE-TestRealTimeGet-seed#[8DC2255ED43A5CAF]-worker) [n: c: s: r: x: t:] o.a.s.c.SolrConfig Using Lucene MatchVersion: 9.11.1
2> 1752357 INFO (SUITE-TestRealTimeGet-seed#[8DC2255ED43A5CAF]-worker) [n: c: s: r: x: t:] o.a.s.s.IndexSchema Schema name=example
2> 1752366 INFO (SUITE-TestRealTimeGet-seed#[8DC2255ED43A5CAF]-worker) [n: c: s: r: x: t:] o.a.s.s.IndexSchema Loaded schema example/1.7 with uniqueid field id
2> 1753436 INFO (SUITE-TestRealTimeGet-seed#[8DC2255ED43A5CAF]-worker) [n: c: s: r: x: t:] o.a.s.u.t.SimplePropagator Always-on trace id generation enabled.
2> 1753443 WARN (SUITE-TestRealTimeGet-seed#[8DC2255ED43A5CAF]-worker) [n: c: s: r: x: t:] o.a.s.c.CoreContainer Not all security plugins configured! authentication=disabled authorization=disabled. Solr is only as secure as you make it. Consider configuring authentication/authorization before exposing Solr to users internal or external. See https://s.apache.org/solrsecurity for more info
2> 1753466 INFO (coreLoadExecutor-27366-thread-1) [n: c: s: r: x:collection1 t:] o.a.s.c.SolrResourceLoader Added 2 libs to classloader, from paths: [/home/jenkins/jenkins-slave/workspace/Solr/Solr-Smoketest-9.7/_tmp/smoke_1731768553/unpack/solr-9.7.1/solr/core/build/resources/test/solr/collection1/lib, /home/jenkins/jenkins-slave/workspace/Solr/Solr-Smoketest-9.7/_tmp/smoke_1731768553/unpack/solr-9.7.1/solr/core/build/resources/test/solr/collection1/lib/classes]
2> 1753479 INFO (coreLoadExecutor-27366-thread-1) [n: c: s: r: x:collection1 t:] o.a.s.c.SolrConfig Using Lucene MatchVersion: 9.11.1
2> 1753481 INFO (coreLoadExecutor-27366-thread-1) [n: c: s: r: x:collection1 t:] o.a.s.s.IndexSchema Schema name=example
2> 1753490 INFO (coreLoadExecutor-27366-thread-1) [n: c: s: r: x:collection1 t:] o.a.s.s.IndexSchema Loaded schema example/1.7 with uniqueid field id
2> 1753499 INFO (coreLoadExecutor-27366-thread-1) [n: c: s: r: x:collection1 t:] o.a.s.c.CoreContainer Creating SolrCore 'collection1' using configuration from instancedir /home/jenkins/jenkins-slave/workspace/Solr/Solr-Smoketest-9.7/_tmp/smoke_1731768553/unpack/solr-9.7.1/solr/core/build/resources/test/solr/collection1, trusted=true
2> 1753499 INFO (coreLoadExecutor-27366-thread-1) [n: c: s: r: x:collection1 t:] o.a.s.c.SolrCore Opening new SolrCore at [/home/jenkins/jenkins-slave/workspace/Solr/Solr-Smoketest-9.7/_tmp/smoke_1731768553/unpack/solr-9.7.1/solr/core/build/resources/test/solr/collection1], dataDir=[/home/jenkins/jenkins-slave/workspace/Solr/Solr-Smoketest-9.7/_tmp/smoke_1731768553/unpack/solr-9.7.1/solr/core/build/tmp/tests-tmp/org.apache.solr.search.TestRealTimeGet_8DC2255ED43A5CAF-001/data-dir-409-001/]
2> 1753500 INFO (coreLoadExecutor-27366-thread-1) [n: c: s: r: x:collection1 t:] o.a.s.u.RandomMergePolicy RandomMergePolicy wrapping class org.apache.lucene.index.LogByteSizeMergePolicy: [LogByteSizeMergePolicy: minMergeSize=1677721, mergeFactor=14, maxMergeSize=2147483648, maxMergeSizeForForcedMerge=9223372036854775807, calibrateSizeByDeletes=true, maxMergeDocs=2147483647, maxCFSSegmentSizeMB=8.796093022208E12, noCFSRatio=0.0]
2> 1753502 WARN (coreLoadExecutor-27366-thread-1) [n: c: s: r: x:collection1 t:] o.a.s.c.RequestHandlers INVALID paramSet a in requestHandler {type = requestHandler,name = /dump,class = DumpRequestHandler,attributes = {initParams=a, name=/dump, class=DumpRequestHandler},args = {defaults={a=A, b=B}}}
2> 1753524 INFO (coreLoadExecutor-27366-thread-1) [n: c: s: r: x:collection1 t:] o.a.s.j.SolrRequestAuthorizer Creating a new SolrRequestAuthorizer
2> 1753526 INFO (coreLoadExecutor-27366-thread-1) [n: c: s: r: x:collection1 t:] o.a.s.u.UpdateHandler Using UpdateLog implementation: org.apache.solr.update.UpdateLog
2> 1753526 INFO (coreLoadExecutor-27366-thread-1) [n: c: s: r: x:collection1 t:] o.a.s.u.UpdateLog Initializing UpdateLog: dataDir= defaultSyncLevel=FLUSH numRecordsToKeep=100 maxNumLogsToKeep=10 numVersionBuckets=65536
2> 1753527 INFO (coreLoadExecutor-27366-thread-1) [n: c: s: r: x:collection1 t:] o.a.s.u.CommitTracker Hard AutoCommit: disabled
2> 1753527 INFO (coreLoadExecutor-27366-thread-1) [n: c: s: r: x:collection1 t:] o.a.s.u.CommitTracker Soft AutoCommit: disabled
2> 1753528 INFO (coreLoadExecutor-27366-thread-1) [n: c: s: r: x:collection1 t:] o.a.s.u.RandomMergePolicy RandomMergePolicy wrapping class org.apache.lucene.index.TieredMergePolicy: [TieredMergePolicy: maxMergeAtOnce=37, maxMergedSegmentMB=50.680113792419434, floorSegmentMB=1.7067832946777344, forceMergeDeletesPctAllowed=18.313509161397004, segmentsPerTier=43.0, maxCFSSegmentSizeMB=8.796093022208E12, noCFSRatio=0.11090196469473997, deletesPctAllowed=30.821489974059762
2> 1753528 WARN (coreLoadExecutor-27366-thread-1) [n: c: s: r: x:collection1 t:] o.a.s.r.ManagedResourceStorage Cannot write to config directory /home/jenkins/jenkins-slave/workspace/Solr/Solr-Smoketest-9.7/_tmp/smoke_1731768553/unpack/solr-9.7.1/solr/core/build/resources/test/solr/collection1/conf ; switching to use InMemory storage instead.
2> 1753529 INFO (coreLoadExecutor-27366-thread-1) [n: c: s: r: x:collection1 t:] o.a.s.h.ReplicationHandler Commits will be reserved for 10000 ms
2> 1753534 INFO (searcherExecutor-27368-thread-1-processing-collection1) [n: c: s: r: x:collection1 t:] o.a.s.c.SolrCore Registered new searcher autowarm time: 0 ms
2> 1753554 INFO (SUITE-TestRealTimeGet-seed#[8DC2255ED43A5CAF]-worker) [n: c: s: r: x: t:] o.a.s.j.SolrRequestAuthorizer Creating a new SolrRequestAuthorizer
2> 1753563 INFO (SUITE-TestRealTimeGet-seed#[8DC2255ED43A5CAF]-worker) [n: c: s: r: x: t:] o.a.s.SolrTestCaseJ4 ####initCore end
2> 1753566 INFO (TEST-TestRealTimeGet.testGetRealtime-seed#[8DC2255ED43A5CAF]) [n: c: s: r: x: t:] o.a.s.SolrTestCaseJ4 ###Starting testGetRealtime
2> 1753567 INFO (TEST-TestRealTimeGet.testGetRealtime-seed#[8DC2255ED43A5CAF]) [n: c: s: r: x: t:] o.a.s.u.DirectUpdateHandler2 REMOVING ALL DOCUMENTS FROM INDEX
2> 1753567 INFO (TEST-TestRealTimeGet.testGetRealtime-seed#[8DC2255ED43A5CAF]) [n: c: s: r: x: t:] o.a.s.u.p.LogUpdateProcessorFactory webapp=null path=null params={_version_=-9223372036854775807&update.distrib=FROMLEADER&versions=true&wt=json&indent=true}{deleteByQuery=*:* (-9223372036854775807)} 0 0
2> 1753570 INFO (searcherExecutor-27368-thread-1-processing-collection1) [n: c: s: r: x:collection1 t:] o.a.s.c.SolrCore Registered new searcher autowarm time: 0 ms
2> 1753570 INFO (TEST-TestRealTimeGet.testGetRealtime-seed#[8DC2255ED43A5CAF]) [n: c: s: r: x:collection1 t:] o.a.s.u.p.LogUpdateProcessorFactory webapp=null path=null params={}{commit=} 0 3
2> 1753573 INFO (TEST-TestRealTimeGet.testGetRealtime-seed#[8DC2255ED43A5CAF]) [n: c: s: r: x:collection1 t:] o.a.s.u.p.LogUpdateProcessorFactory webapp=null path=null params={}{add=[1 (1815893138211864576)]} 0 1
2> 1753573 INFO (TEST-TestRealTimeGet.testGetRealtime-seed#[8DC2255ED43A5CAF]) [n: c: s: r: x: t:] o.a.s.c.S.Request webapp=null path=null params={q=id:1&wt=xml} hits=0 status=0 QTime=0
2> 1753574 INFO (TEST-TestRealTimeGet.testGetRealtime-seed#[8DC2255ED43A5CAF]) [n: c: s: r: x: t:] o.a.s.c.S.Request webapp=null path=null params={qt=/get&fl=id,+a_f,a_fd,a_fdS+++a_fs,a_fds,a_fdsS,++a_d,a_dd,a_ddS,++a_ds,a_dds,a_ddsS,++a_i,a_id,a_idS+++a_is,a_ids,a_idsS,+++a_l,a_ld,a_ldS,+++a_ls,a_lds,a_ldsS,++a_s,a_sd,a_sdS+++a_ss,a_sds,a_sdsS,+++a_b,a_bd,a_bdS,+++a_bs,a_bds,a_bdsS&id=1&wt=xml} status=0 QTime=0
2> 1753574 INFO (TEST-TestRealTimeGet.testGetRealtime-seed#[8DC2255ED43A5CAF]) [n: c: s: r: x: t:] o.a.s.c.S.Request webapp=null path=null params={qt=/get&fl=id&ids=1&wt=xml} status=0 QTime=0
2> 1753580 INFO (searcherExecutor-27368-thread-1-processing-collection1) [n: c: s: r: x:collection1 t:] o.a.s.c.SolrCore Registered new searcher autowarm time: 0 ms
2> 1753580 INFO (TEST-TestRealTimeGet.testGetRealtime-seed#[8DC2255ED43A5CAF]) [n: c: s: r: x:collection1 t:] o.a.s.u.p.LogUpdateProcessorFactory webapp=null path=null params={}{commit=} 0 6
2> 1753581 INFO (TEST-TestRealTimeGet.testGetRealtime-seed#[8DC2255ED43A5CAF]) [n: c: s: r: x: t:] o.a.s.c.S.Request webapp=null path=null params={q=id:1&wt=xml} hits=1 status=0 QTime=0
2> 1753582 INFO (TEST-TestRealTimeGet.testGetRealtime-seed#[8DC2255ED43A5CAF]) [n: c: s: r: x: t:] o.a.s.c.S.Request webapp=null path=null params={qt=/get&fl=id,+a_f,a_fd,a_fdS+++a_fs,a_fds,a_fdsS,++a_d,a_dd,a_ddS,++a_ds,a_dds,a_ddsS,++a_i,a_id,a_idS+++a_is,a_ids,a_idsS,+++a_l,a_ld,a_ldS+++a_ls,a_lds,a_ldsS&id=1&wt=xml} status=0 QTime=0
2> 1753582 INFO (TEST-TestRealTimeGet.testGetRealtime-seed#[8DC2255ED43A5CAF]) [n: c: s: r: x: t:] o.a.s.c.S.Request webapp=null path=null params={qt=/get&fl=id&id=1&wt=xml} status=0 QTime=0
2> 1753582 INFO (TEST-TestRealTimeGet.testGetRealtime-seed#[8DC2255ED43A5CAF]) [n: c: s: r: x: t:] o.a.s.c.S.Request webapp=null path=null params={qt=/get&fl=id&ids=1&wt=xml} status=0 QTime=0
2> 1753583 INFO (TEST-TestRealTimeGet.testGetRealtime-seed#[8DC2255ED43A5CAF]) [n: c: s: r: x:collection1 t:] o.a.s.u.p.LogUpdateProcessorFactory webapp=null path=null params={}{delete=[1 (-1815893138223398912)]} 0 0
2> 1753583 INFO (TEST-TestRealTimeGet.testGetRealtime-seed#[8DC2255ED43A5CAF]) [n: c: s: r: x: t:] o.a.s.c.S.Request webapp=null path=null params={q=id:1&wt=xml} hits=1 status=0 QTime=0
2> 1753584 INFO (TEST-TestRealTimeGet.testGetRealtime-seed#[8DC2255ED43A5CAF]) [n: c: s: r: x: t:] o.a.s.c.S.Request webapp=null path=null params={qt=/get&id=1&wt=xml} status=0 QTime=0
2> 1753584 INFO (TEST-TestRealTimeGet.testGetRealtime-seed#[8DC2255ED43A5CAF]) [n: c: s: r: x: t:] o.a.s.c.S.Request webapp=null path=null params={qt=/get&ids=1&wt=xml} status=0 QTime=0
2> 1753585 INFO (TEST-TestRealTimeGet.testGetRealtime-seed#[8DC2255ED43A5CAF]) [n: c: s: r: x:collection1 t:] o.a.s.u.p.LogUpdateProcessorFactory webapp=null path=null params={}{add=[10 (1815893138225496064)]} 0 0
2> 1753585 INFO (TEST-TestRealTimeGet.testGetRealtime-seed#[8DC2255ED43A5CAF]) [n: c: s: r: x:collection1 t:] o.a.s.u.p.LogUpdateProcessorFactory webapp=null path=null params={}{add=[11 (1815893138225496065)]} 0 0
2> 1753586 INFO (TEST-TestRealTimeGet.testGetRealtime-seed#[8DC2255ED43A5CAF]) [n: c: s: r: x: t:] o.a.s.c.S.Request webapp=null path=null params={qt=/get&fl=id&id=10&wt=xml} status=0 QTime=0
2> 1753589 INFO (TEST-TestRealTimeGet.testGetRealtime-seed#[8DC2255ED43A5CAF]) [n: c: s: r: x:collection1 t:] o.a.s.u.p.LogUpdateProcessorFactory webapp=null path=null params={}{deleteByQuery=id:10 foo_s:abcdef (-1815893138226544640)} 0 3
2> 1753590 INFO (TEST-TestRealTimeGet.testGetRealtime-seed#[8DC2255ED43A5CAF]) [n: c: s: r: x: t:] o.a.s.c.S.Request webapp=null path=null params={qt=/get&id=10&wt=xml} status=0 QTime=0
2> 1753590 INFO (TEST-TestRealTimeGet.testGetRealtime-seed#[8DC2255ED43A5CAF]) [n: c: s: r: x: t:] o.a.s.c.S.Request webapp=null path=null params={qt=/get&fl=id&id=11&wt=xml} status=0 QTime=0
2> 1753590 INFO (TEST-TestRealTimeGet.testGetRealtime-seed#[8DC2255ED43A5CAF]) [n: c: s: r: x:collection1 t:] o.a.s.u.p.LogUpdateProcessorFactory webapp=null path=null params={}{add=[12 (1815893138230738944)]} 0 0
2> 1753591 INFO (TEST-TestRealTimeGet.testGetRealtime-seed#[8DC2255ED43A5CAF]) [n: c: s: r: x: t:] o.a.s.c.S.Request webapp=null path=null params={q=id:12&wt=xml} hits=0 status=0 QTime=0
2> 1753591 INFO (TEST-TestRealTimeGet.testGetRealtime-seed#[8DC2255ED43A5CAF]) [n: c: s: r: x: t:] o.a.s.c.S.Request webapp=null path=null params={qt=/get&fl=id,val_ls&id=12&wt=xml} status=0 QTime=0
2> 1753595 INFO (searcherExecutor-27368-thread-1-processing-collection1) [n: c: s: r: x:collection1 t:] o.a.s.c.SolrCore Registered new searcher autowarm time: 0 ms
2> 1753595 INFO (TEST-TestRealTimeGet.testGetRealtime-seed#[8DC2255ED43A5CAF]) [n: c: s: r: x:collection1 t:] o.a.s.u.p.LogUpdateProcessorFactory webapp=null path=null params={}{commit=} 0 4
2> 1753596 INFO (TEST-TestRealTimeGet.testGetRealtime-seed#[8DC2255ED43A5CAF]) [n: c: s: r: x: t:] o.a.s.c.S.Request webapp=null path=null params={qt=/get&fl=id,val_ls&id=12&wt=xml} status=0 QTime=0
2> 1753596 INFO (TEST-TestRealTimeGet.testGetRealtime-seed#[8DC2255ED43A5CAF]) [n: c: s: r: x: t:] o.a.s.c.S.Request webapp=null path=null params={q=id:12&wt=xml} hits=1 status=0 QTime=0
2> 1753597 INFO (TEST-TestRealTimeGet.testGetRealtime-seed#[8DC2255ED43A5CAF]) [n: c: s: r: x:collection1 t:] o.a.s.u.p.LogUpdateProcessorFactory webapp=null path=null params={}{add=[12 (1815893138237030400)]} 0 0
2> 1753597 INFO (TEST-TestRealTimeGet.testGetRealtime-seed#[8DC2255ED43A5CAF]) [n: c: s: r: x:collection1 t:] o.a.s.u.p.LogUpdateProcessorFactory webapp=null path=null params={}{add=[13 (1815893138238078976)]} 0 0
2> 1753597 INFO (TEST-TestRealTimeGet.testGetRealtime-seed#[8DC2255ED43A5CAF]) [n: c: s: r: x: t:] o.a.s.c.S.Request webapp=null path=null params={qt=/get&fl=id&id=11&fq=id:11&wt=xml} status=0 QTime=0
2> 1753599 INFO (TEST-TestRealTimeGet.testGetRealtime-seed#[8DC2255ED43A5CAF]) [n: c: s: r: x: t:] o.a.s.c.S.Request webapp=null path=null params={qt=/get&fl=id&id=12&fq=id:11&wt=xml} status=0 QTime=1
2> 1753599 INFO (TEST-TestRealTimeGet.testGetRealtime-seed#[8DC2255ED43A5CAF]) [n: c: s: r: x: t:] o.a.s.c.S.Request webapp=null path=null params={qt=/get&fl=id&id=12&fq=id:13&wt=xml} status=0 QTime=0
2> 1753599 INFO (TEST-TestRealTimeGet.testGetRealtime-seed#[8DC2255ED43A5CAF]) [n: c: s: r: x: t:] o.a.s.c.S.Request webapp=null path=null params={qt=/get&fl=id&id=12&fq=id:12&wt=xml} status=0 QTime=0
2> 1753600 INFO (TEST-TestRealTimeGet.testGetRealtime-seed#[8DC2255ED43A5CAF]) [n: c: s: r: x:collection1 t:] o.a.s.u.p.LogUpdateProcessorFactory webapp=null path=null params={}{add=[14 (1815893138240176128)]} 0 0
2> 1753600 INFO (TEST-TestRealTimeGet.testGetRealtime-seed#[8DC2255ED43A5CAF]) [n: c: s: r: x:collection1 t:] o.a.s.u.p.LogUpdateProcessorFactory webapp=null path=null params={}{add=[15 (1815893138241224704)]} 0 0
2> 1753602 INFO (TEST-TestRealTimeGet.testGetRealtime-seed#[8DC2255ED43A5CAF]) [n: c: s: r: x: t:] o.a.s.c.S.Request webapp=null path=null params={qt=/get&fl=id&ids=12,14,13,15&fq=id:[10+TO+14]&fq=id:[13+TO+19]&wt=xml} status=0 QTime=1
2> 1753602 INFO (TEST-TestRealTimeGet.testGetRealtime-seed#[8DC2255ED43A5CAF]) [n: c: s: r: x:collection1 t:] o.a.s.u.p.LogUpdateProcessorFactory webapp=null path=null params={}{add=[16 (1815893138243321856)]} 0 0
2> 1753602 INFO (TEST-TestRealTimeGet.testGetRealtime-seed#[8DC2255ED43A5CAF]) [n: c: s: r: x:collection1 t:] o.a.s.u.p.LogUpdateProcessorFactory webapp=null path=null params={}{add=[17 (1815893138243321857)]} 0 0
2> 1753604 INFO (TEST-TestRealTimeGet.testGetRealtime-seed#[8DC2255ED43A5CAF]) [n: c: s: r: x: t:] o.a.s.c.S.Request webapp=null path=null params={qt=/get&fl=id&ids=17,16,15,14&fq=id:[15+TO+16]&wt=xml} status=0 QTime=1
2> 1753605 INFO (TEST-TestRealTimeGet.testGetRealtime-seed#[8DC2255ED43A5CAF]) [n: c: s: r: x: t:] o.a.s.c.S.Request webapp=null path=null params={qt=/get&fl=id&ids=17,16,15,14&fq={!frange+l%3D15+u%3D16}id&wt=xml} status=0 QTime=0
2> 1753605 INFO (TEST-TestRealTimeGet.testGetRealtime-seed#[8DC2255ED43A5CAF]) [n: c: s: r: x: t:] o.a.s.c.S.Request webapp=null path=null params={qt=/get&fl=id&ids=15,14&fq=-id:15&wt=xml} status=0 QTime=0
2> 1753605 INFO (TEST-TestRealTimeGet.testGetRealtime-seed#[8DC2255ED43A5CAF]) [n: c: s: r: x: t:] o.a.s.c.S.Request webapp=null path=null params={qt=/get&fl=id&ids=17,16,15,14&fq=-id:[15+TO+17]&wt=xml} status=0 QTime=0
2> 1753606 INFO (TEST-TestRealTimeGet.testGetRealtime-seed#[8DC2255ED43A5CAF]) [n: c: s: r: x: t:] o.a.s.SolrTestCaseJ4 ###Ending testGetRealtime
2> 1753610 INFO (TEST-TestRealTimeGet.testOptimisticLocking-seed#[8DC2255ED43A5CAF]) [n: c: s: r: x: t:] o.a.s.SolrTestCaseJ4 ###Starting testOptimisticLocking
2> 1753610 INFO (TEST-TestRealTimeGet.testOptimisticLocking-seed#[8DC2255ED43A5CAF]) [n: c: s: r: x: t:] o.a.s.u.DirectUpdateHandler2 REMOVING ALL DOCUMENTS FROM INDEX
2> 1753610 INFO (TEST-TestRealTimeGet.testOptimisticLocking-seed#[8DC2255ED43A5CAF]) [n: c: s: r: x: t:] o.a.s.u.p.LogUpdateProcessorFactory webapp=null path=null params={_version_=-9223372036854775807&update.distrib=FROMLEADER&versions=true&wt=json&indent=true}{deleteByQuery=*:* (-9223372036854775807)} 0 0
2> 1753614 INFO (searcherExecutor-27368-thread-1-processing-collection1) [n: c: s: r: x:collection1 t:] o.a.s.c.SolrCore Registered new searcher autowarm time: 0 ms
2> 1753614 INFO (TEST-TestRealTimeGet.testOptimisticLocking-seed#[8DC2255ED43A5CAF]) [n: c: s: r: x:collection1 t:] o.a.s.u.p.LogUpdateProcessorFactory webapp=null path=null params={}{commit=} 0 3
2> 1753615 INFO (TEST-TestRealTimeGet.testOptimisticLocking-seed#[8DC2255ED43A5CAF]) [n: c: s: r: x: t:] o.a.s.u.p.LogUpdateProcessorFactory webapp=null path=null params={versions=true&wt=json&indent=true}{add=[1 (1815893138255904768)]} 0 0
2> 1753616 INFO (TEST-TestRealTimeGet.testOptimisticLocking-seed#[8DC2255ED43A5CAF]) [n: c: s: r: x: t:] o.a.s.u.p.LogUpdateProcessorFactory webapp=null path=null params={versions=true&wt=json&indent=true}{} 0 0
2> 1753616 INFO (TEST-TestRealTimeGet.testOptimisticLocking-seed#[8DC2255ED43A5CAF]) [n: c: s: r: x: t:] o.a.s.u.p.LogUpdateProcessorFactory webapp=null path=null params={_version_=1815893138255904767&versions=true&wt=json&indent=true}{} 0 0
2> 1753617 INFO (TEST-TestRealTimeGet.testOptimisticLocking-seed#[8DC2255ED43A5CAF]) [n: c: s: r: x: t:] o.a.s.u.p.LogUpdateProcessorFactory webapp=null path=null params={_version_=-1815893138255904768&versions=true&wt=json&indent=true}{} 0 0
2> 1753617 INFO (TEST-TestRealTimeGet.testOptimisticLocking-seed#[8DC2255ED43A5CAF]) [n: c: s: r: x: t:] o.a.s.u.p.LogUpdateProcessorFactory webapp=null path=null params={_version_=1815893138255905091&versions=true&wt=json&indent=true}{} 0 0
2> 1753617 INFO (TEST-TestRealTimeGet.testOptimisticLocking-seed#[8DC2255ED43A5CAF]) [n: c: s: r: x: t:] o.a.s.u.p.LogUpdateProcessorFactory webapp=null path=null params={_version_=1815893138255904767&versions=true&wt=json&indent=true}{} 0 0
2> 1753618 INFO (TEST-TestRealTimeGet.testOptimisticLocking-seed#[8DC2255ED43A5CAF]) [n: c: s: r: x: t:] o.a.s.u.p.LogUpdateProcessorFactory webapp=null path=null params={_version_=-1815893138255904768&versions=true&wt=json&indent=true}{} 0 0
2> 1753618 INFO (TEST-TestRealTimeGet.testOptimisticLocking-seed#[8DC2255ED43A5CAF]) [n: c: s: r: x: t:] o.a.s.u.p.LogUpdateProcessorFactory webapp=null path=null params={_version_=1815893138255905212&versions=true&wt=json&indent=true}{} 0 0
2> 1753618 INFO (TEST-TestRealTimeGet.testOptimisticLocking-seed#[8DC2255ED43A5CAF]) [n: c: s: r: x: t:] o.a.s.u.p.LogUpdateProcessorFactory webapp=null path=null params={_version_=1815893138255904768&versions=true&wt=json&indent=true}{} 0 0
2> 1753619 INFO (TEST-TestRealTimeGet.testOptimisticLocking-seed#[8DC2255ED43A5CAF]) [n: c: s: r: x: t:] o.a.s.u.p.LogUpdateProcessorFactory webapp=null path=null params={_version_=-1&versions=true&wt=json&indent=true}{delete=[I_do_not_exist (-1815893138261147648)]} 0 0
2> 1753619 INFO (TEST-TestRealTimeGet.testOptimisticLocking-seed#[8DC2255ED43A5CAF]) [n: c: s: r: x: t:] o.a.s.u.p.LogUpdateProcessorFactory webapp=null path=null params={versions=true&wt=json&indent=true}{add=[1 (1815893138261147649)]} 0 0
2> 1753619 INFO (TEST-TestRealTimeGet.testOptimisticLocking-seed#[8DC2255ED43A5CAF]) [n: c: s: r: x: t:] o.a.s.u.p.LogUpdateProcessorFactory webapp=null path=null params={_version_=1815893138255904768&versions=true&wt=json&indent=true}{} 0 0
2> 1753620 INFO (TEST-TestRealTimeGet.testOptimisticLocking-seed#[8DC2255ED43A5CAF]) [n: c: s: r: x: t:] o.a.s.u.p.LogUpdateProcessorFactory webapp=null path=null params={_version_=1815893138255904768&versions=true&wt=json&indent=true}{} 0 0
2> 1753620 INFO (TEST-TestRealTimeGet.testOptimisticLocking-seed#[8DC2255ED43A5CAF]) [n: c: s: r: x: t:] o.a.s.u.p.LogUpdateProcessorFactory webapp=null path=null params={_version_=1815893138261147649&versions=true&wt=json&indent=true}{delete=[1 (-1815893138262196224)]} 0 0
2> 1753620 INFO (TEST-TestRealTimeGet.testOptimisticLocking-seed#[8DC2255ED43A5CAF]) [n: c: s: r: x: t:] o.a.s.u.p.LogUpdateProcessorFactory webapp=null path=null params={_version_=1815893138261147649&versions=true&wt=json&indent=true}{} 0 0
2> 1753621 INFO (TEST-TestRealTimeGet.testOptimisticLocking-seed#[8DC2255ED43A5CAF]) [n: c: s: r: x: t:] o.a.s.u.p.LogUpdateProcessorFactory webapp=null path=null params={_version_=1815893138261147649&versions=true&wt=json&indent=true}{} 0 0
2> 1753621 INFO (TEST-TestRealTimeGet.testOptimisticLocking-seed#[8DC2255ED43A5CAF]) [n: c: s: r: x: t:] o.a.s.u.p.LogUpdateProcessorFactory webapp=null path=null params={_version_=-1815893138261147648&versions=true&wt=json&indent=true}{add=[1 (1815893138263244800)]} 0 0
2> 1753622 INFO (TEST-TestRealTimeGet.testOptimisticLocking-seed#[8DC2255ED43A5CAF]) [n: c: s: r: x: t:] o.a.s.c.S.Request webapp=null path=null params={qt=/get&id=1&wt=xml} status=0 QTime=1
2> 1753623 INFO (TEST-TestRealTimeGet.testOptimisticLocking-seed#[8DC2255ED43A5CAF]) [n: c: s: r: x: t:] o.a.s.SolrTestCaseJ4 ###Ending testOptimisticLocking
2> 1753627 INFO (TEST-TestRealTimeGet.testVersions-seed#[8DC2255ED43A5CAF]) [n: c: s: r: x: t:] o.a.s.SolrTestCaseJ4 ###Starting testVersions
2> 1753627 INFO (TEST-TestRealTimeGet.testVersions-seed#[8DC2255ED43A5CAF]) [n: c: s: r: x: t:] o.a.s.u.DirectUpdateHandler2 REMOVING ALL DOCUMENTS FROM INDEX
2> 1753627 INFO (TEST-TestRealTimeGet.testVersions-seed#[8DC2255ED43A5CAF]) [n: c: s: r: x: t:] o.a.s.u.p.LogUpdateProcessorFactory webapp=null path=null params={_version_=-9223372036854775807&update.distrib=FROMLEADER&versions=true&wt=json&indent=true}{deleteByQuery=*:* (-9223372036854775807)} 0 0
2> 1753630 INFO (searcherExecutor-27368-thread-1-processing-collection1) [n: c: s: r: x:collection1 t:] o.a.s.c.SolrCore Registered new searcher autowarm time: 0 ms
2> 1753630 INFO (TEST-TestRealTimeGet.testVersions-seed#[8DC2255ED43A5CAF]) [n: c: s: r: x:collection1 t:] o.a.s.u.p.LogUpdateProcessorFactory webapp=null path=null params={}{commit=} 0 2
2> 1753631 INFO (TEST-TestRealTimeGet.testVersions-seed#[8DC2255ED43A5CAF]) [n: c: s: r: x: t:] o.a.s.u.p.LogUpdateProcessorFactory webapp=null path=null params={versions=true&wt=json&indent=true}{add=[1 (1815893138272681984)]} 0 0
2> 1753631 INFO (TEST-TestRealTimeGet.testVersions-seed#[8DC2255ED43A5CAF]) [n: c: s: r: x: t:] o.a.s.c.S.Request webapp=null path=null params={q=id:1&wt=xml} hits=0 status=0 QTime=0
2> 1753631 INFO (TEST-TestRealTimeGet.testVersions-seed#[8DC2255ED43A5CAF]) [n: c: s: r: x: t:] o.a.s.c.S.Request webapp=null path=null params={qt=/get&id=1&wt=xml} status=0 QTime=0
2> 1753635 INFO (searcherExecutor-27368-thread-1-processing-collection1) [n: c: s: r: x:collection1 t:] o.a.s.c.SolrCore Registered new searcher autowarm time: 0 ms
2> 1753636 INFO (TEST-TestRealTimeGet.testVersions-seed#[8DC2255ED43A5CAF]) [n: c: s: r: x:collection1 t:] o.a.s.u.p.LogUpdateProcessorFactory webapp=null path=null params={}{commit=} 0 4
2> 1753636 INFO (TEST-TestRealTimeGet.testVersions-seed#[8DC2255ED43A5CAF]) [n: c: s: r: x: t:] o.a.s.c.S.Request webapp=null path=null params={qt=/get&id=1&wt=xml} status=0 QTime=0
2> 1753637 INFO (TEST-TestRealTimeGet.testVersions-seed#[8DC2255ED43A5CAF]) [n: c: s: r: x: t:] o.a.s.u.p.LogUpdateProcessorFactory webapp=null path=null params={update.distrib=FROMLEADER&wt=json&indent=true}{add=[1 (1815893138272681994)]} 0 0
2> 1753637 INFO (TEST-TestRealTimeGet.testVersions-seed#[8DC2255ED43A5CAF]) [n: c: s: r: x: t:] o.a.s.c.S.Request webapp=null path=null params={qt=/get&id=1&wt=xml} status=0 QTime=0
2> 1753637 INFO (TEST-TestRealTimeGet.testVersions-seed#[8DC2255ED43A5CAF]) [n: c: s: r: x: t:] o.a.s.u.p.LogUpdateProcessorFactory webapp=null path=null params={update.distrib=FROMLEADER&wt=json&indent=true}{add=[1 (1815893138272681993)]} 0 0
2> 1753637 INFO (TEST-TestRealTimeGet.testVersions-seed#[8DC2255ED43A5CAF]) [n: c: s: r: x: t:] o.a.s.c.S.Request webapp=null path=null params={qt=/get&id=1&wt=xml} status=0 QTime=0
2> 1753638 INFO (TEST-TestRealTimeGet.testVersions-seed#[8DC2255ED43A5CAF]) [n: c: s: r: x: t:] o.a.s.u.p.LogUpdateProcessorFactory webapp=null path=null params={update.distrib=FROMLEADER&_version_=1815893138272681993&wt=json&indent=true}{delete=[1 (-1815893138272681993)]} 0 0
2> 1753638 INFO (TEST-TestRealTimeGet.testVersions-seed#[8DC2255ED43A5CAF]) [n: c: s: r: x: t:] o.a.s.c.S.Request webapp=null path=null params={qt=/get&id=1&wt=xml} status=0 QTime=0
2> 1753642 INFO (searcherExecutor-27368-thread-1-processing-collection1) [n: c: s: r: x:collection1 t:] o.a.s.c.SolrCore Registered new searcher autowarm time: 0 ms
2> 1753642 INFO (TEST-TestRealTimeGet.testVersions-seed#[8DC2255ED43A5CAF]) [n: c: s: r: x:collection1 t:] o.a.s.u.p.LogUpdateProcessorFactory webapp=null path=null params={}{commit=} 0 3
2> 1753642 INFO (TEST-TestRealTimeGet.testVersions-seed#[8DC2255ED43A5CAF]) [n: c: s: r: x: t:] o.a.s.u.p.LogUpdateProcessorFactory webapp=null path=null params={update.distrib=FROMLEADER&wt=json&indent=true}{add=[1 (1815893138272681993)]} 0 0
2> 1753642 INFO (TEST-TestRealTimeGet.testVersions-seed#[8DC2255ED43A5CAF]) [n: c: s: r: x: t:] o.a.s.c.S.Request webapp=null path=null params={qt=/get&id=1&wt=xml} status=0 QTime=0
2> 1753643 INFO (TEST-TestRealTimeGet.testVersions-seed#[8DC2255ED43A5CAF]) [n: c: s: r: x: t:] o.a.s.u.p.LogUpdateProcessorFactory webapp=null path=null params={update.distrib=FROMLEADER&_version_=1815893138272681993&wt=json&indent=true}{delete=[1 (-1815893138272681993)]} 0 0
2> 1753643 INFO (TEST-TestRealTimeGet.testVersions-seed#[8DC2255ED43A5CAF]) [n: c: s: r: x: t:] o.a.s.c.S.Request webapp=null path=null params={qt=/get&id=1&wt=xml} status=0 QTime=0
2> 1753643 INFO (TEST-TestRealTimeGet.testVersions-seed#[8DC2255ED43A5CAF]) [n: c: s: r: x: t:] o.a.s.u.p.LogUpdateProcessorFactory webapp=null path=null params={update.distrib=FROMLEADER&_version_=1815893138272681999&wt=json&indent=true}{delete=[1 (-1815893138272681999)]} 0 0
2> 1753643 INFO (TEST-TestRealTimeGet.testVersions-seed#[8DC2255ED43A5CAF]) [n: c: s: r: x: t:] o.a.s.u.p.LogUpdateProcessorFactory webapp=null path=null params={update.distrib=FROMLEADER&wt=json&indent=true}{add=[1 (1815893138272681998)]} 0 0
2> 1753643 INFO (TEST-TestRealTimeGet.testVersions-seed#[8DC2255ED43A5CAF]) [n: c: s: r: x: t:] o.a.s.c.S.Request webapp=null path=null params={qt=/get&id=1&wt=xml} status=0 QTime=0
2> 1753646 INFO (searcherExecutor-27368-thread-1-processing-collection1) [n: c: s: r: x:collection1 t:] o.a.s.c.SolrCore Registered new searcher autowarm time: 0 ms
2> 1753646 INFO (TEST-TestRealTimeGet.testVersions-seed#[8DC2255ED43A5CAF]) [n: c: s: r: x:collection1 t:] o.a.s.u.p.LogUpdateProcessorFactory webapp=null path=null params={}{commit=} 0 2
2> 1753647 INFO (TEST-TestRealTimeGet.testVersions-seed#[8DC2255ED43A5CAF]) [n: c: s: r: x: t:] o.a.s.u.p.LogUpdateProcessorFactory webapp=null path=null params={versions=true&wt=json&indent=true}{deleteByQuery=id:2 (-1815893138290507776)} 0 0
2> 1753647 INFO (TEST-TestRealTimeGet.testVersions-seed#[8DC2255ED43A5CAF]) [n: c: s: r: x: t:] o.a.s.c.S.Request webapp=null path=null params={qt=/get&id=1&wt=xml} status=0 QTime=0
2> 1753647 INFO (TEST-TestRealTimeGet.testVersions-seed#[8DC2255ED43A5CAF]) [n: c: s: r: x: t:] o.a.s.u.p.LogUpdateProcessorFactory webapp=null path=null params={versions=true&wt=json&indent=true}{add=[2 (1815893138290507777)]} 0 0
2> 1753649 INFO (TEST-TestRealTimeGet.testVersions-seed#[8DC2255ED43A5CAF]) [n: c: s: r: x: t:] o.a.s.u.p.LogUpdateProcessorFactory webapp=null path=null params={versions=true&wt=json&indent=true}{deleteByQuery=id:2 (-1815893138291556352)} 0 1
2> 1753649 INFO (TEST-TestRealTimeGet.testVersions-seed#[8DC2255ED43A5CAF]) [n: c: s: r: x: t:] o.a.s.c.S.Request webapp=null path=null params={qt=/get&id=2&wt=xml} status=0 QTime=0
2> 1753649 INFO (TEST-TestRealTimeGet.testVersions-seed#[8DC2255ED43A5CAF]) [n: c: s: r: x: t:] o.a.s.u.p.LogUpdateProcessorFactory webapp=null path=null params={update.distrib=FROMLEADER&wt=json&indent=true}{add=[3 (1815893138291557452)]} 0 0
2> 1753650 INFO (TEST-TestRealTimeGet.testVersions-seed#[8DC2255ED43A5CAF]) [n: c: s: r: x: t:] o.a.s.u.p.LogUpdateProcessorFactory webapp=null path=null params={update.distrib=FROMLEADER&wt=json&indent=true}{add=[4 (1815893138291557552)]} 0 0
2> 1753674 INFO (TEST-TestRealTimeGet.testVersions-seed#[8DC2255ED43A5CAF]) [n: c: s: r: x: t:] o.a.s.u.p.LogUpdateProcessorFactory webapp=null path=null params={update.distrib=FROMLEADER&_version_=-1815893138291557502&versions=true&wt=json&indent=true}{deleteByQuery=id:(3 4 5 6) (-1815893138291557502)} 0 24
2> 1753674 INFO (TEST-TestRealTimeGet.testVersions-seed#[8DC2255ED43A5CAF]) [n: c: s: r: x: t:] o.a.s.c.S.Request webapp=null path=null params={qt=/get&id=3&wt=xml} status=0 QTime=0
2> 1753674 INFO (TEST-TestRealTimeGet.testVersions-seed#[8DC2255ED43A5CAF]) [n: c: s: r: x: t:] o.a.s.c.S.Request webapp=null path=null params={qt=/get&fl=id&id=4&wt=xml} status=0 QTime=0
2> 1753674 INFO (TEST-TestRealTimeGet.testVersions-seed#[8DC2255ED43A5CAF]) [n: c: s: r: x: t:] o.a.s.u.p.LogUpdateProcessorFactory webapp=null path=null params={update.distrib=FROMLEADER&wt=json&indent=true}{add=[5 (1815893138291557553)]} 0 0
2> 1753675 INFO (TEST-TestRealTimeGet.testVersions-seed#[8DC2255ED43A5CAF]) [n: c: s: r: x: t:] o.a.s.u.DirectUpdateHandler2 Reordered DBQs detected. Update=add{_version_=1815893138291557453,id=6} DBQs=[DBQ{version=1815893138291557502,q=id:(3 4 5 6)}]
2> 1753680 INFO (TEST-TestRealTimeGet.testVersions-seed#[8DC2255ED43A5CAF]) [n: c: s: r: x: t:] o.a.s.u.p.LogUpdateProcessorFactory webapp=null path=null params={update.distrib=FROMLEADER&wt=json&indent=true}{add=[6 (1815893138291557453)]} 0 5
2> 1753680 INFO (TEST-TestRealTimeGet.testVersions-seed#[8DC2255ED43A5CAF]) [n: c: s: r: x: t:] o.a.s.c.S.Request webapp=null path=null params={qt=/get&fl=id&id=5&wt=xml} status=0 QTime=0
2> 1753680 INFO (TEST-TestRealTimeGet.testVersions-seed#[8DC2255ED43A5CAF]) [n: c: s: r: x: t:] o.a.s.c.S.Request webapp=null path=null params={qt=/get&id=6&wt=xml} status=0 QTime=0
2> 1753683 INFO (searcherExecutor-27368-thread-1-processing-collection1) [n: c: s: r: x:collection1 t:] o.a.s.c.SolrCore Registered new searcher autowarm time: 0 ms
2> 1753683 INFO (TEST-TestRealTimeGet.testVersions-seed#[8DC2255ED43A5CAF]) [n: c: s: r: x:collection1 t:] o.a.s.u.p.LogUpdateProcessorFactory webapp=null path=null params={}{commit=} 0 2
2> 1753684 INFO (TEST-TestRealTimeGet.testVersions-seed#[8DC2255ED43A5CAF]) [n: c: s: r: x: t:] o.a.s.SolrTestCaseJ4 ###Ending testVersions
2> 1753688 INFO (TEST-TestRealTimeGet.testStressGetRealtime-seed#[8DC2255ED43A5CAF]) [n: c: s: r: x: t:] o.a.s.SolrTestCaseJ4 ###Starting testStressGetRealtime
2> 1753688 INFO (TEST-TestRealTimeGet.testStressGetRealtime-seed#[8DC2255ED43A5CAF]) [n: c: s: r: x: t:] o.a.s.u.DirectUpdateHandler2 REMOVING ALL DOCUMENTS FROM INDEX
2> 1753689 INFO (TEST-TestRealTimeGet.testStressGetRealtime-seed#[8DC2255ED43A5CAF]) [n: c: s: r: x: t:] o.a.s.u.p.LogUpdateProcessorFactory webapp=null path=null params={_version_=-9223372036854775807&update.distrib=FROMLEADER&versions=true&wt=json&indent=true}{deleteByQuery=*:* (-9223372036854775807)} 0 0
2> 1753691 INFO (searcherExecutor-27368-thread-1-processing-collection1) [n: c: s: r: x:collection1 t:] o.a.s.c.SolrCore Registered new searcher autowarm time: 0 ms
2> 1753692 INFO (TEST-TestRealTimeGet.testStressGetRealtime-seed#[8DC2255ED43A5CAF]
[...truncated too long message...]
ithEmptyReplica, TestLocalStatsCacheCloud, TestMiniSolrCloudClusterSSL, TestPrepRecovery, TestPullReplicaErrorHandling, TestQueryingOnDownCollection, TestRandomFlRTGCloud, TestRebalanceLeaders, TestSSLRandomization, TestShardsInfoResponse, TestSizeLimitedDistributedMap, TestStressCloudBlindAtomicUpdates, TestStressLiveNodes, TestTlogReplica, TestTolerantUpdateProcessorRandomCloud, TlogReplayBufferedWhileIndexingTest, UnloadDistributedZkTest, ZkCLITest, ZkDistributedLockTest, ZkNodePropsTest, ZkSolrClientTest, BackupRestoreApiErrorConditionsTest, CollectionReloadTest, CollectionsAPIAsyncDistributedZkTest, ConcurrentDeleteAndCreateCollectionTest, LocalFSCloudIncrementalBackupTest, PurgeGraphTest, SimpleCollectionCreateDeleteTest, TestCollectionAPI, TestLocalFSCloudBackupRestore, TestRequestStatusCollectionAPI, ZkCollectionPropsCachingTest, ZkStateWriterTest, CollectionsRepairEventListenerTest, CollectionMetricsBuilderTest, PlacementPluginIntegrationTest, AffinityPlacementFactoryTest, SimplePlacementFactoryTest, TestObjectReleaseTracker, BlobRepositoryCloudTest, ByteBuffersDirectoryFactoryTest, CachingDirectoryFactoryTest, CoreSorterTest, DirectoryFactoryTest, PluginBagTest, QueryResultKeyTest, RAMDirectoryFactoryTest, ResourceLoaderTest, SolrCoreCheckLockOnStartupTest, TestBackupRepositoryFactory, TestCodecSupport, TestConfig, TestConfigSetImmutable, TestConfigSetService, TestCoreContainer, TestCorePropertiesReload, TestFileSystemConfigSetService, TestInfoStreamLogging, TestJmxIntegration, TestMergePolicyConfig, TestNRTOpen, TestQuerySenderNoQuery, TestSchemaCodecFactoryDefaults, TestSimpleTextCodec, TestSolrDeletionPolicy1, TestSolrIndexConfig, TestTracerConfigurator, BackupFilePathsTest, ShardBackupIdTest, TestSolrCloudSnapshots, TestDistribFileSt
2> ore, CSVRequestHandlerTest, FieldAnalysisRequestHandlerTest, MoreLikeThisHandlerTest, RequestHandlerBaseTest, RequestLoggingTest, TestBlobHandler, TestConfigReload, TestHealthCheckHandlerLegacyMode, TestIncrementalCoreBackup, TestReplicationHandlerBackup, TestReqParamsAPI, TestRestoreCore, TestSnapshotCoreBackup, TestSolrConfigHandlerConcurrent, TestStressThreadBackup, TestUserManagedReplicationWithAuth, V2ClusterAPIMappingTest, V2UpdateAPIMappingTest, AdminHandlersProxyTest, CoreAdminHandlerActionTest, CoreAdminOperationTest, CoreMergeIndexesAdminHandlerTest, HealthCheckHandlerTest, InfoHandlerTest, LukeRequestHandlerTest, MetricsHandlerTest, RestoreCoreOpTest, SegmentsInfoRequestHandlerTest, SolrEnvironmentTest, StatsReloadRaceTest, TestApiFramework, TestCoreAdminApis, V2BlobAPIMappingTest, V2CoresAPIMappingTest, ZookeeperReadAPITest, ZookeeperStatusHandlerTest, BackupCoreAPITest, CoreReplicationAPITest, CreateAliasAPITest, CreateCollectionSnapshotAPITest, CreateShardAPITest, DeleteCollectionAPITest, DeleteCollectionSnapshotAPITest, DeleteReplicaAPITest, DeleteShardAPITest, GetNodeCommandStatusTest, GetSchemaFieldsAPITest, MergeIndexesTest, NodeLoggingAPITest, ReloadCoreAPITest, RestoreCollectionAPITest, SyncShardAPITest, V2CollectionAPIMappingTest, V2CoreAPIMappingTest, V2SchemaAPIMappingTest, V2ApiUtilsTest, CloudReplicaSourceTest, DebugComponentTest, DistributedExpandComponentTest, DistributedFacetPivotLargeTest, DistributedFacetPivotSmallAdvancedTest, DistributedFacetPivotWhiteBoxTest, DistributedQueryComponentCustomSortTest, DistributedQueryElevationComponentTest, DistributedSuggestComponentTest, FacetPivot2CollectionsTest, InfixSuggestersTest, PhrasesIdentificationComponentTest, QueryElevationComponentTest, ResponseLogComponentTest, SearchHandlerTest, ShardsAllowListTest, StatsComponentTest, SuggestComponentTest, TermVectorComponentTest, TestDistributedStatsComponentCardinality, TestHttpShardHandlerFactory, TestTrackingShardHandlerFactory, ListConfigSetsAPITest, TestSchemaDesignerAPI, TestSchemaDesignerSettingsDAO, JavabinLoaderTest, RandomizedTaggerTest, TaggerTest, XmlInterpolationTest, HighlighterConfigTest, HighlighterTest, TestUnifiedSolrHighlighter, TestSlowCompositeReaderWrapper, CSVParserTest, CSVStrategyTest, CharBufferTest, JacksonReflectMapWriterTest, PostRequestLoggingFilterTest, TestLegacyFieldReuse, TestLegacyTerms, TestNumericRangeQuery32, TestNumericTokenStream, DelegateRegistryTimerTest, MetricsConfigTest, SolrCoreMetricManagerTest, SolrMetricManagerTest, SolrMetricsIntegrationTest, SolrGraphiteReporterTest, SolrJmxReporterTest, TestPackageManager, PackageStoreSchemaPluginsTest, SimpleFacetsTest, TestFacetMethods, TestIntervalFaceting, TestSolrRequestInfo, TestUnInvertedFieldException, TestMacroExpander, DocsStreamerTest, SmileWriterTest, TestCSVResponseWriter, TestGeoJSONResponseWriter, TestJavabinTupleStreamParser, TestPrometheusResponseWriter, TestRawResponseWriter, TestRetrieveFieldsOptimizer, TestChildDocTransformer, TestExplainDocTransformer, TestSubQueryTransformerCrossCore, TestManagedFileStorage, TestManagedResourceStorage, TestBulkSchemaAPI, TestDynamicFieldCollectionResource, TestFieldCollectionResource, TestFieldTypeCollectionResource, TestSchemaNameResource, TestSchemaSimilarityResource, TestSerializedLuceneMatchVersion, TestManagedStopFilterFactory, TestManagedSynonymGraphFilterFactory, BadIndexSchemaTest, ChangedSchemaMergeTest, CurrencyFieldTypeTest, DateRangeFieldTest, DocValuesMissingTest, DocValuesTest, ExternalFileFieldSortTest, IndexSchemaTest, NotRequiredUniqueKeyTest, OpenExchangeRatesOrgProviderTest, PreAnalyzedFieldManagedSchemaCloudTest, PrimitiveFieldTypeTest, RequiredFieldsTest, SchemaApiFailureTest, SynonymTokenizerTest, TestBulkSchemaConcurrent, TestCloudSchemaless, TestCollationFieldDocValues, TestManagedSchemaAPI, TestManagedSchemaWithMultipleAdd, TestPointFields, TestSchemaManager, TestSortableTextField, TestUseDocValuesAsStored, UUIDFieldTest, AnalyticsQueryTest, CursorMarkTest, LargeFieldTest, MergeStrategyTest, QueryEqualityTest, QueryUtilsTest, RankQueryTest,
2> SignificantTermsQParserPluginTest, SortSpecParsingTest, TestAddFieldRealTimeGet, TestCaffeineCache, TestCollapseQParserPlugin, TestComplexPhraseQParserPlugin, TestCoordinatorRole, TestCustomSort, TestDocValuesIteratorCache, TestExtendedDismaxParser, TestFilteredDocIdSet, TestFiltersQueryCaching, TestGraphTermsQParserPlugin, TestIndexSearcher, TestLegacyNumericRangeQueryBuilder, TestMaxScoreQueryParser, TestMissingGroups, TestModulusFunctions, TestNoOpRegenerator, TestPayloadCheckQParserPlugin, TestPseudoReturnFields, TestQueryTypes, TestRTGBase, TestRangeQuery, TestRealTimeGet]
WARNING: Test org.apache.solr.search.TestRandomCollapseQParserPlugin wrote 10,681,483 bytes of output.
WARNING: Test org.apache.solr.search.facet.TestCloudJSONFacetSKG wrote 24,586,155 bytes of output.
> Task :solr:solrj:processTestResources
> Task :solr:solrj:testClasses
> Task :solr:solrj:test
> Task :solr:core:test
:solr:core:test (FAILURE): 5144 test(s), 1 failure(s), 218 skipped
5144 tests completed, 1 failed, 218 skipped
> Task :solr:core:test FAILED
> Task :solr:core:wipeTaskTemp
> Task :solr:solrj:test
:solr:solrj:test (SUCCESS): 1235 test(s), 42 skipped
> Task :solr:solrj:wipeTaskTemp
ERROR: The following test(s) have failed:
- org.apache.solr.search.TestRealTimeGet.testStressGetRealtime (:solr:core)
Test history: https://ge.apache.org/scans/tests?search.rootProjectNames=solr-root&tests.container=org.apache.solr.search.TestRealTimeGet&tests.test=testStressGetRealtime http://fucit.org/solr-jenkins-reports/history-trend-of-recent-failures.html#series/org.apache.solr.search.TestRealTimeGet.testStressGetRealtime
Test output: /home/jenkins/jenkins-slave/workspace/Solr/Solr-Smoketest-9.7/_tmp/smoke_1731768553/unpack/solr-9.7.1/solr/core/build/test-results/test/outputs/OUTPUT-org.apache.solr.search.TestRealTimeGet.txt
Reproduce with: ./gradlew :solr:core:test --tests "org.apache.solr.search.TestRealTimeGet.testStressGetRealtime" -Ptests.jvms=2 "-Ptests.jvmargs=-XX:TieredStopAtLevel=1 -XX:+UseParallelGC -XX:ActiveProcessorCount=1 -XX:ReservedCodeCacheSize=120m" -Ptests.seed=8DC2255ED43A5CAF -Ptests.badapples=false -Ptests.file.encoding=US-ASCII
FAILURE: Build failed with an exception.
* What went wrong:
Execution failed for task ':solr:core:test'.
> There were failing tests. See the results at: file:///home/jenkins/jenkins-slave/workspace/Solr/Solr-Smoketest-9.7/_tmp/smoke_1731768553/unpack/solr-9.7.1/solr/core/build/test-results/test/
BUILD FAILED in 45m 24s
81 actionable tasks: 64 executed, 17 up-to-date
Publishing build scan...
https://ge.apache.org/s/xxdp2io56y77o
Traceback (most recent call last):
File "dev-tools/scripts/smokeTestRelease.py", line 1196, in <module>
main()
File "dev-tools/scripts/smokeTestRelease.py", line 1123, in main
downloadOnly=c.download_only)
File "dev-tools/scripts/smokeTestRelease.py", line 1184, in smokeTest
unpackAndVerify(java, tmpDir, 'solr-%s-src.tgz' % version, gitRevision, version, testArgs)
File "dev-tools/scripts/smokeTestRelease.py", line 575, in unpackAndVerify
verifyUnpacked(java, artifact, unpackPath, gitRevision, version, testArgs)
File "dev-tools/scripts/smokeTestRelease.py", line 666, in verifyUnpacked
java.run_java11('./gradlew --no-daemon test %s' % testArgs, '%s/test.log' % unpackPath)
File "dev-tools/scripts/smokeTestRelease.py", line 1032, in run_java
run('%s; %s' % (cmd_prefix, cmd), logfile)
File "dev-tools/scripts/smokeTestRelease.py", line 505, in run
raise RuntimeError('command "%s" failed; see log file %s' % (command, logPath))
RuntimeError: command "export JAVA_HOME="/home/jenkins/tools/java/latest11" PATH="/home/jenkins/tools/java/latest11/bin:$PATH" JAVACMD="/home/jenkins/tools/java/latest11/bin/java"; ./gradlew --no-daemon test -Dtests.nightly=false -Dtests.badapples=false " failed; see log file /home/jenkins/jenkins-slave/workspace/Solr/Solr-Smoketest-9.7/_tmp/smoke_1731768553/unpack/solr-9.7.1/test.log
Build step 'Run with timeout' marked build as failure
Email was triggered for: Failure - Any
Sending email for trigger: Failure - Any