You are viewing a plain text version of this content. The canonical link for it is here.
Posted to dev@lucene.apache.org by Policeman Jenkins Server <je...@sd-datasolutions.de> on 2012/11/07 16:39:19 UTC

[JENKINS] Lucene-Solr-trunk-Windows (32bit/jdk1.6.0_37) - Build # 1477 - Still Failing!

Build: http://jenkins.sd-datasolutions.de/job/Lucene-Solr-trunk-Windows/1477/
Java: 32bit/jdk1.6.0_37 -client -XX:+UseConcMarkSweepGC

All tests passed

Build Log:
[...truncated 18960 lines...]
check-licenses:
     [echo] License check under: C:\Users\JenkinsSlave\workspace\Lucene-Solr-trunk-Windows\solr
 [licenses] MISSING sha1 checksum file for: C:\Users\JenkinsSlave\workspace\Lucene-Solr-trunk-Windows\solr\example\lib\jetty-continuation-8.1.7.v20120910.jar
 [licenses] MISSING sha1 checksum file for: C:\Users\JenkinsSlave\workspace\Lucene-Solr-trunk-Windows\solr\example\lib\jetty-deploy-8.1.7.v20120910.jar

 [licenses] MISSING sha1 checksum file for: C:\Users\JenkinsSlave\workspace\Lucene-Solr-trunk-Windows\solr\example\lib\jetty-http-8.1.7.v20120910.jar
 [licenses] MISSING sha1 checksum file for: C:\Users\JenkinsSlave\workspace\Lucene-Solr-trunk-Windows\solr\example\lib\jetty-io-8.1.7.v20120910.jar
 [licenses] MISSING sha1 checksum file for: C:\Users\JenkinsSlave\workspace\Lucene-Solr-trunk-Windows\solr\example\lib\jetty-jmx-8.1.7.v20120910.jar
 [licenses] MISSING sha1 checksum file for: C:\Users\JenkinsSlave\workspace\Lucene-Solr-trunk-Windows\solr\example\lib\jetty-security-8.1.7.v20120910.jar

 [licenses] MISSING sha1 checksum file for: C:\Users\JenkinsSlave\workspace\Lucene-Solr-trunk-Windows\solr\example\lib\jetty-server-8.1.7.v20120910.jar
 [licenses] MISSING sha1 checksum file for: C:\Users\JenkinsSlave\workspace\Lucene-Solr-trunk-Windows\solr\example\lib\jetty-servlet-8.1.7.v20120910.jar
 [licenses] MISSING sha1 checksum file for: C:\Users\JenkinsSlave\workspace\Lucene-Solr-trunk-Windows\solr\example\lib\jetty-util-8.1.7.v20120910.jar
 [licenses] MISSING sha1 checksum file for: C:\Users\JenkinsSlave\workspace\Lucene-Solr-trunk-Windows\solr\example\lib\jetty-webapp-8.1.7.v20120910.jar

[...truncated 2 lines...]
BUILD FAILED
C:\Users\JenkinsSlave\workspace\Lucene-Solr-trunk-Windows\build.xml:67: The following error occurred while executing this line:
C:\Users\JenkinsSlave\workspace\Lucene-Solr-trunk-Windows\solr\build.xml:223: The following error occurred while executing this line:
C:\Users\JenkinsSlave\workspace\Lucene-Solr-trunk-Windows\lucene\tools\custom-tasks.xml:44: License check failed. Check the logs.

Total time: 45 minutes 53 seconds
Build step 'Invoke Ant' marked build as failure
Archiving artifacts
Recording test results
Description set: Java: 32bit/jdk1.6.0_37 -client -XX:+UseConcMarkSweepGC
Email was triggered for: Failure
Sending email for trigger: Failure



[JENKINS] Lucene-Solr-trunk-Windows (32bit/jdk1.7.0_09) - Build # 1479 - Still Failing!

Posted by Policeman Jenkins Server <je...@sd-datasolutions.de>.
Build: http://jenkins.sd-datasolutions.de/job/Lucene-Solr-trunk-Windows/1479/
Java: 32bit/jdk1.7.0_09 -server -XX:+UseParallelGC

All tests passed

Build Log:
[...truncated 29069 lines...]
BUILD FAILED
C:\Users\JenkinsSlave\workspace\Lucene-Solr-trunk-Windows\build.xml:294: The following error occurred while executing this line:
C:\Users\JenkinsSlave\workspace\Lucene-Solr-trunk-Windows\extra-targets.xml:117: The following files are missing svn:eol-style (or binary svn:mime-type):
* solr/licenses/jetty-continuation-8.1.7.v20120910.jar.sha1
* solr/licenses/jetty-deploy-8.1.7.v20120910.jar.sha1
* solr/licenses/jetty-http-8.1.7.v20120910.jar.sha1
* solr/licenses/jetty-io-8.1.7.v20120910.jar.sha1
* solr/licenses/jetty-jmx-8.1.7.v20120910.jar.sha1
* solr/licenses/jetty-security-8.1.7.v20120910.jar.sha1
* solr/licenses/jetty-server-8.1.7.v20120910.jar.sha1
* solr/licenses/jetty-servlet-8.1.7.v20120910.jar.sha1
* solr/licenses/jetty-util-8.1.7.v20120910.jar.sha1
* solr/licenses/jetty-webapp-8.1.7.v20120910.jar.sha1
* solr/licenses/jetty-xml-8.1.7.v20120910.jar.sha1

Total time: 52 minutes 25 seconds
Build step 'Invoke Ant' marked build as failure
Archiving artifacts
Recording test results
Description set: Java: 32bit/jdk1.7.0_09 -server -XX:+UseParallelGC
Email was triggered for: Failure
Sending email for trigger: Failure



[JENKINS] Lucene-Solr-trunk-Windows (32bit/jdk1.7.0_09) - Build # 1478 - Still Failing!

Posted by Policeman Jenkins Server <je...@sd-datasolutions.de>.
Build: http://jenkins.sd-datasolutions.de/job/Lucene-Solr-trunk-Windows/1478/
Java: 32bit/jdk1.7.0_09 -server -XX:+UseConcMarkSweepGC

All tests passed

Build Log:
[...truncated 29089 lines...]
BUILD FAILED
C:\Users\JenkinsSlave\workspace\Lucene-Solr-trunk-Windows\build.xml:294: The following error occurred while executing this line:
C:\Users\JenkinsSlave\workspace\Lucene-Solr-trunk-Windows\extra-targets.xml:117: The following files are missing svn:eol-style (or binary svn:mime-type):
* solr/licenses/jetty-continuation-8.1.7.v20120910.jar.sha1
* solr/licenses/jetty-deploy-8.1.7.v20120910.jar.sha1
* solr/licenses/jetty-http-8.1.7.v20120910.jar.sha1
* solr/licenses/jetty-io-8.1.7.v20120910.jar.sha1
* solr/licenses/jetty-jmx-8.1.7.v20120910.jar.sha1
* solr/licenses/jetty-security-8.1.7.v20120910.jar.sha1
* solr/licenses/jetty-server-8.1.7.v20120910.jar.sha1
* solr/licenses/jetty-servlet-8.1.7.v20120910.jar.sha1
* solr/licenses/jetty-util-8.1.7.v20120910.jar.sha1
* solr/licenses/jetty-webapp-8.1.7.v20120910.jar.sha1
* solr/licenses/jetty-xml-8.1.7.v20120910.jar.sha1

Total time: 53 minutes 25 seconds
Build step 'Invoke Ant' marked build as failure
Archiving artifacts
Recording test results
Description set: Java: 32bit/jdk1.7.0_09 -server -XX:+UseConcMarkSweepGC
Email was triggered for: Failure
Sending email for trigger: Failure