You are viewing a plain text version of this content. The canonical link for it is here.
Posted to dev@kafka.apache.org by Apache Jenkins Server <je...@builds.apache.org> on 2017/07/20 20:01:34 UTC
Build failed in Jenkins: kafka-0.10.2-jdk7 #185
See <https://builds.apache.org/job/kafka-0.10.2-jdk7/185/display/redirect>
------------------------------------------
[...truncated 165.91 KB...]
kafka.server.MetadataCacheTest > getTopicMetadataReplicaNotAvailable STARTED
kafka.server.MetadataCacheTest > getTopicMetadataReplicaNotAvailable PASSED
kafka.server.MetadataCacheTest > getTopicMetadataPartitionLeaderNotAvailable STARTED
kafka.server.MetadataCacheTest > getTopicMetadataPartitionLeaderNotAvailable PASSED
kafka.server.MetadataCacheTest > getAliveBrokersShouldNotBeMutatedByUpdateCache STARTED
kafka.server.MetadataCacheTest > getAliveBrokersShouldNotBeMutatedByUpdateCache PASSED
kafka.server.MetadataCacheTest > getTopicMetadataNonExistingTopics STARTED
kafka.server.MetadataCacheTest > getTopicMetadataNonExistingTopics PASSED
kafka.server.LeaderElectionTest > testLeaderElectionWithStaleControllerEpoch STARTED
kafka.server.LeaderElectionTest > testLeaderElectionWithStaleControllerEpoch PASSED
kafka.server.LeaderElectionTest > testLeaderElectionAndEpoch STARTED
kafka.server.LeaderElectionTest > testLeaderElectionAndEpoch PASSED
kafka.server.ServerShutdownTest > testCleanShutdownAfterFailedStartup STARTED
kafka.server.ServerShutdownTest > testCleanShutdownAfterFailedStartup PASSED
kafka.server.ServerShutdownTest > testConsecutiveShutdown STARTED
kafka.server.ServerShutdownTest > testConsecutiveShutdown PASSED
kafka.server.ServerShutdownTest > testCleanShutdown STARTED
kafka.server.ServerShutdownTest > testCleanShutdown PASSED
kafka.server.ServerShutdownTest > testCleanShutdownWithDeleteTopicEnabled STARTED
kafka.server.ServerShutdownTest > testCleanShutdownWithDeleteTopicEnabled PASSED
kafka.server.SaslPlaintextReplicaFetchTest > testReplicaFetcherThread STARTED
kafka.server.SaslPlaintextReplicaFetchTest > testReplicaFetcherThread PASSED
kafka.server.DelayedOperationTest > testRequestPurge STARTED
kafka.server.DelayedOperationTest > testRequestPurge PASSED
kafka.server.DelayedOperationTest > testRequestExpiry STARTED
kafka.server.DelayedOperationTest > testRequestExpiry PASSED
kafka.server.DelayedOperationTest > testRequestSatisfaction STARTED
kafka.server.DelayedOperationTest > testRequestSatisfaction PASSED
kafka.server.IsrExpirationTest > testIsrExpirationForSlowFollowers STARTED
kafka.server.IsrExpirationTest > testIsrExpirationForSlowFollowers PASSED
kafka.server.IsrExpirationTest > testIsrExpirationForStuckFollowers STARTED
kafka.server.IsrExpirationTest > testIsrExpirationForStuckFollowers PASSED
kafka.server.IsrExpirationTest > testIsrExpirationIfNoFetchRequestMade STARTED
kafka.server.IsrExpirationTest > testIsrExpirationIfNoFetchRequestMade PASSED
kafka.server.PlaintextReplicaFetchTest > testReplicaFetcherThread STARTED
kafka.server.PlaintextReplicaFetchTest > testReplicaFetcherThread PASSED
kafka.server.ProduceRequestTest > testSimpleProduceRequest STARTED
kafka.server.ProduceRequestTest > testSimpleProduceRequest PASSED
kafka.server.ProduceRequestTest > testCorruptLz4ProduceRequest STARTED
kafka.server.ProduceRequestTest > testCorruptLz4ProduceRequest PASSED
kafka.server.FetchRequestTest > testBrokerRespectsPartitionsOrderAndSizeLimits STARTED
kafka.server.FetchRequestTest > testBrokerRespectsPartitionsOrderAndSizeLimits PASSED
kafka.server.FetchRequestTest > testFetchRequestV2WithOversizedMessage STARTED
kafka.server.FetchRequestTest > testFetchRequestV2WithOversizedMessage PASSED
kafka.server.SimpleFetchTest > testReadFromLog STARTED
kafka.server.SimpleFetchTest > testReadFromLog PASSED
kafka.server.ServerMetricsTest > testMetricsConfig STARTED
kafka.server.ServerMetricsTest > testMetricsConfig PASSED
kafka.server.LogOffsetTest > testFetchOffsetsBeforeWithChangingSegmentSize STARTED
kafka.server.LogOffsetTest > testFetchOffsetsBeforeWithChangingSegmentSize PASSED
kafka.server.LogOffsetTest > testGetOffsetsBeforeEarliestTime STARTED
kafka.server.LogOffsetTest > testGetOffsetsBeforeEarliestTime PASSED
kafka.server.LogOffsetTest > testGetOffsetsForUnknownTopic STARTED
kafka.server.LogOffsetTest > testGetOffsetsForUnknownTopic PASSED
kafka.server.LogOffsetTest > testEmptyLogsGetOffsets STARTED
kafka.server.LogOffsetTest > testEmptyLogsGetOffsets PASSED
kafka.server.LogOffsetTest > testFetchOffsetsBeforeWithChangingSegments STARTED
kafka.server.LogOffsetTest > testFetchOffsetsBeforeWithChangingSegments PASSED
kafka.server.LogOffsetTest > testGetOffsetsBeforeLatestTime STARTED
kafka.server.LogOffsetTest > testGetOffsetsBeforeLatestTime PASSED
kafka.server.LogOffsetTest > testGetOffsetsBeforeNow STARTED
kafka.server.LogOffsetTest > testGetOffsetsBeforeNow PASSED
kafka.server.LogRecoveryTest > testHWCheckpointNoFailuresMultipleLogSegments STARTED
kafka.server.LogRecoveryTest > testHWCheckpointNoFailuresMultipleLogSegments PASSED
kafka.server.LogRecoveryTest > testHWCheckpointWithFailuresMultipleLogSegments STARTED
kafka.server.LogRecoveryTest > testHWCheckpointWithFailuresMultipleLogSegments PASSED
kafka.server.LogRecoveryTest > testHWCheckpointNoFailuresSingleLogSegment STARTED
kafka.server.LogRecoveryTest > testHWCheckpointNoFailuresSingleLogSegment PASSED
kafka.server.LogRecoveryTest > testHWCheckpointWithFailuresSingleLogSegment STARTED
kafka.server.LogRecoveryTest > testHWCheckpointWithFailuresSingleLogSegment PASSED
kafka.server.OffsetCommitTest > testUpdateOffsets STARTED
kafka.server.OffsetCommitTest > testUpdateOffsets PASSED
kafka.server.OffsetCommitTest > testLargeMetadataPayload STARTED
kafka.server.OffsetCommitTest > testLargeMetadataPayload PASSED
kafka.server.OffsetCommitTest > testOffsetsDeleteAfterTopicDeletion STARTED
kafka.server.OffsetCommitTest > testOffsetsDeleteAfterTopicDeletion PASSED
kafka.server.OffsetCommitTest > testCommitAndFetchOffsets STARTED
kafka.server.OffsetCommitTest > testCommitAndFetchOffsets PASSED
kafka.server.OffsetCommitTest > testOffsetExpiration STARTED
kafka.server.OffsetCommitTest > testOffsetExpiration PASSED
kafka.server.OffsetCommitTest > testNonExistingTopicOffsetCommit STARTED
kafka.server.OffsetCommitTest > testNonExistingTopicOffsetCommit PASSED
kafka.server.ReplicationQuotasTest > shouldBootstrapTwoBrokersWithLeaderThrottle STARTED
kafka.server.ReplicationQuotasTest > shouldBootstrapTwoBrokersWithLeaderThrottle PASSED
kafka.server.ReplicationQuotasTest > shouldThrottleOldSegments STARTED
kafka.server.ReplicationQuotasTest > shouldThrottleOldSegments PASSED
kafka.server.ReplicationQuotasTest > shouldBootstrapTwoBrokersWithFollowerThrottle STARTED
kafka.server.ReplicationQuotasTest > shouldBootstrapTwoBrokersWithFollowerThrottle PASSED
kafka.server.EdgeCaseRequestTest > testInvalidApiVersionRequest STARTED
kafka.server.EdgeCaseRequestTest > testInvalidApiVersionRequest PASSED
kafka.server.EdgeCaseRequestTest > testMalformedHeaderRequest STARTED
kafka.server.EdgeCaseRequestTest > testMalformedHeaderRequest PASSED
kafka.server.EdgeCaseRequestTest > testProduceRequestWithNullClientId STARTED
kafka.server.EdgeCaseRequestTest > testProduceRequestWithNullClientId PASSED
kafka.server.EdgeCaseRequestTest > testInvalidApiKeyRequest STARTED
kafka.server.EdgeCaseRequestTest > testInvalidApiKeyRequest PASSED
kafka.server.EdgeCaseRequestTest > testHeaderOnlyRequest STARTED
kafka.server.EdgeCaseRequestTest > testHeaderOnlyRequest PASSED
kafka.server.SaslApiVersionsRequestTest > testApiVersionsRequestWithUnsupportedVersion STARTED
kafka.server.SaslApiVersionsRequestTest > testApiVersionsRequestWithUnsupportedVersion PASSED
kafka.server.SaslApiVersionsRequestTest > testApiVersionsRequestBeforeSaslHandshakeRequest STARTED
kafka.server.SaslApiVersionsRequestTest > testApiVersionsRequestBeforeSaslHandshakeRequest PASSED
kafka.server.SaslApiVersionsRequestTest > testApiVersionsRequestAfterSaslHandshakeRequest STARTED
kafka.server.SaslApiVersionsRequestTest > testApiVersionsRequestAfterSaslHandshakeRequest PASSED
kafka.metrics.MetricsTest > testMetricsReporterAfterDeletingTopic STARTED
kafka.metrics.MetricsTest > testMetricsReporterAfterDeletingTopic PASSED
kafka.metrics.MetricsTest > testBrokerTopicMetricsUnregisteredAfterDeletingTopic STARTED
kafka.metrics.MetricsTest > testBrokerTopicMetricsUnregisteredAfterDeletingTopic PASSED
kafka.metrics.MetricsTest > testClusterIdMetric STARTED
kafka.metrics.MetricsTest > testClusterIdMetric PASSED
kafka.metrics.MetricsTest > testMetricsLeak STARTED
kafka.metrics.MetricsTest > testMetricsLeak PASSED
kafka.metrics.KafkaTimerTest > testKafkaTimer STARTED
kafka.metrics.KafkaTimerTest > testKafkaTimer PASSED
1049 tests completed, 2 failed
:kafka-0.10.2-jdk7:core:test FAILED
:test_core_2_10 FAILED
FAILURE: Build failed with an exception.
* What went wrong:
Execution failed for task ':core:test'.
> There were failing tests. See the report at: file://<https://builds.apache.org/job/kafka-0.10.2-jdk7/ws/core/build/reports/tests/test/index.html>
* Try:
Run with --stacktrace option to get the stack trace. Run with --info or --debug option to get more log output.
BUILD FAILED
Total time: 40 mins 6.264 secs
Build step 'Execute shell' marked build as failure
Recording test results
Setting GRADLE_2_4_RC_2_HOME=/home/jenkins/jenkins-slave/tools/hudson.plugins.gradle.GradleInstallation/Gradle_2.4-rc-2
Setting GRADLE_2_4_RC_2_HOME=/home/jenkins/jenkins-slave/tools/hudson.plugins.gradle.GradleInstallation/Gradle_2.4-rc-2
Jenkins build is back to normal : kafka-0.10.2-jdk7 #187
Posted by Apache Jenkins Server <je...@builds.apache.org>.
See <https://builds.apache.org/job/kafka-0.10.2-jdk7/187/display/redirect?page=changes>
Build failed in Jenkins: kafka-0.10.2-jdk7 #186
Posted by Apache Jenkins Server <je...@builds.apache.org>.
See <https://builds.apache.org/job/kafka-0.10.2-jdk7/186/display/redirect?page=changes>
Changes:
[me] KAFKA-5623: ducktape kafka service: do not assume Service contains
------------------------------------------
[...truncated 331.79 KB...]
kafka.server.KafkaConfigTest > testUncleanLeaderElectionDefault STARTED
kafka.server.KafkaConfigTest > testUncleanLeaderElectionDefault PASSED
kafka.server.KafkaConfigTest > testInvalidAdvertisedListenersProtocol STARTED
kafka.server.KafkaConfigTest > testInvalidAdvertisedListenersProtocol PASSED
kafka.server.KafkaConfigTest > testUncleanElectionEnabled STARTED
kafka.server.KafkaConfigTest > testUncleanElectionEnabled PASSED
kafka.server.KafkaConfigTest > testAdvertisePortDefault STARTED
kafka.server.KafkaConfigTest > testAdvertisePortDefault PASSED
kafka.server.KafkaConfigTest > testVersionConfiguration STARTED
kafka.server.KafkaConfigTest > testVersionConfiguration PASSED
kafka.server.KafkaConfigTest > testEqualAdvertisedListenersProtocol STARTED
kafka.server.KafkaConfigTest > testEqualAdvertisedListenersProtocol PASSED
kafka.server.SslReplicaFetchTest > testReplicaFetcherThread STARTED
kafka.server.SslReplicaFetchTest > testReplicaFetcherThread PASSED
kafka.server.IsrExpirationTest > testIsrExpirationForSlowFollowers STARTED
kafka.server.IsrExpirationTest > testIsrExpirationForSlowFollowers PASSED
kafka.server.IsrExpirationTest > testIsrExpirationForStuckFollowers STARTED
kafka.server.IsrExpirationTest > testIsrExpirationForStuckFollowers PASSED
kafka.server.IsrExpirationTest > testIsrExpirationIfNoFetchRequestMade STARTED
kafka.server.IsrExpirationTest > testIsrExpirationIfNoFetchRequestMade PASSED
kafka.server.SaslPlaintextReplicaFetchTest > testReplicaFetcherThread STARTED
kafka.server.SaslPlaintextReplicaFetchTest > testReplicaFetcherThread PASSED
kafka.server.ReplicationQuotasTest > shouldBootstrapTwoBrokersWithLeaderThrottle STARTED
kafka.server.ReplicationQuotasTest > shouldBootstrapTwoBrokersWithLeaderThrottle PASSED
kafka.server.ReplicationQuotasTest > shouldThrottleOldSegments STARTED
kafka.server.ReplicationQuotasTest > shouldThrottleOldSegments PASSED
kafka.server.ReplicationQuotasTest > shouldBootstrapTwoBrokersWithFollowerThrottle STARTED
kafka.server.ReplicationQuotasTest > shouldBootstrapTwoBrokersWithFollowerThrottle PASSED
kafka.server.ServerStartupTest > testBrokerStateRunningAfterZK STARTED
kafka.server.ServerStartupTest > testBrokerStateRunningAfterZK PASSED
kafka.server.ServerStartupTest > testBrokerCreatesZKChroot STARTED
kafka.server.ServerStartupTest > testBrokerCreatesZKChroot PASSED
kafka.server.ServerStartupTest > testConflictBrokerStartupWithSamePort STARTED
kafka.server.ServerStartupTest > testConflictBrokerStartupWithSamePort PASSED
kafka.server.ServerStartupTest > testConflictBrokerRegistration STARTED
kafka.server.ServerStartupTest > testConflictBrokerRegistration PASSED
kafka.server.ServerStartupTest > testBrokerSelfAware STARTED
kafka.server.ServerStartupTest > testBrokerSelfAware PASSED
kafka.server.ProduceRequestTest > testSimpleProduceRequest STARTED
kafka.server.ProduceRequestTest > testSimpleProduceRequest PASSED
kafka.server.ProduceRequestTest > testCorruptLz4ProduceRequest STARTED
kafka.server.ProduceRequestTest > testCorruptLz4ProduceRequest PASSED
kafka.server.ReplicaManagerTest > testHighWaterMarkDirectoryMapping STARTED
kafka.server.ReplicaManagerTest > testHighWaterMarkDirectoryMapping PASSED
kafka.server.ReplicaManagerTest > testFetchBeyondHighWatermarkReturnEmptyResponse STARTED
kafka.server.ReplicaManagerTest > testFetchBeyondHighWatermarkReturnEmptyResponse PASSED
kafka.server.ReplicaManagerTest > testIllegalRequiredAcks STARTED
kafka.server.ReplicaManagerTest > testIllegalRequiredAcks PASSED
kafka.server.ReplicaManagerTest > testClearPurgatoryOnBecomingFollower STARTED
kafka.server.ReplicaManagerTest > testClearPurgatoryOnBecomingFollower PASSED
kafka.server.ReplicaManagerTest > testHighwaterMarkRelativeDirectoryMapping STARTED
kafka.server.ReplicaManagerTest > testHighwaterMarkRelativeDirectoryMapping PASSED
kafka.server.KafkaMetricReporterClusterIdTest > testClusterIdPresent STARTED
kafka.server.KafkaMetricReporterClusterIdTest > testClusterIdPresent PASSED
kafka.server.CreateTopicsRequestWithPolicyTest > testValidCreateTopicsRequests STARTED
kafka.server.CreateTopicsRequestWithPolicyTest > testValidCreateTopicsRequests PASSED
kafka.server.CreateTopicsRequestWithPolicyTest > testErrorCreateTopicsRequests STARTED
kafka.server.CreateTopicsRequestWithPolicyTest > testErrorCreateTopicsRequests PASSED
kafka.server.OffsetCommitTest > testUpdateOffsets STARTED
kafka.server.OffsetCommitTest > testUpdateOffsets PASSED
kafka.server.OffsetCommitTest > testLargeMetadataPayload STARTED
kafka.server.OffsetCommitTest > testLargeMetadataPayload PASSED
kafka.server.OffsetCommitTest > testOffsetsDeleteAfterTopicDeletion STARTED
kafka.server.OffsetCommitTest > testOffsetsDeleteAfterTopicDeletion PASSED
kafka.server.OffsetCommitTest > testCommitAndFetchOffsets STARTED
kafka.server.OffsetCommitTest > testCommitAndFetchOffsets PASSED
kafka.server.OffsetCommitTest > testOffsetExpiration STARTED
kafka.server.OffsetCommitTest > testOffsetExpiration PASSED
kafka.server.OffsetCommitTest > testNonExistingTopicOffsetCommit STARTED
kafka.server.OffsetCommitTest > testNonExistingTopicOffsetCommit PASSED
kafka.server.ReplicaManagerQuotasTest > shouldGetBothMessagesIfQuotasAllow STARTED
kafka.server.ReplicaManagerQuotasTest > shouldGetBothMessagesIfQuotasAllow PASSED
kafka.server.ReplicaManagerQuotasTest > shouldExcludeSubsequentThrottledPartitions STARTED
kafka.server.ReplicaManagerQuotasTest > shouldExcludeSubsequentThrottledPartitions PASSED
kafka.server.ReplicaManagerQuotasTest > shouldGetNoMessagesIfQuotasExceededOnSubsequentPartitions STARTED
kafka.server.ReplicaManagerQuotasTest > shouldGetNoMessagesIfQuotasExceededOnSubsequentPartitions PASSED
kafka.server.ReplicaManagerQuotasTest > shouldIncludeInSyncThrottledReplicas STARTED
kafka.server.ReplicaManagerQuotasTest > shouldIncludeInSyncThrottledReplicas PASSED
kafka.server.MetadataRequestTest > testReplicaDownResponse STARTED
kafka.server.MetadataRequestTest > testReplicaDownResponse PASSED
kafka.server.MetadataRequestTest > testRack STARTED
kafka.server.MetadataRequestTest > testRack PASSED
kafka.server.MetadataRequestTest > testIsInternal STARTED
kafka.server.MetadataRequestTest > testIsInternal PASSED
kafka.server.MetadataRequestTest > testControllerId STARTED
kafka.server.MetadataRequestTest > testControllerId PASSED
kafka.server.MetadataRequestTest > testAllTopicsRequest STARTED
kafka.server.MetadataRequestTest > testAllTopicsRequest PASSED
kafka.server.MetadataRequestTest > testClusterIdIsValid STARTED
kafka.server.MetadataRequestTest > testClusterIdIsValid PASSED
kafka.server.MetadataRequestTest > testNoTopicsRequest STARTED
kafka.server.MetadataRequestTest > testNoTopicsRequest PASSED
kafka.server.MetadataRequestTest > testClusterIdWithRequestVersion1 STARTED
kafka.server.MetadataRequestTest > testClusterIdWithRequestVersion1 PASSED
kafka.server.SessionExpireListenerTest > testSessionExpireListenerMetrics STARTED
kafka.server.SessionExpireListenerTest > testSessionExpireListenerMetrics PASSED
kafka.server.LogOffsetTest > testFetchOffsetsBeforeWithChangingSegmentSize STARTED
kafka.server.LogOffsetTest > testFetchOffsetsBeforeWithChangingSegmentSize PASSED
kafka.server.LogOffsetTest > testGetOffsetsBeforeEarliestTime STARTED
kafka.server.LogOffsetTest > testGetOffsetsBeforeEarliestTime PASSED
kafka.server.LogOffsetTest > testGetOffsetsForUnknownTopic STARTED
kafka.server.LogOffsetTest > testGetOffsetsForUnknownTopic PASSED
kafka.server.LogOffsetTest > testEmptyLogsGetOffsets STARTED
kafka.server.LogOffsetTest > testEmptyLogsGetOffsets PASSED
kafka.server.LogOffsetTest > testFetchOffsetsBeforeWithChangingSegments STARTED
kafka.server.LogOffsetTest > testFetchOffsetsBeforeWithChangingSegments PASSED
kafka.server.LogOffsetTest > testGetOffsetsBeforeLatestTime STARTED
kafka.server.LogOffsetTest > testGetOffsetsBeforeLatestTime PASSED
kafka.server.LogOffsetTest > testGetOffsetsBeforeNow STARTED
kafka.server.LogOffsetTest > testGetOffsetsBeforeNow PASSED
unit.kafka.server.ApiVersionsTest > testApiVersions STARTED
unit.kafka.server.ApiVersionsTest > testApiVersions PASSED
integration.kafka.api.GroupCoordinatorIntegrationTest > testGroupCoordinatorPropagatesOfffsetsTopicCompressionCodec STARTED
integration.kafka.api.GroupCoordinatorIntegrationTest > testGroupCoordinatorPropagatesOfffsetsTopicCompressionCodec PASSED
1049 tests completed, 1 failed
:kafka-0.10.2-jdk7:core:test FAILED
:test_core_2_11 FAILED
FAILURE: Build failed with an exception.
* What went wrong:
Execution failed for task ':core:test'.
> There were failing tests. See the report at: file://<https://builds.apache.org/job/kafka-0.10.2-jdk7/ws/core/build/reports/tests/test/index.html>
* Try:
Run with --stacktrace option to get the stack trace. Run with --info or --debug option to get more log output.
BUILD FAILED
Total time: 1 hrs 24 mins 21.136 secs
Build step 'Execute shell' marked build as failure
Recording test results
Setting GRADLE_2_4_RC_2_HOME=/home/jenkins/jenkins-slave/tools/hudson.plugins.gradle.GradleInstallation/Gradle_2.4-rc-2
Setting GRADLE_2_4_RC_2_HOME=/home/jenkins/jenkins-slave/tools/hudson.plugins.gradle.GradleInstallation/Gradle_2.4-rc-2