You are viewing a plain text version of this content. The canonical link for it is here.
Posted to dev@lucene.apache.org by Apache Jenkins Server <je...@builds.apache.org> on 2017/11/16 22:33:08 UTC
[JENKINS] Lucene-Solr-NightlyTests-master - Build # 1421 - Still
unstable
Build: https://builds.apache.org/job/Lucene-Solr-NightlyTests-master/1421/
11 tests failed.
FAILED: org.apache.solr.cloud.BasicDistributedZk2Test.test
Error Message:
KeeperErrorCode = Session expired for /clusterstate.json
Stack Trace:
org.apache.zookeeper.KeeperException$SessionExpiredException: KeeperErrorCode = Session expired for /clusterstate.json
at __randomizedtesting.SeedInfo.seed([DA68999B03709396:523CA641AD8CFE6E]:0)
at org.apache.zookeeper.KeeperException.create(KeeperException.java:127)
at org.apache.zookeeper.KeeperException.create(KeeperException.java:51)
at org.apache.zookeeper.ZooKeeper.getData(ZooKeeper.java:1212)
at org.apache.solr.common.cloud.SolrZkClient.lambda$getData$5(SolrZkClient.java:332)
at org.apache.solr.common.cloud.ZkCmdExecutor.retryOperation(ZkCmdExecutor.java:60)
at org.apache.solr.common.cloud.SolrZkClient.getData(SolrZkClient.java:332)
at org.apache.solr.common.cloud.ZkStateReader.refreshLegacyClusterState(ZkStateReader.java:586)
at org.apache.solr.common.cloud.ZkStateReader.forceUpdateCollection(ZkStateReader.java:352)
at org.apache.solr.cloud.AbstractFullDistribZkTestBase.updateMappingsFromZk(AbstractFullDistribZkTestBase.java:673)
at org.apache.solr.cloud.AbstractFullDistribZkTestBase.checkShardConsistency(AbstractFullDistribZkTestBase.java:1310)
at org.apache.solr.cloud.AbstractFullDistribZkTestBase.checkShardConsistency(AbstractFullDistribZkTestBase.java:1301)
at org.apache.solr.cloud.BasicDistributedZk2Test.brindDownShardIndexSomeDocsAndRecover(BasicDistributedZk2Test.java:301)
at org.apache.solr.cloud.BasicDistributedZk2Test.test(BasicDistributedZk2Test.java:108)
at sun.reflect.NativeMethodAccessorImpl.invoke0(Native Method)
at sun.reflect.NativeMethodAccessorImpl.invoke(NativeMethodAccessorImpl.java:62)
at sun.reflect.DelegatingMethodAccessorImpl.invoke(DelegatingMethodAccessorImpl.java:43)
at java.lang.reflect.Method.invoke(Method.java:498)
at com.carrotsearch.randomizedtesting.RandomizedRunner.invoke(RandomizedRunner.java:1737)
at com.carrotsearch.randomizedtesting.RandomizedRunner$8.evaluate(RandomizedRunner.java:934)
at com.carrotsearch.randomizedtesting.RandomizedRunner$9.evaluate(RandomizedRunner.java:970)
at com.carrotsearch.randomizedtesting.RandomizedRunner$10.evaluate(RandomizedRunner.java:984)
at org.apache.solr.BaseDistributedSearchTestCase$ShardsRepeatRule$ShardsFixedStatement.callStatement(BaseDistributedSearchTestCase.java:993)
at org.apache.solr.BaseDistributedSearchTestCase$ShardsRepeatRule$ShardsStatement.evaluate(BaseDistributedSearchTestCase.java:968)
at com.carrotsearch.randomizedtesting.rules.SystemPropertiesRestoreRule$1.evaluate(SystemPropertiesRestoreRule.java:57)
at org.apache.lucene.util.TestRuleSetupTeardownChained$1.evaluate(TestRuleSetupTeardownChained.java:49)
at org.apache.lucene.util.AbstractBeforeAfterRule$1.evaluate(AbstractBeforeAfterRule.java:45)
at org.apache.lucene.util.TestRuleThreadAndTestName$1.evaluate(TestRuleThreadAndTestName.java:48)
at org.apache.lucene.util.TestRuleIgnoreAfterMaxFailures$1.evaluate(TestRuleIgnoreAfterMaxFailures.java:64)
at org.apache.lucene.util.TestRuleMarkFailure$1.evaluate(TestRuleMarkFailure.java:47)
at com.carrotsearch.randomizedtesting.rules.StatementAdapter.evaluate(StatementAdapter.java:36)
at com.carrotsearch.randomizedtesting.ThreadLeakControl$StatementRunner.run(ThreadLeakControl.java:368)
at com.carrotsearch.randomizedtesting.ThreadLeakControl.forkTimeoutingTask(ThreadLeakControl.java:817)
at com.carrotsearch.randomizedtesting.ThreadLeakControl$3.evaluate(ThreadLeakControl.java:468)
at com.carrotsearch.randomizedtesting.RandomizedRunner.runSingleTest(RandomizedRunner.java:943)
at com.carrotsearch.randomizedtesting.RandomizedRunner$5.evaluate(RandomizedRunner.java:829)
at com.carrotsearch.randomizedtesting.RandomizedRunner$6.evaluate(RandomizedRunner.java:879)
at com.carrotsearch.randomizedtesting.RandomizedRunner$7.evaluate(RandomizedRunner.java:890)
at com.carrotsearch.randomizedtesting.rules.StatementAdapter.evaluate(StatementAdapter.java:36)
at com.carrotsearch.randomizedtesting.rules.SystemPropertiesRestoreRule$1.evaluate(SystemPropertiesRestoreRule.java:57)
at org.apache.lucene.util.AbstractBeforeAfterRule$1.evaluate(AbstractBeforeAfterRule.java:45)
at com.carrotsearch.randomizedtesting.rules.StatementAdapter.evaluate(StatementAdapter.java:36)
at org.apache.lucene.util.TestRuleStoreClassName$1.evaluate(TestRuleStoreClassName.java:41)
at com.carrotsearch.randomizedtesting.rules.NoShadowingOrOverridesOnMethodsRule$1.evaluate(NoShadowingOrOverridesOnMethodsRule.java:40)
at com.carrotsearch.randomizedtesting.rules.NoShadowingOrOverridesOnMethodsRule$1.evaluate(NoShadowingOrOverridesOnMethodsRule.java:40)
at com.carrotsearch.randomizedtesting.rules.StatementAdapter.evaluate(StatementAdapter.java:36)
at com.carrotsearch.randomizedtesting.rules.StatementAdapter.evaluate(StatementAdapter.java:36)
at com.carrotsearch.randomizedtesting.rules.StatementAdapter.evaluate(StatementAdapter.java:36)
at org.apache.lucene.util.TestRuleAssertionsRequired$1.evaluate(TestRuleAssertionsRequired.java:53)
at org.apache.lucene.util.TestRuleMarkFailure$1.evaluate(TestRuleMarkFailure.java:47)
at org.apache.lucene.util.TestRuleIgnoreAfterMaxFailures$1.evaluate(TestRuleIgnoreAfterMaxFailures.java:64)
at org.apache.lucene.util.TestRuleIgnoreTestSuites$1.evaluate(TestRuleIgnoreTestSuites.java:54)
at com.carrotsearch.randomizedtesting.rules.StatementAdapter.evaluate(StatementAdapter.java:36)
at com.carrotsearch.randomizedtesting.ThreadLeakControl$StatementRunner.run(ThreadLeakControl.java:368)
at java.lang.Thread.run(Thread.java:748)
FAILED: org.apache.solr.cloud.TestHdfsCloudBackupRestore.test
Error Message:
expected:<COMPLETED> but was:<RUNNING>
Stack Trace:
java.lang.AssertionError: expected:<COMPLETED> but was:<RUNNING>
at __randomizedtesting.SeedInfo.seed([DA68999B03709396:523CA641AD8CFE6E]:0)
at org.junit.Assert.fail(Assert.java:93)
at org.junit.Assert.failNotEquals(Assert.java:647)
at org.junit.Assert.assertEquals(Assert.java:128)
at org.junit.Assert.assertEquals(Assert.java:147)
at org.apache.solr.cloud.AbstractCloudBackupRestoreTestCase.testBackupAndRestore(AbstractCloudBackupRestoreTestCase.java:287)
at org.apache.solr.cloud.AbstractCloudBackupRestoreTestCase.test(AbstractCloudBackupRestoreTestCase.java:140)
at sun.reflect.NativeMethodAccessorImpl.invoke0(Native Method)
at sun.reflect.NativeMethodAccessorImpl.invoke(NativeMethodAccessorImpl.java:62)
at sun.reflect.DelegatingMethodAccessorImpl.invoke(DelegatingMethodAccessorImpl.java:43)
at java.lang.reflect.Method.invoke(Method.java:498)
at com.carrotsearch.randomizedtesting.RandomizedRunner.invoke(RandomizedRunner.java:1737)
at com.carrotsearch.randomizedtesting.RandomizedRunner$8.evaluate(RandomizedRunner.java:934)
at com.carrotsearch.randomizedtesting.RandomizedRunner$9.evaluate(RandomizedRunner.java:970)
at com.carrotsearch.randomizedtesting.RandomizedRunner$10.evaluate(RandomizedRunner.java:984)
at com.carrotsearch.randomizedtesting.rules.SystemPropertiesRestoreRule$1.evaluate(SystemPropertiesRestoreRule.java:57)
at org.apache.lucene.util.TestRuleSetupTeardownChained$1.evaluate(TestRuleSetupTeardownChained.java:49)
at org.apache.lucene.util.AbstractBeforeAfterRule$1.evaluate(AbstractBeforeAfterRule.java:45)
at org.apache.lucene.util.TestRuleThreadAndTestName$1.evaluate(TestRuleThreadAndTestName.java:48)
at org.apache.lucene.util.TestRuleIgnoreAfterMaxFailures$1.evaluate(TestRuleIgnoreAfterMaxFailures.java:64)
at org.apache.lucene.util.TestRuleMarkFailure$1.evaluate(TestRuleMarkFailure.java:47)
at com.carrotsearch.randomizedtesting.rules.StatementAdapter.evaluate(StatementAdapter.java:36)
at com.carrotsearch.randomizedtesting.ThreadLeakControl$StatementRunner.run(ThreadLeakControl.java:368)
at com.carrotsearch.randomizedtesting.ThreadLeakControl.forkTimeoutingTask(ThreadLeakControl.java:817)
at com.carrotsearch.randomizedtesting.ThreadLeakControl$3.evaluate(ThreadLeakControl.java:468)
at com.carrotsearch.randomizedtesting.RandomizedRunner.runSingleTest(RandomizedRunner.java:943)
at com.carrotsearch.randomizedtesting.RandomizedRunner$5.evaluate(RandomizedRunner.java:829)
at com.carrotsearch.randomizedtesting.RandomizedRunner$6.evaluate(RandomizedRunner.java:879)
at com.carrotsearch.randomizedtesting.RandomizedRunner$7.evaluate(RandomizedRunner.java:890)
at com.carrotsearch.randomizedtesting.rules.StatementAdapter.evaluate(StatementAdapter.java:36)
at com.carrotsearch.randomizedtesting.rules.SystemPropertiesRestoreRule$1.evaluate(SystemPropertiesRestoreRule.java:57)
at org.apache.lucene.util.AbstractBeforeAfterRule$1.evaluate(AbstractBeforeAfterRule.java:45)
at com.carrotsearch.randomizedtesting.rules.StatementAdapter.evaluate(StatementAdapter.java:36)
at org.apache.lucene.util.TestRuleStoreClassName$1.evaluate(TestRuleStoreClassName.java:41)
at com.carrotsearch.randomizedtesting.rules.NoShadowingOrOverridesOnMethodsRule$1.evaluate(NoShadowingOrOverridesOnMethodsRule.java:40)
at com.carrotsearch.randomizedtesting.rules.NoShadowingOrOverridesOnMethodsRule$1.evaluate(NoShadowingOrOverridesOnMethodsRule.java:40)
at com.carrotsearch.randomizedtesting.rules.StatementAdapter.evaluate(StatementAdapter.java:36)
at com.carrotsearch.randomizedtesting.rules.StatementAdapter.evaluate(StatementAdapter.java:36)
at com.carrotsearch.randomizedtesting.rules.StatementAdapter.evaluate(StatementAdapter.java:36)
at org.apache.lucene.util.TestRuleAssertionsRequired$1.evaluate(TestRuleAssertionsRequired.java:53)
at org.apache.lucene.util.TestRuleMarkFailure$1.evaluate(TestRuleMarkFailure.java:47)
at org.apache.lucene.util.TestRuleIgnoreAfterMaxFailures$1.evaluate(TestRuleIgnoreAfterMaxFailures.java:64)
at org.apache.lucene.util.TestRuleIgnoreTestSuites$1.evaluate(TestRuleIgnoreTestSuites.java:54)
at com.carrotsearch.randomizedtesting.rules.StatementAdapter.evaluate(StatementAdapter.java:36)
at com.carrotsearch.randomizedtesting.ThreadLeakControl$StatementRunner.run(ThreadLeakControl.java:368)
at java.lang.Thread.run(Thread.java:748)
FAILED: org.apache.solr.cloud.UnloadDistributedZkTest.test
Error Message:
Could not load collection from ZK: unloadcollection
Stack Trace:
org.apache.solr.common.SolrException: Could not load collection from ZK: unloadcollection
at __randomizedtesting.SeedInfo.seed([DA68999B03709396:523CA641AD8CFE6E]:0)
at org.apache.solr.common.cloud.ZkStateReader.getCollectionLive(ZkStateReader.java:1172)
at org.apache.solr.common.cloud.ZkStateReader$LazyCollectionRef.get(ZkStateReader.java:692)
at org.apache.solr.common.cloud.ClusterState.getCollectionOrNull(ClusterState.java:130)
at org.apache.solr.cloud.AbstractDistribZkTestBase.waitForRecoveriesToFinish(AbstractDistribZkTestBase.java:154)
at org.apache.solr.cloud.AbstractDistribZkTestBase.waitForRecoveriesToFinish(AbstractDistribZkTestBase.java:140)
at org.apache.solr.cloud.AbstractDistribZkTestBase.waitForRecoveriesToFinish(AbstractDistribZkTestBase.java:135)
at org.apache.solr.cloud.UnloadDistributedZkTest.testCoreUnloadAndLeaders(UnloadDistributedZkTest.java:277)
at org.apache.solr.cloud.UnloadDistributedZkTest.test(UnloadDistributedZkTest.java:68)
at sun.reflect.NativeMethodAccessorImpl.invoke0(Native Method)
at sun.reflect.NativeMethodAccessorImpl.invoke(NativeMethodAccessorImpl.java:62)
at sun.reflect.DelegatingMethodAccessorImpl.invoke(DelegatingMethodAccessorImpl.java:43)
at java.lang.reflect.Method.invoke(Method.java:498)
at com.carrotsearch.randomizedtesting.RandomizedRunner.invoke(RandomizedRunner.java:1737)
at com.carrotsearch.randomizedtesting.RandomizedRunner$8.evaluate(RandomizedRunner.java:934)
at com.carrotsearch.randomizedtesting.RandomizedRunner$9.evaluate(RandomizedRunner.java:970)
at com.carrotsearch.randomizedtesting.RandomizedRunner$10.evaluate(RandomizedRunner.java:984)
at org.apache.solr.BaseDistributedSearchTestCase$ShardsRepeatRule$ShardsFixedStatement.callStatement(BaseDistributedSearchTestCase.java:993)
at org.apache.solr.BaseDistributedSearchTestCase$ShardsRepeatRule$ShardsStatement.evaluate(BaseDistributedSearchTestCase.java:968)
at com.carrotsearch.randomizedtesting.rules.SystemPropertiesRestoreRule$1.evaluate(SystemPropertiesRestoreRule.java:57)
at org.apache.lucene.util.TestRuleSetupTeardownChained$1.evaluate(TestRuleSetupTeardownChained.java:49)
at org.apache.lucene.util.AbstractBeforeAfterRule$1.evaluate(AbstractBeforeAfterRule.java:45)
at org.apache.lucene.util.TestRuleThreadAndTestName$1.evaluate(TestRuleThreadAndTestName.java:48)
at org.apache.lucene.util.TestRuleIgnoreAfterMaxFailures$1.evaluate(TestRuleIgnoreAfterMaxFailures.java:64)
at org.apache.lucene.util.TestRuleMarkFailure$1.evaluate(TestRuleMarkFailure.java:47)
at com.carrotsearch.randomizedtesting.rules.StatementAdapter.evaluate(StatementAdapter.java:36)
at com.carrotsearch.randomizedtesting.ThreadLeakControl$StatementRunner.run(ThreadLeakControl.java:368)
at com.carrotsearch.randomizedtesting.ThreadLeakControl.forkTimeoutingTask(ThreadLeakControl.java:817)
at com.carrotsearch.randomizedtesting.ThreadLeakControl$3.evaluate(ThreadLeakControl.java:468)
at com.carrotsearch.randomizedtesting.RandomizedRunner.runSingleTest(RandomizedRunner.java:943)
at com.carrotsearch.randomizedtesting.RandomizedRunner$5.evaluate(RandomizedRunner.java:829)
at com.carrotsearch.randomizedtesting.RandomizedRunner$6.evaluate(RandomizedRunner.java:879)
at com.carrotsearch.randomizedtesting.RandomizedRunner$7.evaluate(RandomizedRunner.java:890)
at com.carrotsearch.randomizedtesting.rules.StatementAdapter.evaluate(StatementAdapter.java:36)
at com.carrotsearch.randomizedtesting.rules.SystemPropertiesRestoreRule$1.evaluate(SystemPropertiesRestoreRule.java:57)
at org.apache.lucene.util.AbstractBeforeAfterRule$1.evaluate(AbstractBeforeAfterRule.java:45)
at com.carrotsearch.randomizedtesting.rules.StatementAdapter.evaluate(StatementAdapter.java:36)
at org.apache.lucene.util.TestRuleStoreClassName$1.evaluate(TestRuleStoreClassName.java:41)
at com.carrotsearch.randomizedtesting.rules.NoShadowingOrOverridesOnMethodsRule$1.evaluate(NoShadowingOrOverridesOnMethodsRule.java:40)
at com.carrotsearch.randomizedtesting.rules.NoShadowingOrOverridesOnMethodsRule$1.evaluate(NoShadowingOrOverridesOnMethodsRule.java:40)
at com.carrotsearch.randomizedtesting.rules.StatementAdapter.evaluate(StatementAdapter.java:36)
at com.carrotsearch.randomizedtesting.rules.StatementAdapter.evaluate(StatementAdapter.java:36)
at com.carrotsearch.randomizedtesting.rules.StatementAdapter.evaluate(StatementAdapter.java:36)
at org.apache.lucene.util.TestRuleAssertionsRequired$1.evaluate(TestRuleAssertionsRequired.java:53)
at org.apache.lucene.util.TestRuleMarkFailure$1.evaluate(TestRuleMarkFailure.java:47)
at org.apache.lucene.util.TestRuleIgnoreAfterMaxFailures$1.evaluate(TestRuleIgnoreAfterMaxFailures.java:64)
at org.apache.lucene.util.TestRuleIgnoreTestSuites$1.evaluate(TestRuleIgnoreTestSuites.java:54)
at com.carrotsearch.randomizedtesting.rules.StatementAdapter.evaluate(StatementAdapter.java:36)
at com.carrotsearch.randomizedtesting.ThreadLeakControl$StatementRunner.run(ThreadLeakControl.java:368)
at java.lang.Thread.run(Thread.java:748)
Caused by: org.apache.zookeeper.KeeperException$SessionExpiredException: KeeperErrorCode = Session expired for /collections/unloadcollection/state.json
at org.apache.zookeeper.KeeperException.create(KeeperException.java:127)
at org.apache.zookeeper.KeeperException.create(KeeperException.java:51)
at org.apache.zookeeper.ZooKeeper.getData(ZooKeeper.java:1212)
at org.apache.solr.common.cloud.SolrZkClient.lambda$getData$5(SolrZkClient.java:332)
at org.apache.solr.common.cloud.ZkCmdExecutor.retryOperation(ZkCmdExecutor.java:60)
at org.apache.solr.common.cloud.SolrZkClient.getData(SolrZkClient.java:332)
at org.apache.solr.common.cloud.ZkStateReader.fetchCollectionState(ZkStateReader.java:1184)
at org.apache.solr.common.cloud.ZkStateReader.getCollectionLive(ZkStateReader.java:1170)
... 48 more
FAILED: junit.framework.TestSuite.org.apache.solr.cloud.ChaosMonkeySafeLeaderWithPullReplicasTest
Error Message:
7 threads leaked from SUITE scope at org.apache.solr.cloud.ChaosMonkeySafeLeaderWithPullReplicasTest: 1) Thread[id=12972, name=StoppableCommitThread-SendThread(127.0.0.1:58899), state=TIMED_WAITING, group=TGRP-ChaosMonkeySafeLeaderWithPullReplicasTest] at java.lang.Thread.sleep(Native Method) at org.apache.zookeeper.client.StaticHostProvider.next(StaticHostProvider.java:101) at org.apache.zookeeper.ClientCnxn$SendThread.startConnect(ClientCnxn.java:997) at org.apache.zookeeper.ClientCnxn$SendThread.run(ClientCnxn.java:1060) 2) Thread[id=12925, name=StoppableCommitThread, state=TIMED_WAITING, group=TGRP-ChaosMonkeySafeLeaderWithPullReplicasTest] at java.lang.Thread.sleep(Native Method) at org.apache.solr.cloud.StoppableCommitThread.run(StoppableCommitThread.java:55) 3) Thread[id=13005, name=zkCallback-1201-thread-2, state=TIMED_WAITING, group=TGRP-ChaosMonkeySafeLeaderWithPullReplicasTest] at sun.misc.Unsafe.park(Native Method) at java.util.concurrent.locks.LockSupport.parkNanos(LockSupport.java:215) at java.util.concurrent.SynchronousQueue$TransferStack.awaitFulfill(SynchronousQueue.java:460) at java.util.concurrent.SynchronousQueue$TransferStack.transfer(SynchronousQueue.java:362) at java.util.concurrent.SynchronousQueue.poll(SynchronousQueue.java:941) at java.util.concurrent.ThreadPoolExecutor.getTask(ThreadPoolExecutor.java:1073) at java.util.concurrent.ThreadPoolExecutor.runWorker(ThreadPoolExecutor.java:1134) at java.util.concurrent.ThreadPoolExecutor$Worker.run(ThreadPoolExecutor.java:624) at java.lang.Thread.run(Thread.java:748) 4) Thread[id=12973, name=StoppableCommitThread-EventThread, state=WAITING, group=TGRP-ChaosMonkeySafeLeaderWithPullReplicasTest] at sun.misc.Unsafe.park(Native Method) at java.util.concurrent.locks.LockSupport.park(LockSupport.java:175) at java.util.concurrent.locks.AbstractQueuedSynchronizer$ConditionObject.await(AbstractQueuedSynchronizer.java:2039) at java.util.concurrent.LinkedBlockingQueue.take(LinkedBlockingQueue.java:442) at org.apache.zookeeper.ClientCnxn$EventThread.run(ClientCnxn.java:501) 5) Thread[id=12985, name=zkCallback-1201-thread-1, state=TIMED_WAITING, group=TGRP-ChaosMonkeySafeLeaderWithPullReplicasTest] at sun.misc.Unsafe.park(Native Method) at java.util.concurrent.locks.LockSupport.parkNanos(LockSupport.java:215) at java.util.concurrent.SynchronousQueue$TransferStack.awaitFulfill(SynchronousQueue.java:460) at java.util.concurrent.SynchronousQueue$TransferStack.transfer(SynchronousQueue.java:362) at java.util.concurrent.SynchronousQueue.poll(SynchronousQueue.java:941) at java.util.concurrent.ThreadPoolExecutor.getTask(ThreadPoolExecutor.java:1073) at java.util.concurrent.ThreadPoolExecutor.runWorker(ThreadPoolExecutor.java:1134) at java.util.concurrent.ThreadPoolExecutor$Worker.run(ThreadPoolExecutor.java:624) at java.lang.Thread.run(Thread.java:748) 6) Thread[id=13098, name=zkCallback-1201-thread-3, state=TIMED_WAITING, group=TGRP-ChaosMonkeySafeLeaderWithPullReplicasTest] at sun.misc.Unsafe.park(Native Method) at java.util.concurrent.locks.LockSupport.parkNanos(LockSupport.java:215) at java.util.concurrent.SynchronousQueue$TransferStack.awaitFulfill(SynchronousQueue.java:460) at java.util.concurrent.SynchronousQueue$TransferStack.transfer(SynchronousQueue.java:362) at java.util.concurrent.SynchronousQueue.poll(SynchronousQueue.java:941) at java.util.concurrent.ThreadPoolExecutor.getTask(ThreadPoolExecutor.java:1073) at java.util.concurrent.ThreadPoolExecutor.runWorker(ThreadPoolExecutor.java:1134) at java.util.concurrent.ThreadPoolExecutor$Worker.run(ThreadPoolExecutor.java:624) at java.lang.Thread.run(Thread.java:748) 7) Thread[id=13099, name=zkCallback-1201-thread-4, state=TIMED_WAITING, group=TGRP-ChaosMonkeySafeLeaderWithPullReplicasTest] at sun.misc.Unsafe.park(Native Method) at java.util.concurrent.locks.LockSupport.parkNanos(LockSupport.java:215) at java.util.concurrent.SynchronousQueue$TransferStack.awaitFulfill(SynchronousQueue.java:460) at java.util.concurrent.SynchronousQueue$TransferStack.transfer(SynchronousQueue.java:362) at java.util.concurrent.SynchronousQueue.poll(SynchronousQueue.java:941) at java.util.concurrent.ThreadPoolExecutor.getTask(ThreadPoolExecutor.java:1073) at java.util.concurrent.ThreadPoolExecutor.runWorker(ThreadPoolExecutor.java:1134) at java.util.concurrent.ThreadPoolExecutor$Worker.run(ThreadPoolExecutor.java:624) at java.lang.Thread.run(Thread.java:748)
Stack Trace:
com.carrotsearch.randomizedtesting.ThreadLeakError: 7 threads leaked from SUITE scope at org.apache.solr.cloud.ChaosMonkeySafeLeaderWithPullReplicasTest:
1) Thread[id=12972, name=StoppableCommitThread-SendThread(127.0.0.1:58899), state=TIMED_WAITING, group=TGRP-ChaosMonkeySafeLeaderWithPullReplicasTest]
at java.lang.Thread.sleep(Native Method)
at org.apache.zookeeper.client.StaticHostProvider.next(StaticHostProvider.java:101)
at org.apache.zookeeper.ClientCnxn$SendThread.startConnect(ClientCnxn.java:997)
at org.apache.zookeeper.ClientCnxn$SendThread.run(ClientCnxn.java:1060)
2) Thread[id=12925, name=StoppableCommitThread, state=TIMED_WAITING, group=TGRP-ChaosMonkeySafeLeaderWithPullReplicasTest]
at java.lang.Thread.sleep(Native Method)
at org.apache.solr.cloud.StoppableCommitThread.run(StoppableCommitThread.java:55)
3) Thread[id=13005, name=zkCallback-1201-thread-2, state=TIMED_WAITING, group=TGRP-ChaosMonkeySafeLeaderWithPullReplicasTest]
at sun.misc.Unsafe.park(Native Method)
at java.util.concurrent.locks.LockSupport.parkNanos(LockSupport.java:215)
at java.util.concurrent.SynchronousQueue$TransferStack.awaitFulfill(SynchronousQueue.java:460)
at java.util.concurrent.SynchronousQueue$TransferStack.transfer(SynchronousQueue.java:362)
at java.util.concurrent.SynchronousQueue.poll(SynchronousQueue.java:941)
at java.util.concurrent.ThreadPoolExecutor.getTask(ThreadPoolExecutor.java:1073)
at java.util.concurrent.ThreadPoolExecutor.runWorker(ThreadPoolExecutor.java:1134)
at java.util.concurrent.ThreadPoolExecutor$Worker.run(ThreadPoolExecutor.java:624)
at java.lang.Thread.run(Thread.java:748)
4) Thread[id=12973, name=StoppableCommitThread-EventThread, state=WAITING, group=TGRP-ChaosMonkeySafeLeaderWithPullReplicasTest]
at sun.misc.Unsafe.park(Native Method)
at java.util.concurrent.locks.LockSupport.park(LockSupport.java:175)
at java.util.concurrent.locks.AbstractQueuedSynchronizer$ConditionObject.await(AbstractQueuedSynchronizer.java:2039)
at java.util.concurrent.LinkedBlockingQueue.take(LinkedBlockingQueue.java:442)
at org.apache.zookeeper.ClientCnxn$EventThread.run(ClientCnxn.java:501)
5) Thread[id=12985, name=zkCallback-1201-thread-1, state=TIMED_WAITING, group=TGRP-ChaosMonkeySafeLeaderWithPullReplicasTest]
at sun.misc.Unsafe.park(Native Method)
at java.util.concurrent.locks.LockSupport.parkNanos(LockSupport.java:215)
at java.util.concurrent.SynchronousQueue$TransferStack.awaitFulfill(SynchronousQueue.java:460)
at java.util.concurrent.SynchronousQueue$TransferStack.transfer(SynchronousQueue.java:362)
at java.util.concurrent.SynchronousQueue.poll(SynchronousQueue.java:941)
at java.util.concurrent.ThreadPoolExecutor.getTask(ThreadPoolExecutor.java:1073)
at java.util.concurrent.ThreadPoolExecutor.runWorker(ThreadPoolExecutor.java:1134)
at java.util.concurrent.ThreadPoolExecutor$Worker.run(ThreadPoolExecutor.java:624)
at java.lang.Thread.run(Thread.java:748)
6) Thread[id=13098, name=zkCallback-1201-thread-3, state=TIMED_WAITING, group=TGRP-ChaosMonkeySafeLeaderWithPullReplicasTest]
at sun.misc.Unsafe.park(Native Method)
at java.util.concurrent.locks.LockSupport.parkNanos(LockSupport.java:215)
at java.util.concurrent.SynchronousQueue$TransferStack.awaitFulfill(SynchronousQueue.java:460)
at java.util.concurrent.SynchronousQueue$TransferStack.transfer(SynchronousQueue.java:362)
at java.util.concurrent.SynchronousQueue.poll(SynchronousQueue.java:941)
at java.util.concurrent.ThreadPoolExecutor.getTask(ThreadPoolExecutor.java:1073)
at java.util.concurrent.ThreadPoolExecutor.runWorker(ThreadPoolExecutor.java:1134)
at java.util.concurrent.ThreadPoolExecutor$Worker.run(ThreadPoolExecutor.java:624)
at java.lang.Thread.run(Thread.java:748)
7) Thread[id=13099, name=zkCallback-1201-thread-4, state=TIMED_WAITING, group=TGRP-ChaosMonkeySafeLeaderWithPullReplicasTest]
at sun.misc.Unsafe.park(Native Method)
at java.util.concurrent.locks.LockSupport.parkNanos(LockSupport.java:215)
at java.util.concurrent.SynchronousQueue$TransferStack.awaitFulfill(SynchronousQueue.java:460)
at java.util.concurrent.SynchronousQueue$TransferStack.transfer(SynchronousQueue.java:362)
at java.util.concurrent.SynchronousQueue.poll(SynchronousQueue.java:941)
at java.util.concurrent.ThreadPoolExecutor.getTask(ThreadPoolExecutor.java:1073)
at java.util.concurrent.ThreadPoolExecutor.runWorker(ThreadPoolExecutor.java:1134)
at java.util.concurrent.ThreadPoolExecutor$Worker.run(ThreadPoolExecutor.java:624)
at java.lang.Thread.run(Thread.java:748)
at __randomizedtesting.SeedInfo.seed([DA68999B03709396]:0)
FAILED: junit.framework.TestSuite.org.apache.solr.cloud.ChaosMonkeySafeLeaderWithPullReplicasTest
Error Message:
There are still zombie threads that couldn't be terminated: 1) Thread[id=12972, name=StoppableCommitThread-SendThread(127.0.0.1:58899), state=TIMED_WAITING, group=TGRP-ChaosMonkeySafeLeaderWithPullReplicasTest] at java.lang.Thread.sleep(Native Method) at org.apache.zookeeper.client.StaticHostProvider.next(StaticHostProvider.java:101) at org.apache.zookeeper.ClientCnxn$SendThread.startConnect(ClientCnxn.java:997) at org.apache.zookeeper.ClientCnxn$SendThread.run(ClientCnxn.java:1060) 2) Thread[id=13005, name=zkCallback-1201-thread-2, state=TIMED_WAITING, group=TGRP-ChaosMonkeySafeLeaderWithPullReplicasTest] at sun.misc.Unsafe.park(Native Method) at java.util.concurrent.locks.LockSupport.parkNanos(LockSupport.java:215) at java.util.concurrent.SynchronousQueue$TransferStack.awaitFulfill(SynchronousQueue.java:460) at java.util.concurrent.SynchronousQueue$TransferStack.transfer(SynchronousQueue.java:362) at java.util.concurrent.SynchronousQueue.poll(SynchronousQueue.java:941) at java.util.concurrent.ThreadPoolExecutor.getTask(ThreadPoolExecutor.java:1073) at java.util.concurrent.ThreadPoolExecutor.runWorker(ThreadPoolExecutor.java:1134) at java.util.concurrent.ThreadPoolExecutor$Worker.run(ThreadPoolExecutor.java:624) at java.lang.Thread.run(Thread.java:748) 3) Thread[id=12985, name=zkCallback-1201-thread-1, state=TIMED_WAITING, group=TGRP-ChaosMonkeySafeLeaderWithPullReplicasTest] at sun.misc.Unsafe.park(Native Method) at java.util.concurrent.locks.LockSupport.parkNanos(LockSupport.java:215) at java.util.concurrent.SynchronousQueue$TransferStack.awaitFulfill(SynchronousQueue.java:460) at java.util.concurrent.SynchronousQueue$TransferStack.transfer(SynchronousQueue.java:362) at java.util.concurrent.SynchronousQueue.poll(SynchronousQueue.java:941) at java.util.concurrent.ThreadPoolExecutor.getTask(ThreadPoolExecutor.java:1073) at java.util.concurrent.ThreadPoolExecutor.runWorker(ThreadPoolExecutor.java:1134) at java.util.concurrent.ThreadPoolExecutor$Worker.run(ThreadPoolExecutor.java:624) at java.lang.Thread.run(Thread.java:748) 4) Thread[id=13098, name=zkCallback-1201-thread-3, state=TIMED_WAITING, group=TGRP-ChaosMonkeySafeLeaderWithPullReplicasTest] at sun.misc.Unsafe.park(Native Method) at java.util.concurrent.locks.LockSupport.parkNanos(LockSupport.java:215) at java.util.concurrent.SynchronousQueue$TransferStack.awaitFulfill(SynchronousQueue.java:460) at java.util.concurrent.SynchronousQueue$TransferStack.transfer(SynchronousQueue.java:362) at java.util.concurrent.SynchronousQueue.poll(SynchronousQueue.java:941) at java.util.concurrent.ThreadPoolExecutor.getTask(ThreadPoolExecutor.java:1073) at java.util.concurrent.ThreadPoolExecutor.runWorker(ThreadPoolExecutor.java:1134) at java.util.concurrent.ThreadPoolExecutor$Worker.run(ThreadPoolExecutor.java:624) at java.lang.Thread.run(Thread.java:748) 5) Thread[id=13099, name=zkCallback-1201-thread-4, state=TIMED_WAITING, group=TGRP-ChaosMonkeySafeLeaderWithPullReplicasTest] at sun.misc.Unsafe.park(Native Method) at java.util.concurrent.locks.LockSupport.parkNanos(LockSupport.java:215) at java.util.concurrent.SynchronousQueue$TransferStack.awaitFulfill(SynchronousQueue.java:460) at java.util.concurrent.SynchronousQueue$TransferStack.transfer(SynchronousQueue.java:362) at java.util.concurrent.SynchronousQueue.poll(SynchronousQueue.java:941) at java.util.concurrent.ThreadPoolExecutor.getTask(ThreadPoolExecutor.java:1073) at java.util.concurrent.ThreadPoolExecutor.runWorker(ThreadPoolExecutor.java:1134) at java.util.concurrent.ThreadPoolExecutor$Worker.run(ThreadPoolExecutor.java:624) at java.lang.Thread.run(Thread.java:748)
Stack Trace:
com.carrotsearch.randomizedtesting.ThreadLeakError: There are still zombie threads that couldn't be terminated:
1) Thread[id=12972, name=StoppableCommitThread-SendThread(127.0.0.1:58899), state=TIMED_WAITING, group=TGRP-ChaosMonkeySafeLeaderWithPullReplicasTest]
at java.lang.Thread.sleep(Native Method)
at org.apache.zookeeper.client.StaticHostProvider.next(StaticHostProvider.java:101)
at org.apache.zookeeper.ClientCnxn$SendThread.startConnect(ClientCnxn.java:997)
at org.apache.zookeeper.ClientCnxn$SendThread.run(ClientCnxn.java:1060)
2) Thread[id=13005, name=zkCallback-1201-thread-2, state=TIMED_WAITING, group=TGRP-ChaosMonkeySafeLeaderWithPullReplicasTest]
at sun.misc.Unsafe.park(Native Method)
at java.util.concurrent.locks.LockSupport.parkNanos(LockSupport.java:215)
at java.util.concurrent.SynchronousQueue$TransferStack.awaitFulfill(SynchronousQueue.java:460)
at java.util.concurrent.SynchronousQueue$TransferStack.transfer(SynchronousQueue.java:362)
at java.util.concurrent.SynchronousQueue.poll(SynchronousQueue.java:941)
at java.util.concurrent.ThreadPoolExecutor.getTask(ThreadPoolExecutor.java:1073)
at java.util.concurrent.ThreadPoolExecutor.runWorker(ThreadPoolExecutor.java:1134)
at java.util.concurrent.ThreadPoolExecutor$Worker.run(ThreadPoolExecutor.java:624)
at java.lang.Thread.run(Thread.java:748)
3) Thread[id=12985, name=zkCallback-1201-thread-1, state=TIMED_WAITING, group=TGRP-ChaosMonkeySafeLeaderWithPullReplicasTest]
at sun.misc.Unsafe.park(Native Method)
at java.util.concurrent.locks.LockSupport.parkNanos(LockSupport.java:215)
at java.util.concurrent.SynchronousQueue$TransferStack.awaitFulfill(SynchronousQueue.java:460)
at java.util.concurrent.SynchronousQueue$TransferStack.transfer(SynchronousQueue.java:362)
at java.util.concurrent.SynchronousQueue.poll(SynchronousQueue.java:941)
at java.util.concurrent.ThreadPoolExecutor.getTask(ThreadPoolExecutor.java:1073)
at java.util.concurrent.ThreadPoolExecutor.runWorker(ThreadPoolExecutor.java:1134)
at java.util.concurrent.ThreadPoolExecutor$Worker.run(ThreadPoolExecutor.java:624)
at java.lang.Thread.run(Thread.java:748)
4) Thread[id=13098, name=zkCallback-1201-thread-3, state=TIMED_WAITING, group=TGRP-ChaosMonkeySafeLeaderWithPullReplicasTest]
at sun.misc.Unsafe.park(Native Method)
at java.util.concurrent.locks.LockSupport.parkNanos(LockSupport.java:215)
at java.util.concurrent.SynchronousQueue$TransferStack.awaitFulfill(SynchronousQueue.java:460)
at java.util.concurrent.SynchronousQueue$TransferStack.transfer(SynchronousQueue.java:362)
at java.util.concurrent.SynchronousQueue.poll(SynchronousQueue.java:941)
at java.util.concurrent.ThreadPoolExecutor.getTask(ThreadPoolExecutor.java:1073)
at java.util.concurrent.ThreadPoolExecutor.runWorker(ThreadPoolExecutor.java:1134)
at java.util.concurrent.ThreadPoolExecutor$Worker.run(ThreadPoolExecutor.java:624)
at java.lang.Thread.run(Thread.java:748)
5) Thread[id=13099, name=zkCallback-1201-thread-4, state=TIMED_WAITING, group=TGRP-ChaosMonkeySafeLeaderWithPullReplicasTest]
at sun.misc.Unsafe.park(Native Method)
at java.util.concurrent.locks.LockSupport.parkNanos(LockSupport.java:215)
at java.util.concurrent.SynchronousQueue$TransferStack.awaitFulfill(SynchronousQueue.java:460)
at java.util.concurrent.SynchronousQueue$TransferStack.transfer(SynchronousQueue.java:362)
at java.util.concurrent.SynchronousQueue.poll(SynchronousQueue.java:941)
at java.util.concurrent.ThreadPoolExecutor.getTask(ThreadPoolExecutor.java:1073)
at java.util.concurrent.ThreadPoolExecutor.runWorker(ThreadPoolExecutor.java:1134)
at java.util.concurrent.ThreadPoolExecutor$Worker.run(ThreadPoolExecutor.java:624)
at java.lang.Thread.run(Thread.java:748)
at __randomizedtesting.SeedInfo.seed([DA68999B03709396]:0)
FAILED: org.apache.solr.cloud.TestTolerantUpdateProcessorRandomCloud.testRandomUpdates
Error Message:
Could not load collection from ZK: test_col
Stack Trace:
org.apache.solr.common.SolrException: Could not load collection from ZK: test_col
at __randomizedtesting.SeedInfo.seed([DA68999B03709396:E6A94C2B740D6D84]:0)
at org.apache.solr.common.cloud.ZkStateReader.getCollectionLive(ZkStateReader.java:1172)
at org.apache.solr.common.cloud.ZkStateReader$LazyCollectionRef.get(ZkStateReader.java:692)
at org.apache.solr.client.solrj.impl.CloudSolrClient.getDocCollection(CloudSolrClient.java:1206)
at org.apache.solr.client.solrj.impl.CloudSolrClient.requestWithRetryOnStaleState(CloudSolrClient.java:848)
at org.apache.solr.client.solrj.impl.CloudSolrClient.request(CloudSolrClient.java:816)
at org.apache.solr.client.solrj.SolrRequest.process(SolrRequest.java:194)
at org.apache.solr.client.solrj.SolrClient.commit(SolrClient.java:484)
at org.apache.solr.client.solrj.SolrClient.commit(SolrClient.java:463)
at org.apache.solr.cloud.TestTolerantUpdateProcessorRandomCloud.testRandomUpdates(TestTolerantUpdateProcessorRandomCloud.java:274)
at sun.reflect.NativeMethodAccessorImpl.invoke0(Native Method)
at sun.reflect.NativeMethodAccessorImpl.invoke(NativeMethodAccessorImpl.java:62)
at sun.reflect.DelegatingMethodAccessorImpl.invoke(DelegatingMethodAccessorImpl.java:43)
at java.lang.reflect.Method.invoke(Method.java:498)
at com.carrotsearch.randomizedtesting.RandomizedRunner.invoke(RandomizedRunner.java:1737)
at com.carrotsearch.randomizedtesting.RandomizedRunner$8.evaluate(RandomizedRunner.java:934)
at com.carrotsearch.randomizedtesting.RandomizedRunner$9.evaluate(RandomizedRunner.java:970)
at com.carrotsearch.randomizedtesting.RandomizedRunner$10.evaluate(RandomizedRunner.java:984)
at com.carrotsearch.randomizedtesting.rules.SystemPropertiesRestoreRule$1.evaluate(SystemPropertiesRestoreRule.java:57)
at org.apache.lucene.util.TestRuleSetupTeardownChained$1.evaluate(TestRuleSetupTeardownChained.java:49)
at org.apache.lucene.util.AbstractBeforeAfterRule$1.evaluate(AbstractBeforeAfterRule.java:45)
at org.apache.lucene.util.TestRuleThreadAndTestName$1.evaluate(TestRuleThreadAndTestName.java:48)
at org.apache.lucene.util.TestRuleIgnoreAfterMaxFailures$1.evaluate(TestRuleIgnoreAfterMaxFailures.java:64)
at org.apache.lucene.util.TestRuleMarkFailure$1.evaluate(TestRuleMarkFailure.java:47)
at com.carrotsearch.randomizedtesting.rules.StatementAdapter.evaluate(StatementAdapter.java:36)
at com.carrotsearch.randomizedtesting.ThreadLeakControl$StatementRunner.run(ThreadLeakControl.java:368)
at com.carrotsearch.randomizedtesting.ThreadLeakControl.forkTimeoutingTask(ThreadLeakControl.java:817)
at com.carrotsearch.randomizedtesting.ThreadLeakControl$3.evaluate(ThreadLeakControl.java:468)
at com.carrotsearch.randomizedtesting.RandomizedRunner.runSingleTest(RandomizedRunner.java:943)
at com.carrotsearch.randomizedtesting.RandomizedRunner$5.evaluate(RandomizedRunner.java:829)
at com.carrotsearch.randomizedtesting.RandomizedRunner$6.evaluate(RandomizedRunner.java:879)
at com.carrotsearch.randomizedtesting.RandomizedRunner$7.evaluate(RandomizedRunner.java:890)
at com.carrotsearch.randomizedtesting.rules.StatementAdapter.evaluate(StatementAdapter.java:36)
at com.carrotsearch.randomizedtesting.rules.SystemPropertiesRestoreRule$1.evaluate(SystemPropertiesRestoreRule.java:57)
at org.apache.lucene.util.AbstractBeforeAfterRule$1.evaluate(AbstractBeforeAfterRule.java:45)
at com.carrotsearch.randomizedtesting.rules.StatementAdapter.evaluate(StatementAdapter.java:36)
at org.apache.lucene.util.TestRuleStoreClassName$1.evaluate(TestRuleStoreClassName.java:41)
at com.carrotsearch.randomizedtesting.rules.NoShadowingOrOverridesOnMethodsRule$1.evaluate(NoShadowingOrOverridesOnMethodsRule.java:40)
at com.carrotsearch.randomizedtesting.rules.NoShadowingOrOverridesOnMethodsRule$1.evaluate(NoShadowingOrOverridesOnMethodsRule.java:40)
at com.carrotsearch.randomizedtesting.rules.StatementAdapter.evaluate(StatementAdapter.java:36)
at com.carrotsearch.randomizedtesting.rules.StatementAdapter.evaluate(StatementAdapter.java:36)
at com.carrotsearch.randomizedtesting.rules.StatementAdapter.evaluate(StatementAdapter.java:36)
at org.apache.lucene.util.TestRuleAssertionsRequired$1.evaluate(TestRuleAssertionsRequired.java:53)
at org.apache.lucene.util.TestRuleMarkFailure$1.evaluate(TestRuleMarkFailure.java:47)
at org.apache.lucene.util.TestRuleIgnoreAfterMaxFailures$1.evaluate(TestRuleIgnoreAfterMaxFailures.java:64)
at org.apache.lucene.util.TestRuleIgnoreTestSuites$1.evaluate(TestRuleIgnoreTestSuites.java:54)
at com.carrotsearch.randomizedtesting.rules.StatementAdapter.evaluate(StatementAdapter.java:36)
at com.carrotsearch.randomizedtesting.ThreadLeakControl$StatementRunner.run(ThreadLeakControl.java:368)
at java.lang.Thread.run(Thread.java:748)
Caused by: org.apache.zookeeper.KeeperException$SessionExpiredException: KeeperErrorCode = Session expired for /collections/test_col/state.json
at org.apache.zookeeper.KeeperException.create(KeeperException.java:127)
at org.apache.zookeeper.KeeperException.create(KeeperException.java:51)
at org.apache.zookeeper.ZooKeeper.getData(ZooKeeper.java:1212)
at org.apache.solr.common.cloud.SolrZkClient.lambda$getData$5(SolrZkClient.java:332)
at org.apache.solr.common.cloud.ZkCmdExecutor.retryOperation(ZkCmdExecutor.java:60)
at org.apache.solr.common.cloud.SolrZkClient.getData(SolrZkClient.java:332)
at org.apache.solr.common.cloud.ZkStateReader.fetchCollectionState(ZkStateReader.java:1184)
at org.apache.solr.common.cloud.ZkStateReader.getCollectionLive(ZkStateReader.java:1170)
... 47 more
FAILED: org.apache.solr.cloud.autoscaling.TriggerIntegrationTest.testNodeMarkersRegistration
Error Message:
Path /autoscaling/nodeAdded/127.0.0.1:58404_solr wasn't created
Stack Trace:
java.lang.AssertionError: Path /autoscaling/nodeAdded/127.0.0.1:58404_solr wasn't created
at __randomizedtesting.SeedInfo.seed([DA68999B03709396:C2D211970D455E79]:0)
at org.junit.Assert.fail(Assert.java:93)
at org.junit.Assert.assertTrue(Assert.java:43)
at org.apache.solr.cloud.autoscaling.TriggerIntegrationTest.testNodeMarkersRegistration(TriggerIntegrationTest.java:919)
at sun.reflect.NativeMethodAccessorImpl.invoke0(Native Method)
at sun.reflect.NativeMethodAccessorImpl.invoke(NativeMethodAccessorImpl.java:62)
at sun.reflect.DelegatingMethodAccessorImpl.invoke(DelegatingMethodAccessorImpl.java:43)
at java.lang.reflect.Method.invoke(Method.java:498)
at com.carrotsearch.randomizedtesting.RandomizedRunner.invoke(RandomizedRunner.java:1737)
at com.carrotsearch.randomizedtesting.RandomizedRunner$8.evaluate(RandomizedRunner.java:934)
at com.carrotsearch.randomizedtesting.RandomizedRunner$9.evaluate(RandomizedRunner.java:970)
at com.carrotsearch.randomizedtesting.RandomizedRunner$10.evaluate(RandomizedRunner.java:984)
at com.carrotsearch.randomizedtesting.rules.SystemPropertiesRestoreRule$1.evaluate(SystemPropertiesRestoreRule.java:57)
at org.apache.lucene.util.TestRuleSetupTeardownChained$1.evaluate(TestRuleSetupTeardownChained.java:49)
at org.apache.lucene.util.AbstractBeforeAfterRule$1.evaluate(AbstractBeforeAfterRule.java:45)
at org.apache.lucene.util.TestRuleThreadAndTestName$1.evaluate(TestRuleThreadAndTestName.java:48)
at org.apache.lucene.util.TestRuleIgnoreAfterMaxFailures$1.evaluate(TestRuleIgnoreAfterMaxFailures.java:64)
at org.apache.lucene.util.TestRuleMarkFailure$1.evaluate(TestRuleMarkFailure.java:47)
at com.carrotsearch.randomizedtesting.rules.StatementAdapter.evaluate(StatementAdapter.java:36)
at com.carrotsearch.randomizedtesting.ThreadLeakControl$StatementRunner.run(ThreadLeakControl.java:368)
at com.carrotsearch.randomizedtesting.ThreadLeakControl.forkTimeoutingTask(ThreadLeakControl.java:817)
at com.carrotsearch.randomizedtesting.ThreadLeakControl$3.evaluate(ThreadLeakControl.java:468)
at com.carrotsearch.randomizedtesting.RandomizedRunner.runSingleTest(RandomizedRunner.java:943)
at com.carrotsearch.randomizedtesting.RandomizedRunner$5.evaluate(RandomizedRunner.java:829)
at com.carrotsearch.randomizedtesting.RandomizedRunner$6.evaluate(RandomizedRunner.java:879)
at com.carrotsearch.randomizedtesting.RandomizedRunner$7.evaluate(RandomizedRunner.java:890)
at com.carrotsearch.randomizedtesting.rules.StatementAdapter.evaluate(StatementAdapter.java:36)
at com.carrotsearch.randomizedtesting.rules.SystemPropertiesRestoreRule$1.evaluate(SystemPropertiesRestoreRule.java:57)
at org.apache.lucene.util.AbstractBeforeAfterRule$1.evaluate(AbstractBeforeAfterRule.java:45)
at com.carrotsearch.randomizedtesting.rules.StatementAdapter.evaluate(StatementAdapter.java:36)
at org.apache.lucene.util.TestRuleStoreClassName$1.evaluate(TestRuleStoreClassName.java:41)
at com.carrotsearch.randomizedtesting.rules.NoShadowingOrOverridesOnMethodsRule$1.evaluate(NoShadowingOrOverridesOnMethodsRule.java:40)
at com.carrotsearch.randomizedtesting.rules.NoShadowingOrOverridesOnMethodsRule$1.evaluate(NoShadowingOrOverridesOnMethodsRule.java:40)
at com.carrotsearch.randomizedtesting.rules.StatementAdapter.evaluate(StatementAdapter.java:36)
at com.carrotsearch.randomizedtesting.rules.StatementAdapter.evaluate(StatementAdapter.java:36)
at com.carrotsearch.randomizedtesting.rules.StatementAdapter.evaluate(StatementAdapter.java:36)
at org.apache.lucene.util.TestRuleAssertionsRequired$1.evaluate(TestRuleAssertionsRequired.java:53)
at org.apache.lucene.util.TestRuleMarkFailure$1.evaluate(TestRuleMarkFailure.java:47)
at org.apache.lucene.util.TestRuleIgnoreAfterMaxFailures$1.evaluate(TestRuleIgnoreAfterMaxFailures.java:64)
at org.apache.lucene.util.TestRuleIgnoreTestSuites$1.evaluate(TestRuleIgnoreTestSuites.java:54)
at com.carrotsearch.randomizedtesting.rules.StatementAdapter.evaluate(StatementAdapter.java:36)
at com.carrotsearch.randomizedtesting.ThreadLeakControl$StatementRunner.run(ThreadLeakControl.java:368)
at java.lang.Thread.run(Thread.java:748)
FAILED: org.apache.solr.cloud.autoscaling.TriggerIntegrationTest.testSearchRate
Error Message:
Stack Trace:
java.lang.AssertionError
at __randomizedtesting.SeedInfo.seed([DA68999B03709396:87208712CCB635D9]:0)
at org.junit.Assert.fail(Assert.java:92)
at org.junit.Assert.assertTrue(Assert.java:43)
at org.junit.Assert.assertTrue(Assert.java:54)
at org.apache.solr.cloud.autoscaling.TriggerIntegrationTest.testSearchRate(TriggerIntegrationTest.java:1316)
at sun.reflect.NativeMethodAccessorImpl.invoke0(Native Method)
at sun.reflect.NativeMethodAccessorImpl.invoke(NativeMethodAccessorImpl.java:62)
at sun.reflect.DelegatingMethodAccessorImpl.invoke(DelegatingMethodAccessorImpl.java:43)
at java.lang.reflect.Method.invoke(Method.java:498)
at com.carrotsearch.randomizedtesting.RandomizedRunner.invoke(RandomizedRunner.java:1737)
at com.carrotsearch.randomizedtesting.RandomizedRunner$8.evaluate(RandomizedRunner.java:934)
at com.carrotsearch.randomizedtesting.RandomizedRunner$9.evaluate(RandomizedRunner.java:970)
at com.carrotsearch.randomizedtesting.RandomizedRunner$10.evaluate(RandomizedRunner.java:984)
at com.carrotsearch.randomizedtesting.rules.SystemPropertiesRestoreRule$1.evaluate(SystemPropertiesRestoreRule.java:57)
at org.apache.lucene.util.TestRuleSetupTeardownChained$1.evaluate(TestRuleSetupTeardownChained.java:49)
at org.apache.lucene.util.AbstractBeforeAfterRule$1.evaluate(AbstractBeforeAfterRule.java:45)
at org.apache.lucene.util.TestRuleThreadAndTestName$1.evaluate(TestRuleThreadAndTestName.java:48)
at org.apache.lucene.util.TestRuleIgnoreAfterMaxFailures$1.evaluate(TestRuleIgnoreAfterMaxFailures.java:64)
at org.apache.lucene.util.TestRuleMarkFailure$1.evaluate(TestRuleMarkFailure.java:47)
at com.carrotsearch.randomizedtesting.rules.StatementAdapter.evaluate(StatementAdapter.java:36)
at com.carrotsearch.randomizedtesting.ThreadLeakControl$StatementRunner.run(ThreadLeakControl.java:368)
at com.carrotsearch.randomizedtesting.ThreadLeakControl.forkTimeoutingTask(ThreadLeakControl.java:817)
at com.carrotsearch.randomizedtesting.ThreadLeakControl$3.evaluate(ThreadLeakControl.java:468)
at com.carrotsearch.randomizedtesting.RandomizedRunner.runSingleTest(RandomizedRunner.java:943)
at com.carrotsearch.randomizedtesting.RandomizedRunner$5.evaluate(RandomizedRunner.java:829)
at com.carrotsearch.randomizedtesting.RandomizedRunner$6.evaluate(RandomizedRunner.java:879)
at com.carrotsearch.randomizedtesting.RandomizedRunner$7.evaluate(RandomizedRunner.java:890)
at com.carrotsearch.randomizedtesting.rules.StatementAdapter.evaluate(StatementAdapter.java:36)
at com.carrotsearch.randomizedtesting.rules.SystemPropertiesRestoreRule$1.evaluate(SystemPropertiesRestoreRule.java:57)
at org.apache.lucene.util.AbstractBeforeAfterRule$1.evaluate(AbstractBeforeAfterRule.java:45)
at com.carrotsearch.randomizedtesting.rules.StatementAdapter.evaluate(StatementAdapter.java:36)
at org.apache.lucene.util.TestRuleStoreClassName$1.evaluate(TestRuleStoreClassName.java:41)
at com.carrotsearch.randomizedtesting.rules.NoShadowingOrOverridesOnMethodsRule$1.evaluate(NoShadowingOrOverridesOnMethodsRule.java:40)
at com.carrotsearch.randomizedtesting.rules.NoShadowingOrOverridesOnMethodsRule$1.evaluate(NoShadowingOrOverridesOnMethodsRule.java:40)
at com.carrotsearch.randomizedtesting.rules.StatementAdapter.evaluate(StatementAdapter.java:36)
at com.carrotsearch.randomizedtesting.rules.StatementAdapter.evaluate(StatementAdapter.java:36)
at com.carrotsearch.randomizedtesting.rules.StatementAdapter.evaluate(StatementAdapter.java:36)
at org.apache.lucene.util.TestRuleAssertionsRequired$1.evaluate(TestRuleAssertionsRequired.java:53)
at org.apache.lucene.util.TestRuleMarkFailure$1.evaluate(TestRuleMarkFailure.java:47)
at org.apache.lucene.util.TestRuleIgnoreAfterMaxFailures$1.evaluate(TestRuleIgnoreAfterMaxFailures.java:64)
at org.apache.lucene.util.TestRuleIgnoreTestSuites$1.evaluate(TestRuleIgnoreTestSuites.java:54)
at com.carrotsearch.randomizedtesting.rules.StatementAdapter.evaluate(StatementAdapter.java:36)
at com.carrotsearch.randomizedtesting.ThreadLeakControl$StatementRunner.run(ThreadLeakControl.java:368)
at java.lang.Thread.run(Thread.java:748)
FAILED: org.apache.solr.cloud.ChaosMonkeySafeLeaderWithPullReplicasTest.test
Error Message:
The Monkey ran for over 45 seconds and no jetties were stopped - this is worth investigating!
Stack Trace:
java.lang.AssertionError: The Monkey ran for over 45 seconds and no jetties were stopped - this is worth investigating!
at __randomizedtesting.SeedInfo.seed([DA68999B03709396:523CA641AD8CFE6E]:0)
at org.junit.Assert.fail(Assert.java:93)
at org.apache.solr.cloud.ChaosMonkey.stopTheMonkey(ChaosMonkey.java:587)
at org.apache.solr.cloud.ChaosMonkeySafeLeaderWithPullReplicasTest.test(ChaosMonkeySafeLeaderWithPullReplicasTest.java:174)
at sun.reflect.NativeMethodAccessorImpl.invoke0(Native Method)
at sun.reflect.NativeMethodAccessorImpl.invoke(NativeMethodAccessorImpl.java:62)
at sun.reflect.DelegatingMethodAccessorImpl.invoke(DelegatingMethodAccessorImpl.java:43)
at java.lang.reflect.Method.invoke(Method.java:498)
at com.carrotsearch.randomizedtesting.RandomizedRunner.invoke(RandomizedRunner.java:1737)
at com.carrotsearch.randomizedtesting.RandomizedRunner$8.evaluate(RandomizedRunner.java:934)
at com.carrotsearch.randomizedtesting.RandomizedRunner$9.evaluate(RandomizedRunner.java:970)
at com.carrotsearch.randomizedtesting.RandomizedRunner$10.evaluate(RandomizedRunner.java:984)
at org.apache.solr.BaseDistributedSearchTestCase$ShardsRepeatRule$ShardsFixedStatement.callStatement(BaseDistributedSearchTestCase.java:993)
at org.apache.solr.BaseDistributedSearchTestCase$ShardsRepeatRule$ShardsStatement.evaluate(BaseDistributedSearchTestCase.java:968)
at com.carrotsearch.randomizedtesting.rules.SystemPropertiesRestoreRule$1.evaluate(SystemPropertiesRestoreRule.java:57)
at org.apache.lucene.util.TestRuleSetupTeardownChained$1.evaluate(TestRuleSetupTeardownChained.java:49)
at org.apache.lucene.util.AbstractBeforeAfterRule$1.evaluate(AbstractBeforeAfterRule.java:45)
at org.apache.lucene.util.TestRuleThreadAndTestName$1.evaluate(TestRuleThreadAndTestName.java:48)
at org.apache.lucene.util.TestRuleIgnoreAfterMaxFailures$1.evaluate(TestRuleIgnoreAfterMaxFailures.java:64)
at org.apache.lucene.util.TestRuleMarkFailure$1.evaluate(TestRuleMarkFailure.java:47)
at com.carrotsearch.randomizedtesting.rules.StatementAdapter.evaluate(StatementAdapter.java:36)
at com.carrotsearch.randomizedtesting.ThreadLeakControl$StatementRunner.run(ThreadLeakControl.java:368)
at com.carrotsearch.randomizedtesting.ThreadLeakControl.forkTimeoutingTask(ThreadLeakControl.java:817)
at com.carrotsearch.randomizedtesting.ThreadLeakControl$3.evaluate(ThreadLeakControl.java:468)
at com.carrotsearch.randomizedtesting.RandomizedRunner.runSingleTest(RandomizedRunner.java:943)
at com.carrotsearch.randomizedtesting.RandomizedRunner$5.evaluate(RandomizedRunner.java:829)
at com.carrotsearch.randomizedtesting.RandomizedRunner$6.evaluate(RandomizedRunner.java:879)
at com.carrotsearch.randomizedtesting.RandomizedRunner$7.evaluate(RandomizedRunner.java:890)
at com.carrotsearch.randomizedtesting.rules.StatementAdapter.evaluate(StatementAdapter.java:36)
at com.carrotsearch.randomizedtesting.rules.SystemPropertiesRestoreRule$1.evaluate(SystemPropertiesRestoreRule.java:57)
at org.apache.lucene.util.AbstractBeforeAfterRule$1.evaluate(AbstractBeforeAfterRule.java:45)
at com.carrotsearch.randomizedtesting.rules.StatementAdapter.evaluate(StatementAdapter.java:36)
at org.apache.lucene.util.TestRuleStoreClassName$1.evaluate(TestRuleStoreClassName.java:41)
at com.carrotsearch.randomizedtesting.rules.NoShadowingOrOverridesOnMethodsRule$1.evaluate(NoShadowingOrOverridesOnMethodsRule.java:40)
at com.carrotsearch.randomizedtesting.rules.NoShadowingOrOverridesOnMethodsRule$1.evaluate(NoShadowingOrOverridesOnMethodsRule.java:40)
at com.carrotsearch.randomizedtesting.rules.StatementAdapter.evaluate(StatementAdapter.java:36)
at com.carrotsearch.randomizedtesting.rules.StatementAdapter.evaluate(StatementAdapter.java:36)
at com.carrotsearch.randomizedtesting.rules.StatementAdapter.evaluate(StatementAdapter.java:36)
at org.apache.lucene.util.TestRuleAssertionsRequired$1.evaluate(TestRuleAssertionsRequired.java:53)
at org.apache.lucene.util.TestRuleMarkFailure$1.evaluate(TestRuleMarkFailure.java:47)
at org.apache.lucene.util.TestRuleIgnoreAfterMaxFailures$1.evaluate(TestRuleIgnoreAfterMaxFailures.java:64)
at org.apache.lucene.util.TestRuleIgnoreTestSuites$1.evaluate(TestRuleIgnoreTestSuites.java:54)
at com.carrotsearch.randomizedtesting.rules.StatementAdapter.evaluate(StatementAdapter.java:36)
at com.carrotsearch.randomizedtesting.ThreadLeakControl$StatementRunner.run(ThreadLeakControl.java:368)
at java.lang.Thread.run(Thread.java:748)
FAILED: org.apache.solr.cloud.autoscaling.AutoScalingHandlerTest.testReadApi
Error Message:
expected:<1> but was:<0>
Stack Trace:
java.lang.AssertionError: expected:<1> but was:<0>
at __randomizedtesting.SeedInfo.seed([DA68999B03709396:8D41622ED882718D]:0)
at org.junit.Assert.fail(Assert.java:93)
at org.junit.Assert.failNotEquals(Assert.java:647)
at org.junit.Assert.assertEquals(Assert.java:128)
at org.junit.Assert.assertEquals(Assert.java:472)
at org.junit.Assert.assertEquals(Assert.java:456)
at org.apache.solr.cloud.autoscaling.AutoScalingHandlerTest.testReadApi(AutoScalingHandlerTest.java:709)
at sun.reflect.NativeMethodAccessorImpl.invoke0(Native Method)
at sun.reflect.NativeMethodAccessorImpl.invoke(NativeMethodAccessorImpl.java:62)
at sun.reflect.DelegatingMethodAccessorImpl.invoke(DelegatingMethodAccessorImpl.java:43)
at java.lang.reflect.Method.invoke(Method.java:498)
at com.carrotsearch.randomizedtesting.RandomizedRunner.invoke(RandomizedRunner.java:1737)
at com.carrotsearch.randomizedtesting.RandomizedRunner$8.evaluate(RandomizedRunner.java:934)
at com.carrotsearch.randomizedtesting.RandomizedRunner$9.evaluate(RandomizedRunner.java:970)
at com.carrotsearch.randomizedtesting.RandomizedRunner$10.evaluate(RandomizedRunner.java:984)
at com.carrotsearch.randomizedtesting.rules.SystemPropertiesRestoreRule$1.evaluate(SystemPropertiesRestoreRule.java:57)
at org.apache.lucene.util.TestRuleSetupTeardownChained$1.evaluate(TestRuleSetupTeardownChained.java:49)
at org.apache.lucene.util.AbstractBeforeAfterRule$1.evaluate(AbstractBeforeAfterRule.java:45)
at org.apache.lucene.util.TestRuleThreadAndTestName$1.evaluate(TestRuleThreadAndTestName.java:48)
at org.apache.lucene.util.TestRuleIgnoreAfterMaxFailures$1.evaluate(TestRuleIgnoreAfterMaxFailures.java:64)
at org.apache.lucene.util.TestRuleMarkFailure$1.evaluate(TestRuleMarkFailure.java:47)
at com.carrotsearch.randomizedtesting.rules.StatementAdapter.evaluate(StatementAdapter.java:36)
at com.carrotsearch.randomizedtesting.ThreadLeakControl$StatementRunner.run(ThreadLeakControl.java:368)
at com.carrotsearch.randomizedtesting.ThreadLeakControl.forkTimeoutingTask(ThreadLeakControl.java:817)
at com.carrotsearch.randomizedtesting.ThreadLeakControl$3.evaluate(ThreadLeakControl.java:468)
at com.carrotsearch.randomizedtesting.RandomizedRunner.runSingleTest(RandomizedRunner.java:943)
at com.carrotsearch.randomizedtesting.RandomizedRunner$5.evaluate(RandomizedRunner.java:829)
at com.carrotsearch.randomizedtesting.RandomizedRunner$6.evaluate(RandomizedRunner.java:879)
at com.carrotsearch.randomizedtesting.RandomizedRunner$7.evaluate(RandomizedRunner.java:890)
at com.carrotsearch.randomizedtesting.rules.StatementAdapter.evaluate(StatementAdapter.java:36)
at com.carrotsearch.randomizedtesting.rules.SystemPropertiesRestoreRule$1.evaluate(SystemPropertiesRestoreRule.java:57)
at org.apache.lucene.util.AbstractBeforeAfterRule$1.evaluate(AbstractBeforeAfterRule.java:45)
at com.carrotsearch.randomizedtesting.rules.StatementAdapter.evaluate(StatementAdapter.java:36)
at org.apache.lucene.util.TestRuleStoreClassName$1.evaluate(TestRuleStoreClassName.java:41)
at com.carrotsearch.randomizedtesting.rules.NoShadowingOrOverridesOnMethodsRule$1.evaluate(NoShadowingOrOverridesOnMethodsRule.java:40)
at com.carrotsearch.randomizedtesting.rules.NoShadowingOrOverridesOnMethodsRule$1.evaluate(NoShadowingOrOverridesOnMethodsRule.java:40)
at com.carrotsearch.randomizedtesting.rules.StatementAdapter.evaluate(StatementAdapter.java:36)
at com.carrotsearch.randomizedtesting.rules.StatementAdapter.evaluate(StatementAdapter.java:36)
at com.carrotsearch.randomizedtesting.rules.StatementAdapter.evaluate(StatementAdapter.java:36)
at org.apache.lucene.util.TestRuleAssertionsRequired$1.evaluate(TestRuleAssertionsRequired.java:53)
at org.apache.lucene.util.TestRuleMarkFailure$1.evaluate(TestRuleMarkFailure.java:47)
at org.apache.lucene.util.TestRuleIgnoreAfterMaxFailures$1.evaluate(TestRuleIgnoreAfterMaxFailures.java:64)
at org.apache.lucene.util.TestRuleIgnoreTestSuites$1.evaluate(TestRuleIgnoreTestSuites.java:54)
at com.carrotsearch.randomizedtesting.rules.StatementAdapter.evaluate(StatementAdapter.java:36)
at com.carrotsearch.randomizedtesting.ThreadLeakControl$StatementRunner.run(ThreadLeakControl.java:368)
at java.lang.Thread.run(Thread.java:748)
FAILED: org.apache.solr.update.CdcrUpdateLogTest.testSubReader
Error Message:
Stack Trace:
java.lang.AssertionError
at __randomizedtesting.SeedInfo.seed([DA68999B03709396:97B013F873A74244]:0)
at org.junit.Assert.fail(Assert.java:92)
at org.junit.Assert.assertTrue(Assert.java:43)
at org.junit.Assert.assertTrue(Assert.java:54)
at org.apache.solr.update.CdcrUpdateLogTest.testSubReader(CdcrUpdateLogTest.java:583)
at sun.reflect.NativeMethodAccessorImpl.invoke0(Native Method)
at sun.reflect.NativeMethodAccessorImpl.invoke(NativeMethodAccessorImpl.java:62)
at sun.reflect.DelegatingMethodAccessorImpl.invoke(DelegatingMethodAccessorImpl.java:43)
at java.lang.reflect.Method.invoke(Method.java:498)
at com.carrotsearch.randomizedtesting.RandomizedRunner.invoke(RandomizedRunner.java:1737)
at com.carrotsearch.randomizedtesting.RandomizedRunner$8.evaluate(RandomizedRunner.java:934)
at com.carrotsearch.randomizedtesting.RandomizedRunner$9.evaluate(RandomizedRunner.java:970)
at com.carrotsearch.randomizedtesting.RandomizedRunner$10.evaluate(RandomizedRunner.java:984)
at com.carrotsearch.randomizedtesting.rules.SystemPropertiesRestoreRule$1.evaluate(SystemPropertiesRestoreRule.java:57)
at org.apache.lucene.util.TestRuleSetupTeardownChained$1.evaluate(TestRuleSetupTeardownChained.java:49)
at org.apache.lucene.util.AbstractBeforeAfterRule$1.evaluate(AbstractBeforeAfterRule.java:45)
at org.apache.lucene.util.TestRuleThreadAndTestName$1.evaluate(TestRuleThreadAndTestName.java:48)
at org.apache.lucene.util.TestRuleIgnoreAfterMaxFailures$1.evaluate(TestRuleIgnoreAfterMaxFailures.java:64)
at org.apache.lucene.util.TestRuleMarkFailure$1.evaluate(TestRuleMarkFailure.java:47)
at com.carrotsearch.randomizedtesting.rules.StatementAdapter.evaluate(StatementAdapter.java:36)
at com.carrotsearch.randomizedtesting.ThreadLeakControl$StatementRunner.run(ThreadLeakControl.java:368)
at com.carrotsearch.randomizedtesting.ThreadLeakControl.forkTimeoutingTask(ThreadLeakControl.java:817)
at com.carrotsearch.randomizedtesting.ThreadLeakControl$3.evaluate(ThreadLeakControl.java:468)
at com.carrotsearch.randomizedtesting.RandomizedRunner.runSingleTest(RandomizedRunner.java:943)
at com.carrotsearch.randomizedtesting.RandomizedRunner$5.evaluate(RandomizedRunner.java:829)
at com.carrotsearch.randomizedtesting.RandomizedRunner$6.evaluate(RandomizedRunner.java:879)
at com.carrotsearch.randomizedtesting.RandomizedRunner$7.evaluate(RandomizedRunner.java:890)
at com.carrotsearch.randomizedtesting.rules.StatementAdapter.evaluate(StatementAdapter.java:36)
at com.carrotsearch.randomizedtesting.rules.SystemPropertiesRestoreRule$1.evaluate(SystemPropertiesRestoreRule.java:57)
at org.apache.lucene.util.AbstractBeforeAfterRule$1.evaluate(AbstractBeforeAfterRule.java:45)
at com.carrotsearch.randomizedtesting.rules.StatementAdapter.evaluate(StatementAdapter.java:36)
at org.apache.lucene.util.TestRuleStoreClassName$1.evaluate(TestRuleStoreClassName.java:41)
at com.carrotsearch.randomizedtesting.rules.NoShadowingOrOverridesOnMethodsRule$1.evaluate(NoShadowingOrOverridesOnMethodsRule.java:40)
at com.carrotsearch.randomizedtesting.rules.NoShadowingOrOverridesOnMethodsRule$1.evaluate(NoShadowingOrOverridesOnMethodsRule.java:40)
at com.carrotsearch.randomizedtesting.rules.StatementAdapter.evaluate(StatementAdapter.java:36)
at com.carrotsearch.randomizedtesting.rules.StatementAdapter.evaluate(StatementAdapter.java:36)
at com.carrotsearch.randomizedtesting.rules.StatementAdapter.evaluate(StatementAdapter.java:36)
at org.apache.lucene.util.TestRuleAssertionsRequired$1.evaluate(TestRuleAssertionsRequired.java:53)
at org.apache.lucene.util.TestRuleMarkFailure$1.evaluate(TestRuleMarkFailure.java:47)
at org.apache.lucene.util.TestRuleIgnoreAfterMaxFailures$1.evaluate(TestRuleIgnoreAfterMaxFailures.java:64)
at org.apache.lucene.util.TestRuleIgnoreTestSuites$1.evaluate(TestRuleIgnoreTestSuites.java:54)
at com.carrotsearch.randomizedtesting.rules.StatementAdapter.evaluate(StatementAdapter.java:36)
at com.carrotsearch.randomizedtesting.ThreadLeakControl$StatementRunner.run(ThreadLeakControl.java:368)
at java.lang.Thread.run(Thread.java:748)
Build Log:
[...truncated 12958 lines...]
[junit4] Suite: org.apache.solr.cloud.autoscaling.AutoScalingHandlerTest
[junit4] 2> 0 INFO (SUITE-AutoScalingHandlerTest-seed#[DA68999B03709396]-worker) [ ] o.a.s.SolrTestCaseJ4 SecureRandom sanity checks: test.solr.allowed.securerandom=null & java.security.egd=file:/dev/./urandom
[junit4] 2> Creating dataDir: /x1/jenkins/jenkins-slave/workspace/Lucene-Solr-NightlyTests-master/checkout/solr/build/solr-core/test/J1/temp/solr.cloud.autoscaling.AutoScalingHandlerTest_DA68999B03709396-001/init-core-data-001
[junit4] 2> 1682 INFO (SUITE-AutoScalingHandlerTest-seed#[DA68999B03709396]-worker) [ ] o.a.s.SolrTestCaseJ4 Using PointFields (NUMERIC_POINTS_SYSPROP=true) w/NUMERIC_DOCVALUES_SYSPROP=false
[junit4] 2> 2219 INFO (SUITE-AutoScalingHandlerTest-seed#[DA68999B03709396]-worker) [ ] o.e.j.u.log Logging initialized @25667ms
[junit4] 2> 2328 INFO (SUITE-AutoScalingHandlerTest-seed#[DA68999B03709396]-worker) [ ] o.a.s.SolrTestCaseJ4 Randomized ssl (false) and clientAuth (true) via: @org.apache.solr.util.RandomizeSSL(reason=, ssl=NaN, value=NaN, clientAuth=NaN)
[junit4] 2> 2479 INFO (SUITE-AutoScalingHandlerTest-seed#[DA68999B03709396]-worker) [ ] o.a.s.c.MiniSolrCloudCluster Starting cluster of 2 servers in /x1/jenkins/jenkins-slave/workspace/Lucene-Solr-NightlyTests-master/checkout/solr/build/solr-core/test/J1/temp/solr.cloud.autoscaling.AutoScalingHandlerTest_DA68999B03709396-001/tempDir-001
[junit4] 2> 2580 INFO (SUITE-AutoScalingHandlerTest-seed#[DA68999B03709396]-worker) [ ] o.a.s.c.ZkTestServer STARTING ZK TEST SERVER
[junit4] 2> 2615 INFO (Thread-1) [ ] o.a.s.c.ZkTestServer client port:0.0.0.0/0.0.0.0:0
[junit4] 2> 2616 INFO (Thread-1) [ ] o.a.s.c.ZkTestServer Starting server
[junit4] 2> 4167 INFO (SUITE-AutoScalingHandlerTest-seed#[DA68999B03709396]-worker) [ ] o.a.s.c.ZkTestServer start zk server on port:45970
[junit4] 2> 6586 WARN (NIOServerCxn.Factory:0.0.0.0/0.0.0.0:0) [ ] o.a.z.s.NIOServerCnxn Exception causing close of session 0x0 due to java.io.IOException: ZooKeeperServer not running
[junit4] 2> 7874 ERROR (Thread-1) [ ] o.a.z.s.ZooKeeperServer ZKShutdownHandler is not registered, so ZooKeeper server won't take any action on ERROR or SHUTDOWN server state changes
[junit4] 2> 9925 WARN (NIOServerCxn.Factory:0.0.0.0/0.0.0.0:0) [ ] o.a.z.s.NIOServerCnxn caught end of stream exception
[junit4] 2> EndOfStreamException: Unable to read additional data from client sessionid 0x15fc639446d0000, likely client has closed socket
[junit4] 2> at org.apache.zookeeper.server.NIOServerCnxn.doIO(NIOServerCnxn.java:239)
[junit4] 2> at org.apache.zookeeper.server.NIOServerCnxnFactory.run(NIOServerCnxnFactory.java:203)
[junit4] 2> at java.lang.Thread.run(Thread.java:748)
[junit4] 2> 14394 INFO (jetty-launcher-1-thread-1) [ ] o.e.j.s.Server jetty-9.3.20.v20170531
[junit4] 2> 14609 INFO (jetty-launcher-1-thread-2) [ ] o.e.j.s.Server jetty-9.3.20.v20170531
[junit4] 2> 15136 INFO (jetty-launcher-1-thread-1) [ ] o.e.j.s.h.ContextHandler Started o.e.j.s.ServletContextHandler@58cd9cf0{/solr,null,AVAILABLE}
[junit4] 2> 15318 INFO (jetty-launcher-1-thread-2) [ ] o.e.j.s.h.ContextHandler Started o.e.j.s.ServletContextHandler@28a06425{/solr,null,AVAILABLE}
[junit4] 2> 15514 INFO (jetty-launcher-1-thread-2) [ ] o.e.j.s.AbstractConnector Started ServerConnector@61ab63b7{HTTP/1.1,[http/1.1]}{127.0.0.1:47015}
[junit4] 2> 15515 INFO (jetty-launcher-1-thread-2) [ ] o.e.j.s.Server Started @38999ms
[junit4] 2> 15515 INFO (jetty-launcher-1-thread-1) [ ] o.e.j.s.AbstractConnector Started ServerConnector@5aad0bed{HTTP/1.1,[http/1.1]}{127.0.0.1:38858}
[junit4] 2> 15523 INFO (jetty-launcher-1-thread-1) [ ] o.e.j.s.Server Started @39007ms
[junit4] 2> 15523 INFO (jetty-launcher-1-thread-1) [ ] o.a.s.c.s.e.JettySolrRunner Jetty properties: {hostContext=/solr, hostPort=38858}
[junit4] 2> 15550 INFO (jetty-launcher-1-thread-2) [ ] o.a.s.c.s.e.JettySolrRunner Jetty properties: {hostContext=/solr, hostPort=47015}
[junit4] 2> 16070 ERROR (jetty-launcher-1-thread-2) [ ] o.a.s.u.StartupLoggingUtils Missing Java Option solr.log.dir. Logging may be missing or incomplete.
[junit4] 2> 16071 INFO (jetty-launcher-1-thread-2) [ ] o.a.s.s.SolrDispatchFilter ___ _ Welcome to Apache Solr™ version 8.0.0
[junit4] 2> 16090 INFO (jetty-launcher-1-thread-2) [ ] o.a.s.s.SolrDispatchFilter / __| ___| |_ _ Starting in cloud mode on port null
[junit4] 2> 16090 INFO (jetty-launcher-1-thread-2) [ ] o.a.s.s.SolrDispatchFilter \__ \/ _ \ | '_| Install dir: null
[junit4] 2> 16112 ERROR (jetty-launcher-1-thread-1) [ ] o.a.s.u.StartupLoggingUtils Missing Java Option solr.log.dir. Logging may be missing or incomplete.
[junit4] 2> 16113 INFO (jetty-launcher-1-thread-1) [ ] o.a.s.s.SolrDispatchFilter ___ _ Welcome to Apache Solr™ version 8.0.0
[junit4] 2> 16292 INFO (jetty-launcher-1-thread-1) [ ] o.a.s.s.SolrDispatchFilter / __| ___| |_ _ Starting in cloud mode on port null
[junit4] 2> 16292 INFO (jetty-launcher-1-thread-1) [ ] o.a.s.s.SolrDispatchFilter \__ \/ _ \ | '_| Install dir: null
[junit4] 2> 17744 INFO (jetty-launcher-1-thread-1) [ ] o.a.s.s.SolrDispatchFilter |___/\___/_|_| Start time: 2017-11-16T19:06:13.749Z
[junit4] 2> 17918 INFO (jetty-launcher-1-thread-2) [ ] o.a.s.s.SolrDispatchFilter |___/\___/_|_| Start time: 2017-11-16T19:06:13.548Z
[junit4] 2> 18002 INFO (jetty-launcher-1-thread-2) [ ] o.a.s.c.SolrResourceLoader solr home defaulted to 'solr/' (could not find system property or JNDI)
[junit4] 2> 18176 INFO (jetty-launcher-1-thread-2) [ ] o.a.s.s.SolrDispatchFilter solr.xml found in ZooKeeper. Loading...
[junit4] 2> 18236 INFO (jetty-launcher-1-thread-1) [ ] o.a.s.s.SolrDispatchFilter solr.xml found in ZooKeeper. Loading...
[junit4] 2> 25799 INFO (jetty-launcher-1-thread-2) [ ] o.a.s.c.ZkContainer Zookeeper client=127.0.0.1:45970/solr
[junit4] 2> 30068 INFO (jetty-launcher-1-thread-1) [ ] o.a.s.c.ZkContainer Zookeeper client=127.0.0.1:45970/solr
[junit4] 2> 30204 WARN (NIOServerCxn.Factory:0.0.0.0/0.0.0.0:0) [ ] o.a.z.s.NIOServerCnxn caught end of stream exception
[junit4] 2> EndOfStreamException: Unable to read additional data from client sessionid 0x15fc639446d0003, likely client has closed socket
[junit4] 2> at org.apache.zookeeper.server.NIOServerCnxn.doIO(NIOServerCnxn.java:239)
[junit4] 2> at org.apache.zookeeper.server.NIOServerCnxnFactory.run(NIOServerCnxnFactory.java:203)
[junit4] 2> at java.lang.Thread.run(Thread.java:748)
[junit4] 2> 34539 INFO (jetty-launcher-1-thread-1) [n:127.0.0.1:38858_solr ] o.a.s.c.Overseer Overseer (id=null) closing
[junit4] 2> 34541 INFO (jetty-launcher-1-thread-2) [n:127.0.0.1:47015_solr ] o.a.s.c.Overseer Overseer (id=null) closing
[junit4] 2> 34552 INFO (jetty-launcher-1-thread-1) [n:127.0.0.1:38858_solr ] o.a.s.c.OverseerElectionContext I am going to be the leader 127.0.0.1:38858_solr
[junit4] 2> 34607 INFO (jetty-launcher-1-thread-2) [n:127.0.0.1:47015_solr ] o.a.s.c.ZkController Register node as live in ZooKeeper:/live_nodes/127.0.0.1:47015_solr
[junit4] 2> 34673 INFO (jetty-launcher-1-thread-1) [n:127.0.0.1:38858_solr ] o.a.s.c.Overseer Overseer (id=99015666088869894-127.0.0.1:38858_solr-n_0000000000) starting
[junit4] 2> 35114 INFO (zkCallback-13-thread-1-processing-n:127.0.0.1:38858_solr) [n:127.0.0.1:38858_solr ] o.a.s.c.c.ZkStateReader Updated live nodes from ZooKeeper... (0) -> (1)
[junit4] 2> 35116 INFO (zkCallback-12-thread-1-processing-n:127.0.0.1:47015_solr) [n:127.0.0.1:47015_solr ] o.a.s.c.c.ZkStateReader Updated live nodes from ZooKeeper... (0) -> (1)
[junit4] 2> 38529 INFO (jetty-launcher-1-thread-1) [n:127.0.0.1:38858_solr ] o.a.s.c.ZkController Register node as live in ZooKeeper:/live_nodes/127.0.0.1:38858_solr
[junit4] 2> 38531 INFO (zkCallback-12-thread-1-processing-n:127.0.0.1:47015_solr) [n:127.0.0.1:47015_solr ] o.a.s.c.c.ZkStateReader Updated live nodes from ZooKeeper... (1) -> (2)
[junit4] 2> 38532 INFO (zkCallback-13-thread-1-processing-n:127.0.0.1:38858_solr) [n:127.0.0.1:38858_solr ] o.a.s.c.c.ZkStateReader Updated live nodes from ZooKeeper... (1) -> (2)
[junit4] 2> 43847 INFO (jetty-launcher-1-thread-1) [n:127.0.0.1:38858_solr ] o.a.s.m.r.SolrJmxReporter JMX monitoring for 'solr_38858.solr.node' (registry 'solr.node') enabled at server: com.sun.jmx.mbeanserver.JmxMBeanServer@223cab58
[junit4] 2> 43864 INFO (jetty-launcher-1-thread-1) [n:127.0.0.1:38858_solr ] o.a.s.m.r.SolrJmxReporter JMX monitoring for 'solr_38858.solr.jvm' (registry 'solr.jvm') enabled at server: com.sun.jmx.mbeanserver.JmxMBeanServer@223cab58
[junit4] 2> 43864 INFO (jetty-launcher-1-thread-1) [n:127.0.0.1:38858_solr ] o.a.s.m.r.SolrJmxReporter JMX monitoring for 'solr_38858.solr.jetty' (registry 'solr.jetty') enabled at server: com.sun.jmx.mbeanserver.JmxMBeanServer@223cab58
[junit4] 2> 43884 INFO (jetty-launcher-1-thread-2) [n:127.0.0.1:47015_solr ] o.a.s.m.r.SolrJmxReporter JMX monitoring for 'solr_47015.solr.node' (registry 'solr.node') enabled at server: com.sun.jmx.mbeanserver.JmxMBeanServer@223cab58
[junit4] 2> 44072 INFO (jetty-launcher-1-thread-2) [n:127.0.0.1:47015_solr ] o.a.s.m.r.SolrJmxReporter JMX monitoring for 'solr_47015.solr.jvm' (registry 'solr.jvm') enabled at server: com.sun.jmx.mbeanserver.JmxMBeanServer@223cab58
[junit4] 2> 44072 INFO (jetty-launcher-1-thread-2) [n:127.0.0.1:47015_solr ] o.a.s.m.r.SolrJmxReporter JMX monitoring for 'solr_47015.solr.jetty' (registry 'solr.jetty') enabled at server: com.sun.jmx.mbeanserver.JmxMBeanServer@223cab58
[junit4] 2> 44397 INFO (jetty-launcher-1-thread-1) [n:127.0.0.1:38858_solr ] o.a.s.c.CorePropertiesLocator Found 0 core definitions underneath /x1/jenkins/jenkins-slave/workspace/Lucene-Solr-NightlyTests-master/checkout/solr/build/solr-core/test/J1/temp/solr.cloud.autoscaling.AutoScalingHandlerTest_DA68999B03709396-001/tempDir-001/node1/.
[junit4] 2> 44633 INFO (jetty-launcher-1-thread-2) [n:127.0.0.1:47015_solr ] o.a.s.c.CorePropertiesLocator Found 0 core definitions underneath /x1/jenkins/jenkins-slave/workspace/Lucene-Solr-NightlyTests-master/checkout/solr/build/solr-core/test/J1/temp/solr.cloud.autoscaling.AutoScalingHandlerTest_DA68999B03709396-001/tempDir-001/node2/.
[junit4] 2> 49804 INFO (SUITE-AutoScalingHandlerTest-seed#[DA68999B03709396]-worker) [ ] o.a.s.c.c.ZkStateReader Updated live nodes from ZooKeeper... (0) -> (2)
[junit4] 2> 49930 INFO (SUITE-AutoScalingHandlerTest-seed#[DA68999B03709396]-worker) [ ] o.a.s.c.s.i.ZkClientClusterStateProvider Cluster at 127.0.0.1:45970/solr ready
[junit4] 2> 54158 INFO (TEST-AutoScalingHandlerTest.test-seed#[DA68999B03709396]) [ ] o.a.s.SolrTestCaseJ4 ###Starting test
[junit4] 2> 60226 INFO (qtp725406413-37) [n:127.0.0.1:38858_solr ] o.a.s.c.c.ZkStateReader Updated live nodes from ZooKeeper... (0) -> (2)
[junit4] 2> 60234 INFO (qtp725406413-37) [n:127.0.0.1:38858_solr ] o.a.s.c.s.i.ZkClientClusterStateProvider Cluster at 127.0.0.1:45970/solr ready
[junit4] 2> 60462 INFO (qtp1529367869-27) [n:127.0.0.1:47015_solr ] o.a.s.s.HttpSolrCall [admin] webapp=null path=/admin/metrics params={prefix=CORE.coreName&wt=javabin&version=2&group=solr.core} status=0 QTime=3
[junit4] 2> 61248 INFO (qtp725406413-34) [n:127.0.0.1:38858_solr ] o.a.s.s.HttpSolrCall [admin] webapp=null path=/admin/metrics params={prefix=CORE.coreName&wt=javabin&version=2&group=solr.core} status=0 QTime=0
[junit4] 2> 61355 WARN (NIOServerCxn.Factory:0.0.0.0/0.0.0.0:0) [ ] o.a.z.s.NIOServerCnxn caught end of stream exception
[junit4] 2> EndOfStreamException: Unable to read additional data from client sessionid 0x15fc639446d0009, likely client has closed socket
[junit4] 2> at org.apache.zookeeper.server.NIOServerCnxn.doIO(NIOServerCnxn.java:239)
[junit4] 2> at org.apache.zookeeper.server.NIOServerCnxnFactory.run(NIOServerCnxnFactory.java:203)
[junit4] 2> at java.lang.Thread.run(Thread.java:748)
[junit4] 2> 61375 INFO (qtp725406413-37) [n:127.0.0.1:38858_solr ] o.a.s.s.HttpSolrCall [admin] webapp=null path=/cluster/autoscaling params={wt=javabin&version=2} status=0 QTime=3133
[junit4] 2> 61577 INFO (qtp1529367869-25) [n:127.0.0.1:47015_solr ] o.a.s.c.c.ZkStateReader Updated live nodes from ZooKeeper... (0) -> (2)
[junit4] 2> 61595 INFO (qtp1529367869-25) [n:127.0.0.1:47015_solr ] o.a.s.c.s.i.ZkClientClusterStateProvider Cluster at 127.0.0.1:45970/solr ready
[junit4] 2> 61597 INFO (qtp1529367869-29) [n:127.0.0.1:47015_solr ] o.a.s.s.HttpSolrCall [admin] webapp=null path=/admin/metrics params={prefix=CORE.coreName&wt=javabin&version=2&group=solr.core} status=0 QTime=0
[junit4] 2> 61624 INFO (qtp725406413-39) [n:127.0.0.1:38858_solr ] o.a.s.s.HttpSolrCall [admin] webapp=null path=/admin/metrics params={prefix=CORE.coreName&wt=javabin&version=2&group=solr.core} status=0 QTime=0
[junit4] 2> 61648 INFO (qtp1529367869-25) [n:127.0.0.1:47015_solr ] o.a.s.s.HttpSolrCall [admin] webapp=null path=/admin/autoscaling params={wt=javabin&version=2} status=0 QTime=252
[junit4] 2> 61855 INFO (qtp725406413-38) [n:127.0.0.1:38858_solr ] o.a.s.c.c.ZkStateReader Updated live nodes from ZooKeeper... (0) -> (2)
[junit4] 2> 61857 INFO (qtp725406413-38) [n:127.0.0.1:38858_solr ] o.a.s.c.s.i.ZkClientClusterStateProvider Cluster at 127.0.0.1:45970/solr ready
[junit4] 2> 61937 INFO (qtp1529367869-28) [n:127.0.0.1:47015_solr ] o.a.s.s.HttpSolrCall [admin] webapp=null path=/admin/metrics params={prefix=CORE.coreName&wt=javabin&version=2&group=solr.core} status=0 QTime=0
[junit4] 2> 61947 INFO (qtp725406413-39) [n:127.0.0.1:38858_solr ] o.a.s.s.HttpSolrCall [admin] webapp=null path=/admin/metrics params={prefix=CORE.coreName&wt=javabin&version=2&group=solr.core} status=0 QTime=0
[junit4] 2> 62018 INFO (qtp725406413-38) [n:127.0.0.1:38858_solr ] o.a.s.s.HttpSolrCall [admin] webapp=null path=/cluster/autoscaling params={wt=javabin&version=2} status=0 QTime=360
[junit4] 2> 62037 ERROR (qtp1529367869-29) [n:127.0.0.1:47015_solr ] o.a.s.h.RequestHandlerBase org.apache.solr.api.ApiBag$ExceptionWithErrObject: Error in command payload, errors: [{remove-trigger={name=node_lost_trigger}, errorMessages=[Cannot remove trigger: node_lost_trigger because it has active listeners: [xyz, node_lost_trigger.system]]}],
[junit4] 2> at org.apache.solr.cloud.autoscaling.AutoScalingHandler.processOps(AutoScalingHandler.java:211)
[junit4] 2> at org.apache.solr.cloud.autoscaling.AutoScalingHandler.handleRequestBody(AutoScalingHandler.java:145)
[junit4] 2> at org.apache.solr.handler.RequestHandlerBase.handleRequest(RequestHandlerBase.java:177)
[junit4] 2> at org.apache.solr.servlet.HttpSolrCall.handleAdmin(HttpSolrCall.java:737)
[junit4] 2> at org.apache.solr.servlet.HttpSolrCall.handleAdminRequest(HttpSolrCall.java:718)
[junit4] 2> at org.apache.solr.servlet.HttpSolrCall.call(HttpSolrCall.java:499)
[junit4] 2> at org.apache.solr.servlet.SolrDispatchFilter.doFilter(SolrDispatchFilter.java:382)
[junit4] 2> at org.apache.solr.servlet.SolrDispatchFilter.doFilter(SolrDispatchFilter.java:326)
[junit4] 2> at org.eclipse.jetty.servlet.ServletHandler$CachedChain.doFilter(ServletHandler.java:1759)
[junit4] 2> at org.apache.solr.client.solrj.embedded.JettySolrRunner$DebugFilter.doFilter(JettySolrRunner.java:139)
[junit4] 2> at org.eclipse.jetty.servlet.ServletHandler$CachedChain.doFilter(ServletHandler.java:1759)
[junit4] 2> at org.eclipse.jetty.servlet.ServletHandler.doHandle(ServletHandler.java:582)
[junit4] 2> at org.eclipse.jetty.server.session.SessionHandler.doHandle(SessionHandler.java:224)
[junit4] 2> at org.eclipse.jetty.server.handler.ContextHandler.doHandle(ContextHandler.java:1180)
[junit4] 2> at org.eclipse.jetty.servlet.ServletHandler.doScope(ServletHandler.java:512)
[junit4] 2> at org.eclipse.jetty.server.session.SessionHandler.doScope(SessionHandler.java:185)
[junit4] 2> at org.eclipse.jetty.server.handler.ContextHandler.doScope(ContextHandler.java:1112)
[junit4] 2> at org.eclipse.jetty.server.handler.ScopedHandler.handle(ScopedHandler.java:141)
[junit4] 2> at org.eclipse.jetty.server.handler.gzip.GzipHandler.handle(GzipHandler.java:426)
[junit4] 2> at org.eclipse.jetty.server.handler.HandlerWrapper.handle(HandlerWrapper.java:134)
[junit4] 2> at org.eclipse.jetty.server.Server.handle(Server.java:534)
[junit4] 2> at org.eclipse.jetty.server.HttpChannel.handle(HttpChannel.java:320)
[junit4] 2> at org.eclipse.jetty.server.HttpConnection.onFillable(HttpConnection.java:251)
[junit4] 2> at org.eclipse.jetty.io.AbstractConnection$ReadCallback.succeeded(AbstractConnection.java:283)
[junit4] 2> at org.eclipse.jetty.io.FillInterest.fillable(FillInterest.java:108)
[junit4] 2> at org.eclipse.jetty.io.SelectChannelEndPoint$2.run(SelectChannelEndPoint.java:93)
[junit4] 2> at org.eclipse.jetty.util.thread.strategy.ExecuteProduceConsume.executeProduceConsume(ExecuteProduceConsume.java:303)
[junit4] 2> at org.eclipse.jetty.util.thread.strategy.ExecuteProduceConsume.produceConsume(ExecuteProduceConsume.java:148)
[junit4] 2> at org.eclipse.jetty.util.thread.strategy.ExecuteProduceConsume.run(ExecuteProduceConsume.java:136)
[junit4] 2> at org.eclipse.jetty.util.thread.QueuedThreadPool.runJob(QueuedThreadPool.java:671)
[junit4] 2> at org.eclipse.jetty.util.thread.QueuedThreadPool$2.run(QueuedThreadPool.java:589)
[junit4] 2> at java.lang.Thread.run(Thread.java:748)
[junit4] 2>
[junit4] 2> 62265 INFO (qtp1529367869-29) [n:127.0.0.1:47015_solr ] o.a.s.s.HttpSolrCall [admin] webapp=null path=/admin/autoscaling params={wt=javabin&version=2} status=400 QTime=229
[junit4] 2> 62956 INFO (qtp725406413-32) [n:127.0.0.1:38858_solr ] o.a.s.c.c.ZkStateReader Updated live nodes from ZooKeeper... (0) -> (2)
[junit4] 2> 62986 INFO (qtp725406413-32) [n:127.0.0.1:38858_solr ] o.a.s.c.s.i.ZkClientClusterStateProvider Cluster at 127.0.0.1:45970/solr ready
[junit4] 2> 63023 INFO (qtp1529367869-24) [n:127.0.0.1:47015_solr ] o.a.s.s.HttpSolrCall [admin] webapp=null path=/admin/metrics params={prefix=CORE.coreName&wt=javabin&version=2&group=solr.core} status=0 QTime=0
[junit4] 2> 63036 INFO (qtp725406413-39) [n:127.0.0.1:38858_solr ] o.a.s.s.HttpSolrCall [admin] webapp=null path=/admin/metrics params={prefix=CORE.coreName&wt=javabin&version=2&group=solr.core} status=0 QTime=10
[junit4] 2> 63221 INFO (qtp725406413-32) [n:127.0.0.1:38858_solr ] o.a.s.s.HttpSolrCall [admin] webapp=null path=/cluster/autoscaling params={wt=javabin&version=2} status=0 QTime=949
[junit4] 2> 63245 INFO (qtp1529367869-27) [n:127.0.0.1:47015_solr ] o.a.s.c.c.ZkStateReader Updated live nodes from ZooKeeper... (0) -> (2)
[junit4] 2> 63246 INFO (qtp1529367869-27) [n:127.0.0.1:47015_solr ] o.a.s.c.s.i.ZkClientClusterStateProvider Cluster at 127.0.0.1:45970/solr ready
[junit4] 2> 63260 INFO (qtp1529367869-31) [n:127.0.0.1:47015_solr ] o.a.s.s.HttpSolrCall [admin] webapp=null path=/admin/metrics params={prefix=CORE.coreName&wt=javabin&version=2&group=solr.core} status=0 QTime=0
[junit4] 2> 63295 INFO (qtp725406413-40) [n:127.0.0.1:38858_solr ] o.a.s.s.HttpSolrCall [admin] webapp=null path=/admin/metrics params={prefix=CORE.coreName&wt=javabin&version=2&group=solr.core} status=0 QTime=0
[junit4] 2> 63380 INFO (qtp1529367869-27) [n:127.0.0.1:47015_solr ] o.a.s.s.HttpSolrCall [admin] webapp=null path=/admin/autoscaling params={wt=javabin&version=2} status=0 QTime=155
[junit4] 2> 63391 ERROR (qtp725406413-37) [n:127.0.0.1:38858_solr ] o.a.s.h.RequestHandlerBase org.apache.solr.api.ApiBag$ExceptionWithErrObject: Error in command payload, errors: [{set-listener={name=xyz, trigger=node_lost_trigger, stage=[STARTED, ABORTED, SUCCEEDED], beforeAction=execute_plan, class=org.apache.solr.cloud.autoscaling.AutoScaling$HttpTriggerListener, url=http://xyz.com/on_node_lost?node={$LOST_NODE_NAME}}, errorMessages=[A trigger with the name node_lost_trigger does not exist]}],
[junit4] 2> at org.apache.solr.cloud.autoscaling.AutoScalingHandler.processOps(AutoScalingHandler.java:211)
[junit4] 2> at org.apache.solr.cloud.autoscaling.AutoScalingHandler.handleRequestBody(AutoScalingHandler.java:145)
[junit4] 2> at org.apache.solr.handler.RequestHandlerBase.handleRequest(RequestHandlerBase.java:177)
[junit4] 2> at org.apache.solr.api.ApiBag$ReqHandlerToApi.call(ApiBag.java:242)
[junit4] 2> at org.apache.solr.api.V2HttpCall.handleAdmin(V2HttpCall.java:311)
[junit4] 2> at org.apache.solr.servlet.HttpSolrCall.handleAdminRequest(HttpSolrCall.java:718)
[junit4] 2> at org.apache.solr.servlet.HttpSolrCall.call(HttpSolrCall.java:499)
[junit4] 2> at org.apache.solr.servlet.SolrDispatchFilter.doFilter(SolrDispatchFilter.java:382)
[junit4] 2> at org.apache.solr.servlet.SolrDispatchFilter.doFilter(SolrDispatchFilter.java:326)
[junit4] 2> at org.eclipse.jetty.servlet.ServletHandler$CachedChain.doFilter(ServletHandler.java:1759)
[junit4] 2> at org.apache.solr.client.solrj.embedded.JettySolrRunner$DebugFilter.doFilter(JettySolrRunner.java:139)
[junit4] 2> at org.eclipse.jetty.servlet.ServletHandler$CachedChain.doFilter(ServletHandler.java:1759)
[junit4] 2> at org.eclipse.jetty.servlet.ServletHandler.doHandle(ServletHandler.java:582)
[junit4] 2> at org.eclipse.jetty.server.session.SessionHandler.doHandle(SessionHandler.java:224)
[junit4] 2> at org.eclipse.jetty.server.handler.ContextHandler.doHandle(ContextHandler.java:1180)
[junit4] 2> at org.eclipse.jetty.servlet.ServletHandler.doScope(ServletHandler.java:512)
[junit4] 2> at org.eclipse.jetty.server.session.SessionHandler.doScope(SessionHandler.java:185)
[junit4] 2> at org.eclipse.jetty.server.handler.ContextHandler.doScope(ContextHandler.java:1112)
[junit4] 2> at org.eclipse.jetty.server.handler.ScopedHandler.handle(ScopedHandler.java:141)
[junit4] 2> at org.eclipse.jetty.server.handler.gzip.GzipHandler.handle(GzipHandler.java:426)
[junit4] 2> at org.eclipse.jetty.server.handler.HandlerWrapper.handle(HandlerWrapper.java:134)
[junit4] 2> at org.eclipse.jetty.server.Server.handle(Server.java:534)
[junit4] 2> at org.eclipse.jetty.server.HttpChannel.handle(HttpChannel.java:320)
[junit4] 2> at org.eclipse.jetty.server.HttpConnection.onFillable(HttpConnection.java:251)
[junit4] 2> at org.eclipse.jetty.io.AbstractConnection$ReadCallback.succeeded(AbstractConnection.java:283)
[junit4] 2> at org.eclipse.jetty.io.FillInterest.fillable(FillInterest.java:108)
[junit4] 2> at org.eclipse.jetty.io.SelectChannelEndPoint$2.run(SelectChannelEndPoint.java:93)
[junit4] 2> at org.eclipse.jetty.util.thread.strategy.ExecuteProduceConsume.executeProduceConsume(ExecuteProduceConsume.java:303)
[junit4] 2> at org.eclipse.jetty.util.thread.strategy.ExecuteProduceConsume.produceConsume(ExecuteProduceConsume.java:148)
[junit4] 2> at org.eclipse.jetty.util.thread.strategy.ExecuteProduceConsume.run(ExecuteProduceConsume.java:136)
[junit4] 2> at org.eclipse.jetty.util.thread.QueuedThreadPool.runJob(QueuedThreadPool.java:671)
[junit4] 2> at org.eclipse.jetty.util.thread.QueuedThreadPool$2.run(QueuedThreadPool.java:589)
[junit4] 2> at java.lang.Thread.run(Thread.java:748)
[junit4] 2>
[junit4] 2> 63392 INFO (qtp725406413-37) [n:127.0.0.1:38858_solr ] o.a.s.s.HttpSolrCall [admin] webapp=null path=/cluster/autoscaling params={wt=javabin&version=2} status=400 QTime=9
[junit4] 2> 63412 INFO (TEST-AutoScalingHandlerTest.test-seed#[DA68999B03709396]) [ ] o.a.s.SolrTestCaseJ4 ###Ending test
[junit4] 2> 65265 INFO (TEST-AutoScalingHandlerTest.testDeleteUsedPolicy-seed#[DA68999B03709396]) [ ] o.a.s.SolrTestCaseJ4 ###Starting testDeleteUsedPolicy
[junit4] 2> 65892 INFO (qtp1529367869-31) [n:127.0.0.1:47015_solr ] o.a.s.c.c.ZkStateReader Updated live nodes from ZooKeeper... (0) -> (2)
[junit4] 2> 65911 INFO (qtp1529367869-31) [n:127.0.0.1:47015_solr ] o.a.s.c.s.i.ZkClientClusterStateProvider Cluster at 127.0.0.1:45970/solr ready
[junit4] 2> 65913 INFO (qtp1529367869-28) [n:127.0.0.1:47015_solr ] o.a.s.s.HttpSolrCall [admin] webapp=null path=/admin/metrics params={prefix=CORE.coreName&wt=javabin&version=2&group=solr.core} status=0 QTime=0
[junit4] 2> 65956 INFO (qtp725406413-40) [n:127.0.0.1:38858_solr ] o.a.s.s.HttpSolrCall [admin] webapp=null path=/admin/metrics params={prefix=CORE.coreName&wt=javabin&version=2&group=solr.core} status=0 QTime=0
[junit4] 2> 66017 INFO (qtp1529367869-31) [n:127.0.0.1:47015_solr ] o.a.s.s.HttpSolrCall [admin] webapp=null path=/cluster/autoscaling params={wt=javabin&version=2} status=0 QTime=573
[junit4] 2> 66051 INFO (qtp1529367869-28) [n:127.0.0.1:47015_solr ] o.a.s.h.a.CollectionsHandler Invoked Collection Action :create with params replicationFactor=1&collection.configName=conf&name=COLL1&nrtReplicas=1&action=CREATE&numShards=1&wt=javabin&version=2&policy=nodelete and sendToOCPQueue=true
[junit4] 2> 68305 INFO (OverseerThreadFactory-12-thread-1-processing-n:127.0.0.1:38858_solr) [n:127.0.0.1:38858_solr ] o.a.s.c.CreateCollectionCmd Create collection COLL1
[junit4] 2> 68503 INFO (qtp1529367869-30) [n:127.0.0.1:47015_solr ] o.a.s.s.HttpSolrCall [admin] webapp=null path=/admin/metrics params={prefix=CORE.coreName&wt=javabin&version=2&group=solr.core} status=0 QTime=0
[junit4] 2> 68714 INFO (qtp725406413-40) [n:127.0.0.1:38858_solr ] o.a.s.s.HttpSolrCall [admin] webapp=null path=/admin/metrics params={prefix=CORE.coreName&wt=javabin&version=2&group=solr.core} status=0 QTime=0
[junit4] 2> 69347 INFO (OverseerStateUpdate-99015666088869894-127.0.0.1:38858_solr-n_0000000000) [n:127.0.0.1:38858_solr ] o.a.s.c.o.SliceMutator createReplica() {
[junit4] 2> "operation":"ADDREPLICA",
[junit4] 2> "collection":"COLL1",
[junit4] 2> "shard":"shard1",
[junit4] 2> "core":"COLL1_shard1_replica_n1",
[junit4] 2> "state":"down",
[junit4] 2> "base_url":"http://127.0.0.1:38858/solr",
[junit4] 2> "type":"NRT",
[junit4] 2> "waitForFinalState":"false"}
[junit4] 2> 70417 INFO (qtp725406413-34) [n:127.0.0.1:38858_solr ] o.a.s.h.a.CoreAdminOperation core create command qt=/admin/cores&coreNodeName=core_node2&collection.configName=conf&newCollection=true&name=COLL1_shard1_replica_n1&action=CREATE&numShards=1&collection=COLL1&shard=shard1&wt=javabin&version=2&replicaType=NRT
[junit4] 2> 70428 INFO (qtp725406413-34) [n:127.0.0.1:38858_solr ] o.a.s.c.TransientSolrCoreCacheDefault Allocating transient cache for 2147483647 transient cores
[junit4] 2> 72589 INFO (qtp725406413-34) [n:127.0.0.1:38858_solr c:COLL1 s:shard1 r:core_node2 x:COLL1_shard1_replica_n1] o.a.s.c.SolrConfig Using Lucene MatchVersion: 8.0.0
[junit4] 2> 73281 INFO (qtp725406413-34) [n:127.0.0.1:38858_solr c:COLL1 s:shard1 r:core_node2 x:COLL1_shard1_replica_n1] o.a.s.s.IndexSchema [COLL1_shard1_replica_n1] Schema name=minimal
[junit4] 2> 73826 INFO (qtp725406413-34) [n:127.0.0.1:38858_solr c:COLL1 s:shard1 r:core_node2 x:COLL1_shard1_replica_n1] o.a.s.s.IndexSchema Loaded schema minimal/1.1 with uniqueid field id
[junit4] 2> 73826 INFO (qtp725406413-34) [n:127.0.0.1:38858_solr c:COLL1 s:shard1 r:core_node2 x:COLL1_shard1_r
[...truncated too long message...]
re.SolrCore@7ede95b9
[junit4] 2> 7225679 INFO (zkCallback-3046-thread-1-processing-n:127.0.0.1:58400_) [n:127.0.0.1:58400_ c:unloadcollection s:shard1 r:core_node5 x:unloadcollection_shard1_replica4] o.a.s.m.SolrMetricManager Closing metric reporters for registry=solr.core.unloadcollection.shard1.replica4, tag=2128516537
[junit4] 2> 7225679 INFO (zkCallback-3046-thread-1-processing-n:127.0.0.1:58400_) [n:127.0.0.1:58400_ c:unloadcollection s:shard1 r:core_node5 x:unloadcollection_shard1_replica4] o.a.s.m.r.SolrJmxReporter Closing reporter [org.apache.solr.metrics.reporters.SolrJmxReporter@5b251ec: rootName = null, domain = solr.core.unloadcollection.shard1.replica4, service url = null, agent id = null] for registry solr.core.unloadcollection.shard1.replica4 / com.codahale.metrics.MetricRegistry@6113bcf6
[junit4] 2> 7225705 INFO (zkCallback-3046-thread-1-processing-n:127.0.0.1:58400_) [n:127.0.0.1:58400_ c:unloadcollection s:shard1 r:core_node5 x:unloadcollection_shard1_replica4] o.a.s.m.SolrMetricManager Closing metric reporters for registry=solr.collection.unloadcollection.shard1.leader, tag=2128516537
[junit4] 2> 7225754 INFO (TEST-UnloadDistributedZkTest.test-seed#[DA68999B03709396]) [ ] o.e.j.s.AbstractConnector Stopped ServerConnector@55667ae6{HTTP/1.1,[http/1.1]}{127.0.0.1:0}
[junit4] 2> 7225754 INFO (TEST-UnloadDistributedZkTest.test-seed#[DA68999B03709396]) [ ] o.e.j.s.h.ContextHandler Stopped o.e.j.s.ServletContextHandler@4ae9be2c{/,null,UNAVAILABLE}
[junit4] 2> 7225762 ERROR (TEST-UnloadDistributedZkTest.test-seed#[DA68999B03709396]) [ ] o.a.z.s.ZooKeeperServer ZKShutdownHandler is not registered, so ZooKeeper server won't take any action on ERROR or SHUTDOWN server state changes
[junit4] 2> 7225771 INFO (TEST-UnloadDistributedZkTest.test-seed#[DA68999B03709396]) [ ] o.a.s.c.ZkTestServer connecting to 127.0.0.1:49695 49695
[junit4] 2> 7225954 INFO (Thread-3614) [ ] o.a.s.c.ZkTestServer connecting to 127.0.0.1:49695 49695
[junit4] 2> 7225956 WARN (Thread-3614) [ ] o.a.s.c.ZkTestServer Watch limit violations:
[junit4] 2> Maximum concurrent create/delete watches above limit:
[junit4] 2>
[junit4] 2> 10 /solr/aliases.json
[junit4] 2> 5 /solr/security.json
[junit4] 2> 5 /solr/configs/conf1
[junit4] 2> 4 /solr/collections/collection1/state.json
[junit4] 2>
[junit4] 2> Maximum concurrent data watches above limit:
[junit4] 2>
[junit4] 2> 10 /solr/clusterprops.json
[junit4] 2> 10 /solr/clusterstate.json
[junit4] 2> 5 /solr/autoscaling.json
[junit4] 2> 3 /solr/collections/unloadcollection/state.json
[junit4] 2>
[junit4] 2> Maximum concurrent children watches above limit:
[junit4] 2>
[junit4] 2> 10 /solr/live_nodes
[junit4] 2> 10 /solr/collections
[junit4] 2> 5 /solr/overseer/queue
[junit4] 2> 5 /solr/autoscaling/events/.auto_add_replicas
[junit4] 2> 5 /solr/overseer/queue-work
[junit4] 2> 5 /solr/overseer/collection-queue-work
[junit4] 2>
[junit4] 2> NOTE: download the large Jenkins line-docs file by running 'ant get-jenkins-line-docs' in the lucene directory.
[junit4] 2> NOTE: reproduce with: ant test -Dtestcase=UnloadDistributedZkTest -Dtests.method=test -Dtests.seed=DA68999B03709396 -Dtests.multiplier=2 -Dtests.nightly=true -Dtests.slow=true -Dtests.linedocsfile=/home/jenkins/jenkins-slave/workspace/Lucene-Solr-NightlyTests-master/test-data/enwiki.random.lines.txt -Dtests.locale=hr -Dtests.timezone=Pacific/Marquesas -Dtests.asserts=true -Dtests.file.encoding=UTF-8
[junit4] ERROR 68.9s J2 | UnloadDistributedZkTest.test <<<
[junit4] > Throwable #1: org.apache.solr.common.SolrException: Could not load collection from ZK: unloadcollection
[junit4] > at __randomizedtesting.SeedInfo.seed([DA68999B03709396:523CA641AD8CFE6E]:0)
[junit4] > at org.apache.solr.common.cloud.ZkStateReader.getCollectionLive(ZkStateReader.java:1172)
[junit4] > at org.apache.solr.common.cloud.ZkStateReader$LazyCollectionRef.get(ZkStateReader.java:692)
[junit4] > at org.apache.solr.common.cloud.ClusterState.getCollectionOrNull(ClusterState.java:130)
[junit4] > at org.apache.solr.cloud.AbstractDistribZkTestBase.waitForRecoveriesToFinish(AbstractDistribZkTestBase.java:154)
[junit4] > at org.apache.solr.cloud.AbstractDistribZkTestBase.waitForRecoveriesToFinish(AbstractDistribZkTestBase.java:140)
[junit4] > at org.apache.solr.cloud.AbstractDistribZkTestBase.waitForRecoveriesToFinish(AbstractDistribZkTestBase.java:135)
[junit4] > at org.apache.solr.cloud.UnloadDistributedZkTest.testCoreUnloadAndLeaders(UnloadDistributedZkTest.java:277)
[junit4] > at org.apache.solr.cloud.UnloadDistributedZkTest.test(UnloadDistributedZkTest.java:68)
[junit4] > at org.apache.solr.BaseDistributedSearchTestCase$ShardsRepeatRule$ShardsFixedStatement.callStatement(BaseDistributedSearchTestCase.java:993)
[junit4] > at org.apache.solr.BaseDistributedSearchTestCase$ShardsRepeatRule$ShardsStatement.evaluate(BaseDistributedSearchTestCase.java:968)
[junit4] > at java.lang.Thread.run(Thread.java:748)
[junit4] > Caused by: org.apache.zookeeper.KeeperException$SessionExpiredException: KeeperErrorCode = Session expired for /collections/unloadcollection/state.json
[junit4] > at org.apache.zookeeper.KeeperException.create(KeeperException.java:127)
[junit4] > at org.apache.zookeeper.KeeperException.create(KeeperException.java:51)
[junit4] > at org.apache.zookeeper.ZooKeeper.getData(ZooKeeper.java:1212)
[junit4] > at org.apache.solr.common.cloud.SolrZkClient.lambda$getData$5(SolrZkClient.java:332)
[junit4] > at org.apache.solr.common.cloud.ZkCmdExecutor.retryOperation(ZkCmdExecutor.java:60)
[junit4] > at org.apache.solr.common.cloud.SolrZkClient.getData(SolrZkClient.java:332)
[junit4] > at org.apache.solr.common.cloud.ZkStateReader.fetchCollectionState(ZkStateReader.java:1184)
[junit4] > at org.apache.solr.common.cloud.ZkStateReader.getCollectionLive(ZkStateReader.java:1170)
[junit4] > ... 48 more
[junit4] 2> NOTE: leaving temporary files on disk at: /x1/jenkins/jenkins-slave/workspace/Lucene-Solr-NightlyTests-master/checkout/solr/build/solr-core/test/J2/temp/solr.cloud.UnloadDistributedZkTest_DA68999B03709396-001
[junit4] 2> Nov 16, 2017 9:06:16 PM com.carrotsearch.randomizedtesting.ThreadLeakControl checkThreadLeaks
[junit4] 2> WARNING: Will linger awaiting termination of 1 leaked thread(s).
[junit4] 2> NOTE: test params are: codec=Asserting(Lucene70): {multiDefault=PostingsFormat(name=Memory), a_t=PostingsFormat(name=Memory), id=TestBloomFilteredLucenePostings(BloomFilteringPostingsFormat(Lucene50(blocksize=128))), text=Lucene50(blocksize=128)}, docValues:{other_tl1=DocValuesFormat(name=Asserting), range_facet_l_dv=DocValuesFormat(name=Memory), _version_=DocValuesFormat(name=Asserting), intDefault=DocValuesFormat(name=Asserting), id_i1=DocValuesFormat(name=Asserting), a_i1=DocValuesFormat(name=Direct), range_facet_i_dv=DocValuesFormat(name=Direct), intDvoDefault=DocValuesFormat(name=Memory), range_facet_l=DocValuesFormat(name=Direct), timestamp=DocValuesFormat(name=Direct)}, maxPointsInLeafNode=1769, maxMBSortInHeap=6.919083003231615, sim=Asserting(org.apache.lucene.search.similarities.AssertingSimilarity@47f8e9fd), locale=hr, timezone=Pacific/Marquesas
[junit4] 2> NOTE: Linux 3.13.0-88-generic amd64/Oracle Corporation 1.8.0_144 (64-bit)/cpus=4,threads=1,free=174957608,total=526909440
[junit4] 2> NOTE: All tests run in this JVM: [HttpPartitionTest, TestSolrCoreProperties, DistribJoinFromCollectionTest, BitVectorTest, RecoveryZkTest, EchoParamsTest, DistributedSuggestComponentTest, TestPrepRecovery, BasicDistributedZk2Test, TestMultiValuedNumericRangeQuery, SpellPossibilityIteratorTest, XsltUpdateRequestHandlerTest, TriggerIntegrationTest, TestFieldCacheWithThreads, SolrCLIZkUtilsTest, TestSearchPerf, TestDeleteCollectionOnDownNodes, TestCollectionAPI, DateRangeFieldTest, TestQueryTypes, ManagedSchemaRoundRobinCloudTest, MetricsConfigTest, TestNumericTerms64, CoreSorterTest, SolrMetricReporterTest, TestFieldTypeCollectionResource, TestSolr4Spatial2, TestPartialUpdateDeduplication, ParsingFieldUpdateProcessorsTest, TestXmlQParser, TestReplicaProperties, CdcrBootstrapTest, OverseerRolesTest, SolrCoreCheckLockOnStartupTest, TestPKIAuthenticationPlugin, ShardSplitTest, DeleteNodeTest, TestNonDefinedSimilarityFactory, DirectSolrConnectionTest, SolrSlf4jReporterTest, DisMaxRequestHandlerTest, ZkNodePropsTest, TestCSVResponseWriter, SolrGraphiteReporterTest, SimpleMLTQParserTest, TestTolerantSearch, RegexBytesRefFilterTest, SystemInfoHandlerTest, UUIDFieldTest, RuleEngineTest, TestHighFrequencyDictionaryFactory, FieldMutatingUpdateProcessorTest, ReplaceNodeTest, TestPushWriter, TestQuerySenderListener, TestLeaderElectionZkExpiry, LeaderFailureAfterFreshStartTest, RequiredFieldsTest, DocValuesNotIndexedTest, TestExpandComponent, TestSolrDeletionPolicy2, MetricUtilsTest, FullSolrCloudDistribCmdsTest, TestElisionMultitermQuery, TestIntervalFaceting, QueryElevationComponentTest, PeerSyncWithIndexFingerprintCachingTest, TestSolrCLIRunExample, ConfigSetsAPITest, TestConfigReload, LeaderElectionTest, CdcrRequestHandlerTest, UUIDUpdateProcessorFallbackTest, TestAuthenticationFramework, SolrTestCaseJ4Test, TestDistributedMissingSort, TestLRUCache, HdfsThreadLeakTest, TestPointFields, AutoAddReplicasIntegrationTest, DistanceFunctionTest, MergeStrategyTest, TestCoreDiscovery, IndexBasedSpellCheckerTest, TestEmbeddedSolrServerConstructors, RollingRestartTest, LoggingHandlerTest, SearchRateTriggerTest, TestDefaultStatsCache, CoreMergeIndexesAdminHandlerTest, UnloadDistributedZkTest]
[junit4] Completed [710/749 (8!)] on J2 in 69.80s, 1 test, 1 error <<< FAILURES!
[...truncated 47352 lines...]