You are viewing a plain text version of this content. The canonical link for it is here.
Posted to notifications@maven.apache.org by Apache Jenkins Server <je...@builds.apache.org> on 2014/12/10 09:48:35 UTC
Build failed in Jenkins: maven-plugins-ITs-m2 #1848
See <https://builds.apache.org/job/maven-plugins-ITs-m2/1848/>
------------------------------------------
[...truncated 28707 lines...]
[INFO] [compiler:compile {execution: default-compile}]
[INFO] Changes detected - recompiling the module!
[INFO] Compiling 9 source files to <https://builds.apache.org/job/maven-plugins-ITs-m2/ws/maven-gpg-plugin/target/classes>
[WARNING] Note: Some input files use unchecked or unsafe operations.
[WARNING] Note: Recompile with -Xlint:unchecked for details.
[INFO] [plugin:descriptor {execution: mojo-descriptor}]
[INFO] Using 'UTF-8' encoding to read mojo metadata.
[INFO] Applying mojo extractor for language: java-annotations
[INFO] Mojo extractor for language: java-annotations found 3 mojo descriptors.
[INFO] Applying mojo extractor for language: java
[INFO] Mojo extractor for language: java found 0 mojo descriptors.
[INFO] Applying mojo extractor for language: bsh
[INFO] Mojo extractor for language: bsh found 0 mojo descriptors.
[INFO] [resources:testResources {execution: default-testResources}]
[INFO] Using 'UTF-8' encoding to copy filtered resources.
[INFO] Copying 8 resources
[INFO] Copying 3 resources
[INFO] [compiler:testCompile {execution: default-testCompile}]
[INFO] No sources to compile
[INFO] [surefire:test {execution: default-test}]
[INFO] [jar:jar {execution: default-jar}]
[INFO] Building jar: <https://builds.apache.org/job/maven-plugins-ITs-m2/ws/maven-gpg-plugin/target/maven-gpg-plugin-1.6-SNAPSHOT.jar>
[INFO] [plugin:addPluginArtifactMetadata {execution: default-addPluginArtifactMetadata}]
[INFO] [invoker:install {execution: integration-test}]
[INFO] Installing <https://builds.apache.org/job/maven-plugins-ITs-m2/ws/maven-plugins/pom.xml> to <https://builds.apache.org/job/maven-plugins-ITs-m2/ws/maven-gpg-plugin/target/local-repo/org/apache/maven/plugins/maven-plugins/28-SNAPSHOT/maven-plugins-28-SNAPSHOT.pom>
[INFO] Installing <https://builds.apache.org/job/maven-plugins-ITs-m2/ws/maven-plugins/target/maven-plugins-28-SNAPSHOT-site.xml> to <https://builds.apache.org/job/maven-plugins-ITs-m2/ws/maven-gpg-plugin/target/local-repo/org/apache/maven/plugins/maven-plugins/28-SNAPSHOT/maven-plugins-28-SNAPSHOT-site.xml>
[INFO] Installing <https://builds.apache.org/job/maven-plugins-ITs-m2/ws/maven-checkstyle-plugin/pom.xml> to <https://builds.apache.org/job/maven-plugins-ITs-m2/ws/maven-gpg-plugin/target/local-repo/org/apache/maven/plugins/maven-checkstyle-plugin/2.14-SNAPSHOT/maven-checkstyle-plugin-2.14-SNAPSHOT.pom>
[INFO] Installing <https://builds.apache.org/job/maven-plugins-ITs-m2/ws/maven-checkstyle-plugin/target/maven-checkstyle-plugin-2.14-SNAPSHOT.jar> to <https://builds.apache.org/job/maven-plugins-ITs-m2/ws/maven-gpg-plugin/target/local-repo/org/apache/maven/plugins/maven-checkstyle-plugin/2.14-SNAPSHOT/maven-checkstyle-plugin-2.14-SNAPSHOT.jar>
[INFO] Installing <https://builds.apache.org/job/maven-plugins-ITs-m2/ws/maven-acr-plugin/pom.xml> to <https://builds.apache.org/job/maven-plugins-ITs-m2/ws/maven-gpg-plugin/target/local-repo/org/apache/maven/plugins/maven-acr-plugin/1.2-SNAPSHOT/maven-acr-plugin-1.2-SNAPSHOT.pom>
[INFO] Installing <https://builds.apache.org/job/maven-plugins-ITs-m2/ws/maven-acr-plugin/target/maven-acr-plugin-1.2-SNAPSHOT.jar> to <https://builds.apache.org/job/maven-plugins-ITs-m2/ws/maven-gpg-plugin/target/local-repo/org/apache/maven/plugins/maven-acr-plugin/1.2-SNAPSHOT/maven-acr-plugin-1.2-SNAPSHOT.jar>
[INFO] Installing <https://builds.apache.org/job/maven-plugins-ITs-m2/ws/maven-ant-plugin/pom.xml> to <https://builds.apache.org/job/maven-plugins-ITs-m2/ws/maven-gpg-plugin/target/local-repo/org/apache/maven/plugins/maven-ant-plugin/2.4-SNAPSHOT/maven-ant-plugin-2.4-SNAPSHOT.pom>
[INFO] Installing <https://builds.apache.org/job/maven-plugins-ITs-m2/ws/maven-ant-plugin/target/maven-ant-plugin-2.4-SNAPSHOT.jar> to <https://builds.apache.org/job/maven-plugins-ITs-m2/ws/maven-gpg-plugin/target/local-repo/org/apache/maven/plugins/maven-ant-plugin/2.4-SNAPSHOT/maven-ant-plugin-2.4-SNAPSHOT.jar>
[INFO] Installing <https://builds.apache.org/job/maven-plugins-ITs-m2/ws/maven-antrun-plugin/pom.xml> to <https://builds.apache.org/job/maven-plugins-ITs-m2/ws/maven-gpg-plugin/target/local-repo/org/apache/maven/plugins/maven-antrun-plugin/1.8-SNAPSHOT/maven-antrun-plugin-1.8-SNAPSHOT.pom>
[INFO] Installing <https://builds.apache.org/job/maven-plugins-ITs-m2/ws/maven-antrun-plugin/target/maven-antrun-plugin-1.8-SNAPSHOT.jar> to <https://builds.apache.org/job/maven-plugins-ITs-m2/ws/maven-gpg-plugin/target/local-repo/org/apache/maven/plugins/maven-antrun-plugin/1.8-SNAPSHOT/maven-antrun-plugin-1.8-SNAPSHOT.jar>
[INFO] Installing <https://builds.apache.org/job/maven-plugins-ITs-m2/ws/maven-eclipse-plugin/pom.xml> to <https://builds.apache.org/job/maven-plugins-ITs-m2/ws/maven-gpg-plugin/target/local-repo/org/apache/maven/plugins/maven-eclipse-plugin/2.10-SNAPSHOT/maven-eclipse-plugin-2.10-SNAPSHOT.pom>
[INFO] Installing <https://builds.apache.org/job/maven-plugins-ITs-m2/ws/maven-eclipse-plugin/target/maven-eclipse-plugin-2.10-SNAPSHOT.jar> to <https://builds.apache.org/job/maven-plugins-ITs-m2/ws/maven-gpg-plugin/target/local-repo/org/apache/maven/plugins/maven-eclipse-plugin/2.10-SNAPSHOT/maven-eclipse-plugin-2.10-SNAPSHOT.jar>
[INFO] Installing <https://builds.apache.org/job/maven-plugins-ITs-m2/ws/maven-assembly-plugin/pom.xml> to <https://builds.apache.org/job/maven-plugins-ITs-m2/ws/maven-gpg-plugin/target/local-repo/org/apache/maven/plugins/maven-assembly-plugin/2.5.3-SNAPSHOT/maven-assembly-plugin-2.5.3-SNAPSHOT.pom>
[INFO] Installing <https://builds.apache.org/job/maven-plugins-ITs-m2/ws/maven-assembly-plugin/target/maven-assembly-plugin-2.5.3-SNAPSHOT.jar> to <https://builds.apache.org/job/maven-plugins-ITs-m2/ws/maven-gpg-plugin/target/local-repo/org/apache/maven/plugins/maven-assembly-plugin/2.5.3-SNAPSHOT/maven-assembly-plugin-2.5.3-SNAPSHOT.jar>
[INFO] Installing <https://builds.apache.org/job/maven-plugins-ITs-m2/ws/maven-changelog-plugin/pom.xml> to <https://builds.apache.org/job/maven-plugins-ITs-m2/ws/maven-gpg-plugin/target/local-repo/org/apache/maven/plugins/maven-changelog-plugin/2.4-SNAPSHOT/maven-changelog-plugin-2.4-SNAPSHOT.pom>
[INFO] Installing <https://builds.apache.org/job/maven-plugins-ITs-m2/ws/maven-changelog-plugin/target/maven-changelog-plugin-2.4-SNAPSHOT.jar> to <https://builds.apache.org/job/maven-plugins-ITs-m2/ws/maven-gpg-plugin/target/local-repo/org/apache/maven/plugins/maven-changelog-plugin/2.4-SNAPSHOT/maven-changelog-plugin-2.4-SNAPSHOT.jar>
[INFO] Installing <https://builds.apache.org/job/maven-plugins-ITs-m2/ws/maven-compiler-plugin/pom.xml> to <https://builds.apache.org/job/maven-plugins-ITs-m2/ws/maven-gpg-plugin/target/local-repo/org/apache/maven/plugins/maven-compiler-plugin/3.3-SNAPSHOT/maven-compiler-plugin-3.3-SNAPSHOT.pom>
[INFO] Installing <https://builds.apache.org/job/maven-plugins-ITs-m2/ws/maven-compiler-plugin/target/maven-compiler-plugin-3.3-SNAPSHOT.jar> to <https://builds.apache.org/job/maven-plugins-ITs-m2/ws/maven-gpg-plugin/target/local-repo/org/apache/maven/plugins/maven-compiler-plugin/3.3-SNAPSHOT/maven-compiler-plugin-3.3-SNAPSHOT.jar>
[INFO] Installing <https://builds.apache.org/job/maven-plugins-ITs-m2/ws/maven-changes-plugin/pom.xml> to <https://builds.apache.org/job/maven-plugins-ITs-m2/ws/maven-gpg-plugin/target/local-repo/org/apache/maven/plugins/maven-changes-plugin/2.12-SNAPSHOT/maven-changes-plugin-2.12-SNAPSHOT.pom>
[INFO] Installing <https://builds.apache.org/job/maven-plugins-ITs-m2/ws/maven-clean-plugin/pom.xml> to <https://builds.apache.org/job/maven-plugins-ITs-m2/ws/maven-gpg-plugin/target/local-repo/org/apache/maven/plugins/maven-clean-plugin/2.6.2-SNAPSHOT/maven-clean-plugin-2.6.2-SNAPSHOT.pom>
[INFO] Installing <https://builds.apache.org/job/maven-plugins-ITs-m2/ws/maven-clean-plugin/target/maven-clean-plugin-2.6.2-SNAPSHOT.jar> to <https://builds.apache.org/job/maven-plugins-ITs-m2/ws/maven-gpg-plugin/target/local-repo/org/apache/maven/plugins/maven-clean-plugin/2.6.2-SNAPSHOT/maven-clean-plugin-2.6.2-SNAPSHOT.jar>
[INFO] Installing <https://builds.apache.org/job/maven-plugins-ITs-m2/ws/maven-dependency-plugin/pom.xml> to <https://builds.apache.org/job/maven-plugins-ITs-m2/ws/maven-gpg-plugin/target/local-repo/org/apache/maven/plugins/maven-dependency-plugin/2.10-SNAPSHOT/maven-dependency-plugin-2.10-SNAPSHOT.pom>
[INFO] Installing <https://builds.apache.org/job/maven-plugins-ITs-m2/ws/maven-dependency-plugin/target/maven-dependency-plugin-2.10-SNAPSHOT.jar> to <https://builds.apache.org/job/maven-plugins-ITs-m2/ws/maven-gpg-plugin/target/local-repo/org/apache/maven/plugins/maven-dependency-plugin/2.10-SNAPSHOT/maven-dependency-plugin-2.10-SNAPSHOT.jar>
[INFO] Installing <https://builds.apache.org/job/maven-plugins-ITs-m2/ws/maven-deploy-plugin/pom.xml> to <https://builds.apache.org/job/maven-plugins-ITs-m2/ws/maven-gpg-plugin/target/local-repo/org/apache/maven/plugins/maven-deploy-plugin/2.8.3-SNAPSHOT/maven-deploy-plugin-2.8.3-SNAPSHOT.pom>
[INFO] Installing <https://builds.apache.org/job/maven-plugins-ITs-m2/ws/maven-deploy-plugin/target/maven-deploy-plugin-2.8.3-SNAPSHOT.jar> to <https://builds.apache.org/job/maven-plugins-ITs-m2/ws/maven-gpg-plugin/target/local-repo/org/apache/maven/plugins/maven-deploy-plugin/2.8.3-SNAPSHOT/maven-deploy-plugin-2.8.3-SNAPSHOT.jar>
[INFO] Installing <https://builds.apache.org/job/maven-plugins-ITs-m2/ws/maven-doap-plugin/pom.xml> to <https://builds.apache.org/job/maven-plugins-ITs-m2/ws/maven-gpg-plugin/target/local-repo/org/apache/maven/plugins/maven-doap-plugin/1.2-SNAPSHOT/maven-doap-plugin-1.2-SNAPSHOT.pom>
[INFO] Installing <https://builds.apache.org/job/maven-plugins-ITs-m2/ws/maven-doap-plugin/target/maven-doap-plugin-1.2-SNAPSHOT.jar> to <https://builds.apache.org/job/maven-plugins-ITs-m2/ws/maven-gpg-plugin/target/local-repo/org/apache/maven/plugins/maven-doap-plugin/1.2-SNAPSHOT/maven-doap-plugin-1.2-SNAPSHOT.jar>
[INFO] Installing <https://builds.apache.org/job/maven-plugins-ITs-m2/ws/maven-docck-plugin/pom.xml> to <https://builds.apache.org/job/maven-plugins-ITs-m2/ws/maven-gpg-plugin/target/local-repo/org/apache/maven/plugins/maven-docck-plugin/1.1-SNAPSHOT/maven-docck-plugin-1.1-SNAPSHOT.pom>
[INFO] Installing <https://builds.apache.org/job/maven-plugins-ITs-m2/ws/maven-docck-plugin/target/maven-docck-plugin-1.1-SNAPSHOT.jar> to <https://builds.apache.org/job/maven-plugins-ITs-m2/ws/maven-gpg-plugin/target/local-repo/org/apache/maven/plugins/maven-docck-plugin/1.1-SNAPSHOT/maven-docck-plugin-1.1-SNAPSHOT.jar>
[INFO] Installing <https://builds.apache.org/job/maven-plugins-ITs-m2/ws/maven-ear-plugin/pom.xml> to <https://builds.apache.org/job/maven-plugins-ITs-m2/ws/maven-gpg-plugin/target/local-repo/org/apache/maven/plugins/maven-ear-plugin/2.10-SNAPSHOT/maven-ear-plugin-2.10-SNAPSHOT.pom>
[INFO] Installing <https://builds.apache.org/job/maven-plugins-ITs-m2/ws/maven-ear-plugin/target/maven-ear-plugin-2.10-SNAPSHOT.jar> to <https://builds.apache.org/job/maven-plugins-ITs-m2/ws/maven-gpg-plugin/target/local-repo/org/apache/maven/plugins/maven-ear-plugin/2.10-SNAPSHOT/maven-ear-plugin-2.10-SNAPSHOT.jar>
[INFO] Installing <https://builds.apache.org/job/maven-plugins-ITs-m2/ws/maven-ejb-plugin/pom.xml> to <https://builds.apache.org/job/maven-plugins-ITs-m2/ws/maven-gpg-plugin/target/local-repo/org/apache/maven/plugins/maven-ejb-plugin/2.5-SNAPSHOT/maven-ejb-plugin-2.5-SNAPSHOT.pom>
[INFO] Installing <https://builds.apache.org/job/maven-plugins-ITs-m2/ws/maven-ejb-plugin/target/maven-ejb-plugin-2.5-SNAPSHOT.jar> to <https://builds.apache.org/job/maven-plugins-ITs-m2/ws/maven-gpg-plugin/target/local-repo/org/apache/maven/plugins/maven-ejb-plugin/2.5-SNAPSHOT/maven-ejb-plugin-2.5-SNAPSHOT.jar>
[INFO] Installing <https://builds.apache.org/job/maven-plugins-ITs-m2/ws/maven-help-plugin/pom.xml> to <https://builds.apache.org/job/maven-plugins-ITs-m2/ws/maven-gpg-plugin/target/local-repo/org/apache/maven/plugins/maven-help-plugin/2.2.1-SNAPSHOT/maven-help-plugin-2.2.1-SNAPSHOT.pom>
[INFO] Installing <https://builds.apache.org/job/maven-plugins-ITs-m2/ws/maven-help-plugin/target/maven-help-plugin-2.2.1-SNAPSHOT.jar> to <https://builds.apache.org/job/maven-plugins-ITs-m2/ws/maven-gpg-plugin/target/local-repo/org/apache/maven/plugins/maven-help-plugin/2.2.1-SNAPSHOT/maven-help-plugin-2.2.1-SNAPSHOT.jar>
[INFO] Installing <https://builds.apache.org/job/maven-plugins-ITs-m2/ws/maven-install-plugin/pom.xml> to <https://builds.apache.org/job/maven-plugins-ITs-m2/ws/maven-gpg-plugin/target/local-repo/org/apache/maven/plugins/maven-install-plugin/2.5.3-SNAPSHOT/maven-install-plugin-2.5.3-SNAPSHOT.pom>
[INFO] Installing <https://builds.apache.org/job/maven-plugins-ITs-m2/ws/maven-install-plugin/target/maven-install-plugin-2.5.3-SNAPSHOT.jar> to <https://builds.apache.org/job/maven-plugins-ITs-m2/ws/maven-gpg-plugin/target/local-repo/org/apache/maven/plugins/maven-install-plugin/2.5.3-SNAPSHOT/maven-install-plugin-2.5.3-SNAPSHOT.jar>
[INFO] Installing <https://builds.apache.org/job/maven-plugins-ITs-m2/ws/maven-jar-plugin/pom.xml> to <https://builds.apache.org/job/maven-plugins-ITs-m2/ws/maven-gpg-plugin/target/local-repo/org/apache/maven/plugins/maven-jar-plugin/2.6-SNAPSHOT/maven-jar-plugin-2.6-SNAPSHOT.pom>
[INFO] Installing <https://builds.apache.org/job/maven-plugins-ITs-m2/ws/maven-jar-plugin/target/maven-jar-plugin-2.6-SNAPSHOT.jar> to <https://builds.apache.org/job/maven-plugins-ITs-m2/ws/maven-gpg-plugin/target/local-repo/org/apache/maven/plugins/maven-jar-plugin/2.6-SNAPSHOT/maven-jar-plugin-2.6-SNAPSHOT.jar>
[INFO] Installing <https://builds.apache.org/job/maven-plugins-ITs-m2/ws/maven-jarsigner-plugin/pom.xml> to <https://builds.apache.org/job/maven-plugins-ITs-m2/ws/maven-gpg-plugin/target/local-repo/org/apache/maven/plugins/maven-jarsigner-plugin/1.4-SNAPSHOT/maven-jarsigner-plugin-1.4-SNAPSHOT.pom>
[INFO] Installing <https://builds.apache.org/job/maven-plugins-ITs-m2/ws/maven-jarsigner-plugin/target/maven-jarsigner-plugin-1.4-SNAPSHOT.jar> to <https://builds.apache.org/job/maven-plugins-ITs-m2/ws/maven-gpg-plugin/target/local-repo/org/apache/maven/plugins/maven-jarsigner-plugin/1.4-SNAPSHOT/maven-jarsigner-plugin-1.4-SNAPSHOT.jar>
[INFO] Installing <https://builds.apache.org/job/maven-plugins-ITs-m2/ws/maven-javadoc-plugin/pom.xml> to <https://builds.apache.org/job/maven-plugins-ITs-m2/ws/maven-gpg-plugin/target/local-repo/org/apache/maven/plugins/maven-javadoc-plugin/2.10.2-SNAPSHOT/maven-javadoc-plugin-2.10.2-SNAPSHOT.pom>
[INFO] ------------------------------------------------------------------------
[INFO] Building Apache Maven Plugins Aggregator
[INFO] task-segment: [clean, install]
[INFO] ------------------------------------------------------------------------
[INFO] [clean:clean {execution: default-clean}]
[INFO] [enforcer:enforce {execution: enforce-bytecode-version}]
[INFO] [enforcer:enforce {execution: ban-known-bad-maven-versions}]
[INFO] [remote-resources:process {execution: default}]
[INFO] [site:attach-descriptor {execution: default-attach-descriptor}]
[INFO] [install:install {execution: default-install}]
[INFO] Installing <https://builds.apache.org/job/maven-plugins-ITs-m2/ws/pom.xml> to /home/jenkins/.m2/repository/org/apache/maven/plugins/maven-plugins-aggregator/1-SNAPSHOT/maven-plugins-aggregator-1-SNAPSHOT.pom
[INFO]
[INFO]
[INFO] ------------------------------------------------------------------------
[INFO] Reactor Summary:
[INFO] ------------------------------------------------------------------------
[INFO] Apache Maven Plugins .................................. SUCCESS [9.298s]
[INFO] Apache Maven Checkstyle Plugin ........................ SUCCESS [4:08.471s]
[INFO] Apache Maven ACR Plugin ............................... SUCCESS [19.612s]
[INFO] Apache Maven Ant Plugin ............................... SUCCESS [1:33.144s]
[INFO] Apache Maven AntRun Plugin ............................ SUCCESS [42.375s]
[INFO] Apache Maven Eclipse Plugin ........................... SUCCESS [7:46.733s]
[INFO] Apache Maven Assembly Plugin .......................... FAILED [13:19.636s]
[INFO] Apache Maven Changelog Plugin ......................... SUCCESS [1:07.655s]
[INFO] Apache Maven Compiler Plugin .......................... FAILED [2:55.069s]
[INFO] Apache Maven Changes Plugin ........................... SKIPPED (dependency build failed or was skipped)
[INFO] Apache Maven Clean Plugin ............................. SUCCESS [13.697s]
[INFO] Apache Maven Dependency Plugin ........................ SUCCESS [3:38.764s]
[INFO] Apache Maven Deploy Plugin ............................ SUCCESS [2:36.254s]
[INFO] Apache Maven DOAP Plugin .............................. SUCCESS [1:10.666s]
[INFO] Apache Maven Documentation Checker Plugin ............. SUCCESS [23.229s]
[INFO] Apache Maven EAR Plugin ............................... SUCCESS [5:00.725s]
[INFO] Apache Maven EJB Plugin ............................... SUCCESS [25.376s]
[INFO] Apache Maven Help Plugin .............................. FAILED [1:38.609s]
[INFO] Apache Maven Install Plugin ........................... FAILED [1:46.475s]
[INFO] Apache Maven JAR Plugin ............................... SUCCESS [1:13.826s]
[INFO] Apache Maven Jarsigner Plugin ......................... SUCCESS [47.768s]
[INFO] Apache Maven Javadoc Plugin ........................... FAILED [3:10.939s]
[INFO] Apache Maven Linkcheck Plugin ......................... FAILED [3.142s]
[INFO] Apache Maven Patch Plugin ............................. FAILED [0.585s]
[INFO] Apache Maven PDF Plugin ............................... FAILED [11.669s]
[INFO] Apache Maven RAR Plugin ............................... FAILED [2.652s]
[INFO] Apache Maven Repository Plugin ........................ FAILED [3.178s]
[INFO] Apache Maven Resources Plugin ......................... FAILED [3.887s]
[INFO] Apache Maven Site Plugin .............................. FAILED [34.471s]
[INFO] Apache Maven Source Plugin ............................ FAILED [3.615s]
[INFO] Apache Maven Stage Plugin ............................. FAILED [2.037s]
[INFO] Apache Maven Toolchains Plugin ........................ FAILED [1.108s]
[INFO] Apache Maven Verifier Plugin .......................... FAILED [0.949s]
[INFO] Apache Maven WAR Plugin ............................... FAILED [8.922s]
[INFO] Apache Maven PMD Plugin ............................... FAILED [17.118s]
[INFO] Apache Maven GPG Plugin ............................... FAILED [0.928s]
[INFO] Apache Maven Plugins Aggregator ....................... SUCCESS [1.278s]
[INFO] ------------------------------------------------------------------------
[INFO] Error for project: Apache Maven Assembly Plugin (during install)
[INFO] ------------------------------------------------------------------------
[INFO] 1 build failed. See console output above for details.
[INFO] ------------------------------------------------------------------------
[INFO] Error for project: Apache Maven Compiler Plugin (during install)
[INFO] ------------------------------------------------------------------------
[INFO] 1 build failed. See console output above for details.
[INFO] ------------------------------------------------------------------------
[INFO] Error for project: Apache Maven Help Plugin (during install)
[INFO] ------------------------------------------------------------------------
[INFO] 1 build failed. See console output above for details.
[INFO] ------------------------------------------------------------------------
[INFO] Error for project: Apache Maven Install Plugin (during install)
[INFO] ------------------------------------------------------------------------
[INFO] 1 build failed. See console output above for details.
[INFO] ------------------------------------------------------------------------
[INFO] Error for project: Apache Maven Javadoc Plugin (during install)
[INFO] ------------------------------------------------------------------------
[INFO] There are test failures.
Please refer to <https://builds.apache.org/job/maven-plugins-ITs-m2/ws/maven-javadoc-plugin/target/surefire-reports> for the individual test results.
[INFO] ------------------------------------------------------------------------
[INFO] Error for project: Apache Maven Linkcheck Plugin (during install)
[INFO] ------------------------------------------------------------------------
[INFO] Failed to install project dependencies: MavenProject: org.apache.maven.plugins:maven-linkcheck-plugin:1.3-SNAPSHOT @ <https://builds.apache.org/job/maven-plugins-ITs-m2/ws/maven-linkcheck-plugin/pom.xml>
Embedded error: Failed to install project artifacts: MavenProject: org.apache.maven.plugins:maven-javadoc-plugin:2.10.2-SNAPSHOT @ <https://builds.apache.org/job/maven-plugins-ITs-m2/ws/maven-javadoc-plugin/pom.xml>
Artifact is not fully assembled: <https://builds.apache.org/job/maven-plugins-ITs-m2/ws/maven-javadoc-plugin/target/classes>
[INFO] ------------------------------------------------------------------------
[INFO] Error for project: Apache Maven Patch Plugin (during install)
[INFO] ------------------------------------------------------------------------
[INFO] Failed to install project dependencies: MavenProject: org.apache.maven.plugins:maven-patch-plugin:1.2-SNAPSHOT @ <https://builds.apache.org/job/maven-plugins-ITs-m2/ws/maven-patch-plugin/pom.xml>
Embedded error: Failed to install project artifacts: MavenProject: org.apache.maven.plugins:maven-javadoc-plugin:2.10.2-SNAPSHOT @ <https://builds.apache.org/job/maven-plugins-ITs-m2/ws/maven-javadoc-plugin/pom.xml>
Artifact is not fully assembled: <https://builds.apache.org/job/maven-plugins-ITs-m2/ws/maven-javadoc-plugin/target/classes>
[INFO] ------------------------------------------------------------------------
[INFO] Error for project: Apache Maven PDF Plugin (during install)
[INFO] ------------------------------------------------------------------------
[INFO] Failed to install project dependencies: MavenProject: org.apache.maven.plugins:maven-pdf-plugin:1.3-SNAPSHOT @ <https://builds.apache.org/job/maven-plugins-ITs-m2/ws/maven-pdf-plugin/pom.xml>
Embedded error: Failed to install project artifacts: MavenProject: org.apache.maven.plugins:maven-javadoc-plugin:2.10.2-SNAPSHOT @ <https://builds.apache.org/job/maven-plugins-ITs-m2/ws/maven-javadoc-plugin/pom.xml>
Artifact is not fully assembled: <https://builds.apache.org/job/maven-plugins-ITs-m2/ws/maven-javadoc-plugin/target/classes>
[INFO] ------------------------------------------------------------------------
[INFO] Error for project: Apache Maven RAR Plugin (during install)
[INFO] ------------------------------------------------------------------------
[INFO] Failed to install project dependencies: MavenProject: org.apache.maven.plugins:maven-rar-plugin:2.5-SNAPSHOT @ <https://builds.apache.org/job/maven-plugins-ITs-m2/ws/maven-rar-plugin/pom.xml>
Embedded error: Failed to install project artifacts: MavenProject: org.apache.maven.plugins:maven-javadoc-plugin:2.10.2-SNAPSHOT @ <https://builds.apache.org/job/maven-plugins-ITs-m2/ws/maven-javadoc-plugin/pom.xml>
Artifact is not fully assembled: <https://builds.apache.org/job/maven-plugins-ITs-m2/ws/maven-javadoc-plugin/target/classes>
[INFO] ------------------------------------------------------------------------
[INFO] Error for project: Apache Maven Repository Plugin (during install)
[INFO] ------------------------------------------------------------------------
[INFO] Failed to install project dependencies: MavenProject: org.apache.maven.plugins:maven-repository-plugin:2.3.2-SNAPSHOT @ <https://builds.apache.org/job/maven-plugins-ITs-m2/ws/maven-repository-plugin/pom.xml>
Embedded error: Failed to install project artifacts: MavenProject: org.apache.maven.plugins:maven-javadoc-plugin:2.10.2-SNAPSHOT @ <https://builds.apache.org/job/maven-plugins-ITs-m2/ws/maven-javadoc-plugin/pom.xml>
Artifact is not fully assembled: <https://builds.apache.org/job/maven-plugins-ITs-m2/ws/maven-javadoc-plugin/target/classes>
[INFO] ------------------------------------------------------------------------
[INFO] Error for project: Apache Maven Resources Plugin (during install)
[INFO] ------------------------------------------------------------------------
[INFO] Failed to install project dependencies: MavenProject: org.apache.maven.plugins:maven-resources-plugin:2.8-SNAPSHOT @ <https://builds.apache.org/job/maven-plugins-ITs-m2/ws/maven-resources-plugin/pom.xml>
Embedded error: Failed to install project artifacts: MavenProject: org.apache.maven.plugins:maven-javadoc-plugin:2.10.2-SNAPSHOT @ <https://builds.apache.org/job/maven-plugins-ITs-m2/ws/maven-javadoc-plugin/pom.xml>
Artifact is not fully assembled: <https://builds.apache.org/job/maven-plugins-ITs-m2/ws/maven-javadoc-plugin/target/classes>
[INFO] ------------------------------------------------------------------------
[INFO] Error for project: Apache Maven Site Plugin (during install)
[INFO] ------------------------------------------------------------------------
[INFO] Failed to install project dependencies: MavenProject: org.apache.maven.plugins:maven-site-plugin:3.4.1-SNAPSHOT @ <https://builds.apache.org/job/maven-plugins-ITs-m2/ws/maven-site-plugin/dependency-reduced-pom.xml>
Embedded error: Failed to install project artifacts: MavenProject: org.apache.maven.plugins:maven-javadoc-plugin:2.10.2-SNAPSHOT @ <https://builds.apache.org/job/maven-plugins-ITs-m2/ws/maven-javadoc-plugin/pom.xml>
Artifact is not fully assembled: <https://builds.apache.org/job/maven-plugins-ITs-m2/ws/maven-javadoc-plugin/target/classes>
[INFO] ------------------------------------------------------------------------
[INFO] Error for project: Apache Maven Source Plugin (during install)
[INFO] ------------------------------------------------------------------------
[INFO] Failed to install project dependencies: MavenProject: org.apache.maven.plugins:maven-source-plugin:2.5-SNAPSHOT @ <https://builds.apache.org/job/maven-plugins-ITs-m2/ws/maven-source-plugin/pom.xml>
Embedded error: Failed to install project artifacts: MavenProject: org.apache.maven.plugins:maven-javadoc-plugin:2.10.2-SNAPSHOT @ <https://builds.apache.org/job/maven-plugins-ITs-m2/ws/maven-javadoc-plugin/pom.xml>
Artifact is not fully assembled: <https://builds.apache.org/job/maven-plugins-ITs-m2/ws/maven-javadoc-plugin/target/classes>
[INFO] ------------------------------------------------------------------------
[INFO] Error for project: Apache Maven Stage Plugin (during install)
[INFO] ------------------------------------------------------------------------
[INFO] Failed to install project dependencies: MavenProject: org.apache.maven.plugins:maven-stage-plugin:1.0-SNAPSHOT @ <https://builds.apache.org/job/maven-plugins-ITs-m2/ws/maven-stage-plugin/pom.xml>
Embedded error: Failed to install project artifacts: MavenProject: org.apache.maven.plugins:maven-javadoc-plugin:2.10.2-SNAPSHOT @ <https://builds.apache.org/job/maven-plugins-ITs-m2/ws/maven-javadoc-plugin/pom.xml>
Artifact is not fully assembled: <https://builds.apache.org/job/maven-plugins-ITs-m2/ws/maven-javadoc-plugin/target/classes>
[INFO] ------------------------------------------------------------------------
[INFO] Error for project: Apache Maven Toolchains Plugin (during install)
[INFO] ------------------------------------------------------------------------
[INFO] Failed to install project dependencies: MavenProject: org.apache.maven.plugins:maven-toolchains-plugin:1.2-SNAPSHOT @ <https://builds.apache.org/job/maven-plugins-ITs-m2/ws/maven-toolchains-plugin/pom.xml>
Embedded error: Failed to install project artifacts: MavenProject: org.apache.maven.plugins:maven-javadoc-plugin:2.10.2-SNAPSHOT @ <https://builds.apache.org/job/maven-plugins-ITs-m2/ws/maven-javadoc-plugin/pom.xml>
Artifact is not fully assembled: <https://builds.apache.org/job/maven-plugins-ITs-m2/ws/maven-javadoc-plugin/target/classes>
[INFO] ------------------------------------------------------------------------
[INFO] Error for project: Apache Maven Verifier Plugin (during install)
[INFO] ------------------------------------------------------------------------
[INFO] Failed to install project dependencies: MavenProject: org.apache.maven.plugins:maven-verifier-plugin:1.1-SNAPSHOT @ <https://builds.apache.org/job/maven-plugins-ITs-m2/ws/maven-verifier-plugin/pom.xml>
Embedded error: Failed to install project artifacts: MavenProject: org.apache.maven.plugins:maven-javadoc-plugin:2.10.2-SNAPSHOT @ <https://builds.apache.org/job/maven-plugins-ITs-m2/ws/maven-javadoc-plugin/pom.xml>
Artifact is not fully assembled: <https://builds.apache.org/job/maven-plugins-ITs-m2/ws/maven-javadoc-plugin/target/classes>
[INFO] ------------------------------------------------------------------------
[INFO] Error for project: Apache Maven WAR Plugin (during install)
[INFO] ------------------------------------------------------------------------
[INFO] Failed to install project dependencies: MavenProject: org.apache.maven.plugins:maven-war-plugin:2.6-SNAPSHOT @ <https://builds.apache.org/job/maven-plugins-ITs-m2/ws/maven-war-plugin/pom.xml>
Embedded error: Failed to install project artifacts: MavenProject: org.apache.maven.plugins:maven-javadoc-plugin:2.10.2-SNAPSHOT @ <https://builds.apache.org/job/maven-plugins-ITs-m2/ws/maven-javadoc-plugin/pom.xml>
Artifact is not fully assembled: <https://builds.apache.org/job/maven-plugins-ITs-m2/ws/maven-javadoc-plugin/target/classes>
[INFO] ------------------------------------------------------------------------
[INFO] Error for project: Apache Maven PMD Plugin (during install)
[INFO] ------------------------------------------------------------------------
[INFO] Failed to install project dependencies: MavenProject: org.apache.maven.plugins:maven-pmd-plugin:3.4-SNAPSHOT @ <https://builds.apache.org/job/maven-plugins-ITs-m2/ws/maven-pmd-plugin/pom.xml>
Embedded error: Failed to install project artifacts: MavenProject: org.apache.maven.plugins:maven-javadoc-plugin:2.10.2-SNAPSHOT @ <https://builds.apache.org/job/maven-plugins-ITs-m2/ws/maven-javadoc-plugin/pom.xml>
Artifact is not fully assembled: <https://builds.apache.org/job/maven-plugins-ITs-m2/ws/maven-javadoc-plugin/target/classes>
[INFO] ------------------------------------------------------------------------
[INFO] Error for project: Apache Maven GPG Plugin (during install)
[INFO] ------------------------------------------------------------------------
[INFO] Failed to install project dependencies: MavenProject: org.apache.maven.plugins:maven-gpg-plugin:1.6-SNAPSHOT @ <https://builds.apache.org/job/maven-plugins-ITs-m2/ws/maven-gpg-plugin/pom.xml>
Embedded error: Failed to install project artifacts: MavenProject: org.apache.maven.plugins:maven-javadoc-plugin:2.10.2-SNAPSHOT @ <https://builds.apache.org/job/maven-plugins-ITs-m2/ws/maven-javadoc-plugin/pom.xml>
Artifact is not fully assembled: <https://builds.apache.org/job/maven-plugins-ITs-m2/ws/maven-javadoc-plugin/target/classes>
[INFO] ------------------------------------------------------------------------
[INFO] For more information, run Maven with the -e switch
[INFO] ------------------------------------------------------------------------
[INFO] BUILD ERRORS
[INFO] ------------------------------------------------------------------------
[INFO] Total time: 55 minutes 45 seconds
[INFO] Finished at: Wed Dec 10 08:48:34 UTC 2014
[INFO] Final Memory: 260M/579M
[INFO] ------------------------------------------------------------------------
Build step 'Invoke top-level Maven targets' marked build as failure
Jenkins build is back to normal : maven-plugins-ITs-m2 #1849
Posted by Apache Jenkins Server <je...@builds.apache.org>.
See <https://builds.apache.org/job/maven-plugins-ITs-m2/1849/changes>