You are viewing a plain text version of this content. The canonical link for it is here.
Posted to commits@phoenix.apache.org by Apache Jenkins Server <je...@builds.apache.org> on 2018/03/10 23:38:33 UTC

Build failed in Jenkins: Phoenix | 4.x-HBase-0.98 #1828

See <https://builds.apache.org/job/Phoenix-4.x-HBase-0.98/1828/display/redirect?page=changes>

Changes:

[tdsilva] PHOENIX-4418 - add locale-awareness to UPPER() and LOWER() functions

------------------------------------------
[...truncated 118.38 KB...]
	at org.apache.phoenix.util.ServerUtil.createIOException(ServerUtil.java:80)
	at org.apache.phoenix.util.ServerUtil.throwIOException(ServerUtil.java:62)
	at org.apache.phoenix.index.PhoenixTransactionalIndexer.postBatchMutateIndispensably(PhoenixTransactionalIndexer.java:240)
	at org.apache.hadoop.hbase.regionserver.RegionCoprocessorHost$37.call(RegionCoprocessorHost.java:1040)
	at org.apache.hadoop.hbase.regionserver.RegionCoprocessorHost$RegionOperation.call(RegionCoprocessorHost.java:1656)
	at org.apache.hadoop.hbase.regionserver.RegionCoprocessorHost.execOperation(RegionCoprocessorHost.java:1733)
	at org.apache.hadoop.hbase.regionserver.RegionCoprocessorHost.execOperation(RegionCoprocessorHost.java:1688)
	at org.apache.hadoop.hbase.regionserver.RegionCoprocessorHost.postBatchMutateIndispensably(RegionCoprocessorHost.java:1036)
	at org.apache.hadoop.hbase.regionserver.HRegion.doMiniBatchMutation(HRegion.java:2767)
	at org.apache.hadoop.hbase.regionserver.HRegion.batchMutate(HRegion.java:2359)
	at org.apache.hadoop.hbase.regionserver.HRegion.batchMutate(HRegion.java:2314)
	at org.apache.hadoop.hbase.regionserver.HRegion.batchMutate(HRegion.java:2318)
	at org.apache.hadoop.hbase.regionserver.HRegionServer.doBatchOp(HRegionServer.java:4678)
	at org.apache.hadoop.hbase.regionserver.HRegionServer.doNonAtomicRegionMutation(HRegionServer.java:3835)
	at org.apache.hadoop.hbase.regionserver.HRegionServer.multi(HRegionServer.java:3680)
	at org.apache.hadoop.hbase.protobuf.generated.ClientProtos$ClientService$2.callBlockingMethod(ClientProtos.java:32500)
	at org.apache.hadoop.hbase.ipc.RpcServer.call(RpcServer.java:2195)
	at org.apache.hadoop.hbase.ipc.CallRunner.run(CallRunner.java:104)
	at org.apache.hadoop.hbase.ipc.RpcExecutor.consumerLoop(RpcExecutor.java:133)
	at org.apache.hadoop.hbase.ipc.RpcExecutor$1.run(RpcExecutor.java:108)
	at java.lang.Thread.run(Thread.java:745)
Caused by: org.apache.hadoop.hbase.client.RetriesExhaustedWithDetailsException: Failed 1 action: RegionOpeningException: 1 time, servers with issues: asf921.gq1.ygridcore.net,42988,1520722764544, 
	at org.apache.hadoop.hbase.client.AsyncProcess$BatchErrors.makeException(AsyncProcess.java:211)
	at org.apache.hadoop.hbase.client.AsyncProcess$BatchErrors.access$500(AsyncProcess.java:195)
	at org.apache.hadoop.hbase.client.AsyncProcess.getErrors(AsyncProcess.java:1082)
	at org.apache.hadoop.hbase.client.HConnectionManager$HConnectionImplementation.processBatchCallback(HConnectionManager.java:2479)
	at org.apache.hadoop.hbase.client.HTable.batchCallback(HTable.java:898)
	at org.apache.hadoop.hbase.client.HTable.batchCallback(HTable.java:913)
	at org.apache.hadoop.hbase.client.HTable.batch(HTable.java:888)
	at org.apache.phoenix.hbase.index.write.ParallelWriterIndexCommitter$1.call(ParallelWriterIndexCommitter.java:170)
	at org.apache.phoenix.hbase.index.write.ParallelWriterIndexCommitter$1.call(ParallelWriterIndexCommitter.java:133)
	at java.util.concurrent.FutureTask.run(FutureTask.java:262)
	at java.util.concurrent.ThreadPoolExecutor.runWorker(ThreadPoolExecutor.java:1145)
	at java.util.concurrent.ThreadPoolExecutor$Worker.run(ThreadPoolExecutor.java:615)
	... 1 more
: 1 time, servers with issues: asf921.gq1.ygridcore.net,42988,1520722764544, 
	at org.apache.phoenix.tx.ParameterizedTransactionIT.testNonTxToTxTable(ParameterizedTransactionIT.java:288)
Caused by: org.apache.hadoop.hbase.client.RetriesExhaustedWithDetailsException: 
Failed 1 action: org.apache.hadoop.hbase.DoNotRetryIOException: Failed 1 action: RegionOpeningException: 1 time, servers with issues: asf921.gq1.ygridcore.net,42988,1520722764544, 
	at org.apache.phoenix.util.ServerUtil.createIOException(ServerUtil.java:80)
	at org.apache.phoenix.util.ServerUtil.throwIOException(ServerUtil.java:62)
	at org.apache.phoenix.index.PhoenixTransactionalIndexer.postBatchMutateIndispensably(PhoenixTransactionalIndexer.java:240)
	at org.apache.hadoop.hbase.regionserver.RegionCoprocessorHost$37.call(RegionCoprocessorHost.java:1040)
	at org.apache.hadoop.hbase.regionserver.RegionCoprocessorHost$RegionOperation.call(RegionCoprocessorHost.java:1656)
	at org.apache.hadoop.hbase.regionserver.RegionCoprocessorHost.execOperation(RegionCoprocessorHost.java:1733)
	at org.apache.hadoop.hbase.regionserver.RegionCoprocessorHost.execOperation(RegionCoprocessorHost.java:1688)
	at org.apache.hadoop.hbase.regionserver.RegionCoprocessorHost.postBatchMutateIndispensably(RegionCoprocessorHost.java:1036)
	at org.apache.hadoop.hbase.regionserver.HRegion.doMiniBatchMutation(HRegion.java:2767)
	at org.apache.hadoop.hbase.regionserver.HRegion.batchMutate(HRegion.java:2359)
	at org.apache.hadoop.hbase.regionserver.HRegion.batchMutate(HRegion.java:2314)
	at org.apache.hadoop.hbase.regionserver.HRegion.batchMutate(HRegion.java:2318)
	at org.apache.hadoop.hbase.regionserver.HRegionServer.doBatchOp(HRegionServer.java:4678)
	at org.apache.hadoop.hbase.regionserver.HRegionServer.doNonAtomicRegionMutation(HRegionServer.java:3835)
	at org.apache.hadoop.hbase.regionserver.HRegionServer.multi(HRegionServer.java:3680)
	at org.apache.hadoop.hbase.protobuf.generated.ClientProtos$ClientService$2.callBlockingMethod(ClientProtos.java:32500)
	at org.apache.hadoop.hbase.ipc.RpcServer.call(RpcServer.java:2195)
	at org.apache.hadoop.hbase.ipc.CallRunner.run(CallRunner.java:104)
	at org.apache.hadoop.hbase.ipc.RpcExecutor.consumerLoop(RpcExecutor.java:133)
	at org.apache.hadoop.hbase.ipc.RpcExecutor$1.run(RpcExecutor.java:108)
	at java.lang.Thread.run(Thread.java:745)
Caused by: org.apache.hadoop.hbase.client.RetriesExhaustedWithDetailsException: Failed 1 action: RegionOpeningException: 1 time, servers with issues: asf921.gq1.ygridcore.net,42988,1520722764544, 
	at org.apache.hadoop.hbase.client.AsyncProcess$BatchErrors.makeException(AsyncProcess.java:211)
	at org.apache.hadoop.hbase.client.AsyncProcess$BatchErrors.access$500(AsyncProcess.java:195)
	at org.apache.hadoop.hbase.client.AsyncProcess.getErrors(AsyncProcess.java:1082)
	at org.apache.hadoop.hbase.client.HConnectionManager$HConnectionImplementation.processBatchCallback(HConnectionManager.java:2479)
	at org.apache.hadoop.hbase.client.HTable.batchCallback(HTable.java:898)
	at org.apache.hadoop.hbase.client.HTable.batchCallback(HTable.java:913)
	at org.apache.hadoop.hbase.client.HTable.batch(HTable.java:888)
	at org.apache.phoenix.hbase.index.write.ParallelWriterIndexCommitter$1.call(ParallelWriterIndexCommitter.java:170)
	at org.apache.phoenix.hbase.index.write.ParallelWriterIndexCommitter$1.call(ParallelWriterIndexCommitter.java:133)
	at java.util.concurrent.FutureTask.run(FutureTask.java:262)
	at java.util.concurrent.ThreadPoolExecutor.runWorker(ThreadPoolExecutor.java:1145)
	at java.util.concurrent.ThreadPoolExecutor$Worker.run(ThreadPoolExecutor.java:615)
	... 1 more
: 1 time, servers with issues: asf921.gq1.ygridcore.net,42988,1520722764544, 
	at org.apache.phoenix.tx.ParameterizedTransactionIT.testNonTxToTxTable(ParameterizedTransactionIT.java:288)

[INFO] Tests run: 40, Failures: 0, Errors: 0, Skipped: 0, Time elapsed: 272.933 s - in org.apache.phoenix.tx.TxCheckpointIT
[INFO] 
[INFO] Results:
[INFO] 
[ERROR] Errors: 
[ERROR]   ParameterizedTransactionIT.testNonTxToTxTable:288 » Commit org.apache.hadoop.h...
[ERROR]   ParameterizedTransactionIT.testNonTxToTxTable:288 » Commit org.apache.hadoop.h...
[INFO] 
[ERROR] Tests run: 3386, Failures: 0, Errors: 2, Skipped: 7
[INFO] 
[INFO] 
[INFO] --- maven-failsafe-plugin:2.20:integration-test (HBaseManagedTimeTests) @ phoenix-core ---
[INFO] 
[INFO] -------------------------------------------------------
[INFO]  T E S T S
[INFO] -------------------------------------------------------
[INFO] 
[INFO] Results:
[INFO] 
[INFO] Tests run: 0, Failures: 0, Errors: 0, Skipped: 0
[INFO] 
[INFO] 
[INFO] --- maven-failsafe-plugin:2.20:integration-test (NeedTheirOwnClusterTests) @ phoenix-core ---
[INFO] 
[INFO] -------------------------------------------------------
[INFO]  T E S T S
[INFO] -------------------------------------------------------
[INFO] Running org.apache.hadoop.hbase.regionserver.wal.WALReplayWithIndexWritesAndCompressedWALIT
[INFO] Tests run: 1, Failures: 0, Errors: 0, Skipped: 0, Time elapsed: 21.372 s - in org.apache.hadoop.hbase.regionserver.wal.WALReplayWithIndexWritesAndCompressedWALIT
[INFO] Running org.apache.hadoop.hbase.regionserver.wal.WALRecoveryRegionPostOpenIT
[INFO] Tests run: 1, Failures: 0, Errors: 0, Skipped: 0, Time elapsed: 5.509 s - in org.apache.hadoop.hbase.regionserver.wal.WALRecoveryRegionPostOpenIT
[INFO] Running org.apache.phoenix.end2end.ColumnEncodedImmutableTxStatsCollectorIT
[INFO] Running org.apache.phoenix.end2end.ColumnEncodedImmutableNonTxStatsCollectorIT
[INFO] Running org.apache.phoenix.end2end.ColumnEncodedMutableNonTxStatsCollectorIT
[INFO] Running org.apache.phoenix.end2end.ColumnEncodedMutableTxStatsCollectorIT
[INFO] Running org.apache.phoenix.end2end.ConnectionUtilIT
[INFO] Tests run: 1, Failures: 0, Errors: 0, Skipped: 0, Time elapsed: 24.443 s - in org.apache.phoenix.end2end.ConnectionUtilIT
[INFO] Running org.apache.phoenix.end2end.ContextClassloaderIT
[INFO] Tests run: 3, Failures: 0, Errors: 0, Skipped: 0, Time elapsed: 3.074 s - in org.apache.phoenix.end2end.ContextClassloaderIT
[WARNING] Tests run: 26, Failures: 0, Errors: 0, Skipped: 4, Time elapsed: 98.2 s - in org.apache.phoenix.end2end.ColumnEncodedImmutableNonTxStatsCollectorIT
[WARNING] Tests run: 26, Failures: 0, Errors: 0, Skipped: 4, Time elapsed: 104.597 s - in org.apache.phoenix.end2end.ColumnEncodedImmutableTxStatsCollectorIT
[WARNING] Tests run: 26, Failures: 0, Errors: 0, Skipped: 4, Time elapsed: 101.43 s - in org.apache.phoenix.end2end.ColumnEncodedMutableNonTxStatsCollectorIT
[WARNING] Tests run: 26, Failures: 0, Errors: 0, Skipped: 4, Time elapsed: 103.625 s - in org.apache.phoenix.end2end.ColumnEncodedMutableTxStatsCollectorIT
[INFO] Running org.apache.phoenix.end2end.CountDistinctCompressionIT
[INFO] Tests run: 1, Failures: 0, Errors: 0, Skipped: 0, Time elapsed: 2.906 s - in org.apache.phoenix.end2end.CountDistinctCompressionIT
[INFO] Running org.apache.phoenix.end2end.CsvBulkLoadToolIT
[INFO] Running org.apache.phoenix.end2end.DropSchemaIT
[INFO] Tests run: 2, Failures: 0, Errors: 0, Skipped: 0, Time elapsed: 8.235 s - in org.apache.phoenix.end2end.DropSchemaIT
[INFO] Running org.apache.phoenix.end2end.FlappingLocalIndexIT
[INFO] Running org.apache.phoenix.end2end.IndexExtendedIT
[INFO] Running org.apache.phoenix.end2end.IndexScrutinyToolIT
[INFO] Running org.apache.phoenix.end2end.IndexToolForPartialBuildIT
[INFO] Tests run: 12, Failures: 0, Errors: 0, Skipped: 0, Time elapsed: 80.618 s - in org.apache.phoenix.end2end.CsvBulkLoadToolIT
[INFO] Tests run: 32, Failures: 0, Errors: 0, Skipped: 0, Time elapsed: 95.194 s - in org.apache.phoenix.end2end.IndexExtendedIT
[INFO] Running org.apache.phoenix.end2end.IndexToolForPartialBuildWithNamespaceEnabledIT
[INFO] Tests run: 12, Failures: 0, Errors: 0, Skipped: 0, Time elapsed: 127.965 s - in org.apache.phoenix.end2end.FlappingLocalIndexIT
[INFO] Running org.apache.phoenix.end2end.LocalIndexSplitMergeIT
[WARNING] Tests run: 2, Failures: 0, Errors: 0, Skipped: 2, Time elapsed: 0.001 s - in org.apache.phoenix.end2end.LocalIndexSplitMergeIT
[INFO] Running org.apache.phoenix.end2end.IndexToolIT
[INFO] Running org.apache.phoenix.end2end.MigrateSystemTablesToSystemNamespaceIT
[INFO] Tests run: 33, Failures: 0, Errors: 0, Skipped: 0, Time elapsed: 338.562 s - in org.apache.phoenix.end2end.IndexScrutinyToolIT
[INFO] Tests run: 4, Failures: 0, Errors: 0, Skipped: 0, Time elapsed: 233.832 s - in org.apache.phoenix.end2end.MigrateSystemTablesToSystemNamespaceIT
[INFO] Running org.apache.phoenix.end2end.NonColumnEncodedImmutableNonTxStatsCollectorIT
[INFO] Running org.apache.phoenix.end2end.NonColumnEncodedImmutableTxStatsCollectorIT
[WARNING] Tests run: 26, Failures: 0, Errors: 0, Skipped: 4, Time elapsed: 76.154 s - in org.apache.phoenix.end2end.NonColumnEncodedImmutableNonTxStatsCollectorIT
[WARNING] Tests run: 26, Failures: 0, Errors: 0, Skipped: 4, Time elapsed: 82.942 s - in org.apache.phoenix.end2end.NonColumnEncodedImmutableTxStatsCollectorIT
[INFO] Running org.apache.phoenix.end2end.PhoenixDriverIT
[INFO] Tests run: 32, Failures: 0, Errors: 0, Skipped: 0, Time elapsed: 378.325 s - in org.apache.phoenix.end2end.IndexToolIT
[INFO] Running org.apache.phoenix.end2end.QueryTimeoutIT
[INFO] Tests run: 2, Failures: 0, Errors: 0, Skipped: 0, Time elapsed: 9.863 s - in org.apache.phoenix.end2end.QueryTimeoutIT
[INFO] Tests run: 4, Failures: 0, Errors: 0, Skipped: 0, Time elapsed: 42.256 s - in org.apache.phoenix.end2end.PhoenixDriverIT
[INFO] Running org.apache.phoenix.end2end.QueryWithLimitIT
[INFO] Tests run: 2, Failures: 0, Errors: 0, Skipped: 0, Time elapsed: 4.445 s - in org.apache.phoenix.end2end.QueryWithLimitIT
[INFO] Running org.apache.phoenix.end2end.RegexBulkLoadToolIT
[INFO] Running org.apache.phoenix.end2end.RebuildIndexConnectionPropsIT
[INFO] Tests run: 1, Failures: 0, Errors: 0, Skipped: 0, Time elapsed: 0.945 s - in org.apache.phoenix.end2end.RebuildIndexConnectionPropsIT
[INFO] Running org.apache.phoenix.end2end.RenewLeaseIT
[INFO] Tests run: 2, Failures: 0, Errors: 0, Skipped: 0, Time elapsed: 583.532 s - in org.apache.phoenix.end2end.IndexToolForPartialBuildIT
[INFO] Tests run: 1, Failures: 0, Errors: 0, Skipped: 0, Time elapsed: 25.509 s - in org.apache.phoenix.end2end.RenewLeaseIT
[INFO] Running org.apache.phoenix.end2end.SystemTablePermissionsIT
[INFO] Running org.apache.phoenix.end2end.SpillableGroupByIT
[INFO] Tests run: 10, Failures: 0, Errors: 0, Skipped: 0, Time elapsed: 60.841 s - in org.apache.phoenix.end2end.RegexBulkLoadToolIT
[INFO] Running org.apache.phoenix.end2end.SysTableNamespaceMappedStatsCollectorIT
[INFO] Tests run: 3, Failures: 0, Errors: 0, Skipped: 0, Time elapsed: 8.163 s - in org.apache.phoenix.end2end.SpillableGroupByIT
[INFO] Tests run: 2, Failures: 0, Errors: 0, Skipped: 0, Time elapsed: 581.6 s - in org.apache.phoenix.end2end.IndexToolForPartialBuildWithNamespaceEnabledIT
[INFO] Running org.apache.phoenix.end2end.TableSnapshotReadsMapReduceIT
[INFO] Running org.apache.phoenix.end2end.UpdateCacheAcrossDifferentClientsIT
[INFO] Tests run: 3, Failures: 0, Errors: 0, Skipped: 0, Time elapsed: 25.455 s - in org.apache.phoenix.end2end.TableSnapshotReadsMapReduceIT
[INFO] Tests run: 2, Failures: 0, Errors: 0, Skipped: 0, Time elapsed: 85.662 s - in org.apache.phoenix.end2end.SystemTablePermissionsIT
[INFO] Running org.apache.phoenix.end2end.UserDefinedFunctionsIT
[INFO] Tests run: 6, Failures: 0, Errors: 0, Skipped: 0, Time elapsed: 25.614 s - in org.apache.phoenix.end2end.UpdateCacheAcrossDifferentClientsIT
[WARNING] Tests run: 26, Failures: 0, Errors: 0, Skipped: 4, Time elapsed: 96.16 s - in org.apache.phoenix.end2end.SysTableNamespaceMappedStatsCollectorIT
[INFO] Running org.apache.phoenix.end2end.index.ImmutableIndexIT
[INFO] Running org.apache.phoenix.end2end.index.LocalIndexIT
[INFO] Tests run: 14, Failures: 0, Errors: 0, Skipped: 0, Time elapsed: 45.886 s - in org.apache.phoenix.end2end.UserDefinedFunctionsIT
[INFO] Running org.apache.phoenix.end2end.index.MutableIndexFailureIT
[INFO] Running org.apache.phoenix.end2end.index.MutableIndexReplicationIT
[INFO] Running org.apache.phoenix.end2end.index.PartialIndexRebuilderIT
[INFO] Tests run: 1, Failures: 0, Errors: 0, Skipped: 0, Time elapsed: 17.436 s - in org.apache.phoenix.end2end.index.MutableIndexReplicationIT
[INFO] Running org.apache.phoenix.end2end.index.txn.TxWriteFailureIT
[INFO] Tests run: 8, Failures: 0, Errors: 0, Skipped: 0, Time elapsed: 55.709 s - in org.apache.phoenix.end2end.index.txn.TxWriteFailureIT
[INFO] Running org.apache.phoenix.execute.PartialCommitIT
[INFO] Tests run: 12, Failures: 0, Errors: 0, Skipped: 0, Time elapsed: 0.801 s - in org.apache.phoenix.execute.PartialCommitIT
[INFO] Tests run: 25, Failures: 0, Errors: 0, Skipped: 0, Time elapsed: 223.323 s - in org.apache.phoenix.end2end.index.PartialIndexRebuilderIT
[INFO] Running org.apache.phoenix.execute.UpsertSelectOverlappingBatchesIT
[INFO] Running org.apache.phoenix.hbase.index.FailForUnsupportedHBaseVersionsIT
[INFO] Tests run: 2, Failures: 0, Errors: 0, Skipped: 0, Time elapsed: 25.085 s - in org.apache.phoenix.hbase.index.FailForUnsupportedHBaseVersionsIT
[WARNING] Tests run: 40, Failures: 0, Errors: 0, Skipped: 16, Time elapsed: 320.83 s - in org.apache.phoenix.end2end.index.ImmutableIndexIT
[INFO] Tests run: 36, Failures: 0, Errors: 0, Skipped: 0, Time elapsed: 330.973 s - in org.apache.phoenix.end2end.index.LocalIndexIT
[INFO] Running org.apache.phoenix.iterate.RoundRobinResultIteratorWithStatsIT
[INFO] Tests run: 1, Failures: 0, Errors: 0, Skipped: 0, Time elapsed: 6.047 s - in org.apache.phoenix.iterate.RoundRobinResultIteratorWithStatsIT
[INFO] Running org.apache.phoenix.iterate.ScannerLeaseRenewalIT
[INFO] Running org.apache.phoenix.monitoring.PhoenixMetricsIT
[INFO] Running org.apache.phoenix.rpc.PhoenixClientRpcIT
[INFO] Tests run: 2, Failures: 0, Errors: 0, Skipped: 0, Time elapsed: 3.735 s - in org.apache.phoenix.rpc.PhoenixClientRpcIT
[INFO] Tests run: 3, Failures: 0, Errors: 0, Skipped: 0, Time elapsed: 158.966 s - in org.apache.phoenix.execute.UpsertSelectOverlappingBatchesIT
[INFO] Running org.apache.phoenix.rpc.PhoenixServerRpcIT
[INFO] Tests run: 2, Failures: 0, Errors: 0, Skipped: 0, Time elapsed: 15.322 s - in org.apache.phoenix.rpc.PhoenixServerRpcIT
[INFO] Tests run: 22, Failures: 0, Errors: 0, Skipped: 0, Time elapsed: 80.102 s - in org.apache.phoenix.monitoring.PhoenixMetricsIT
[INFO] Tests run: 2, Failures: 0, Errors: 0, Skipped: 0, Time elapsed: 163.423 s - in org.apache.phoenix.iterate.ScannerLeaseRenewalIT
[INFO] Tests run: 21, Failures: 0, Errors: 0, Skipped: 0, Time elapsed: 569.171 s - in org.apache.phoenix.end2end.index.MutableIndexFailureIT
[INFO] 
[INFO] Results:
[INFO] 
[WARNING] Tests run: 547, Failures: 0, Errors: 0, Skipped: 46
[INFO] 
[INFO] 
[INFO] --- maven-failsafe-plugin:2.20:verify (ParallelStatsEnabledTest) @ phoenix-core ---
[INFO] ------------------------------------------------------------------------
[INFO] Reactor Summary:
[INFO] 
[INFO] Apache Phoenix ..................................... SUCCESS [  2.143 s]
[INFO] Phoenix Core ....................................... FAILURE [  01:44 h]
[INFO] Phoenix - Flume .................................... SKIPPED
[INFO] Phoenix - Kafka .................................... SKIPPED
[INFO] Phoenix - Pig ...................................... SKIPPED
[INFO] Phoenix Query Server Client ........................ SKIPPED
[INFO] Phoenix Query Server ............................... SKIPPED
[INFO] Phoenix - Pherf .................................... SKIPPED
[INFO] Phoenix - Spark .................................... SKIPPED
[INFO] Phoenix - Hive ..................................... SKIPPED
[INFO] Phoenix Client ..................................... SKIPPED
[INFO] Phoenix Server ..................................... SKIPPED
[INFO] Phoenix Assembly ................................... SKIPPED
[INFO] Phoenix - Tracing Web Application .................. SKIPPED
[INFO] Phoenix Load Balancer .............................. SKIPPED
[INFO] ------------------------------------------------------------------------
[INFO] BUILD FAILURE
[INFO] ------------------------------------------------------------------------
[INFO] Total time: 01:44 h
[INFO] Finished at: 2018-03-10T23:33:19Z
[INFO] Final Memory: 61M/869M
[INFO] ------------------------------------------------------------------------
[ERROR] Failed to execute goal org.apache.maven.plugins:maven-failsafe-plugin:2.20:verify (ParallelStatsEnabledTest) on project phoenix-core: There are test failures.
[ERROR] 
[ERROR] Please refer to <https://builds.apache.org/job/Phoenix-4.x-HBase-0.98/ws/phoenix-core/target/failsafe-reports> for the individual test results.
[ERROR] Please refer to dump files (if any exist) [date]-jvmRun[N].dump, [date].dumpstream and [date]-jvmRun[N].dumpstream.
[ERROR] -> [Help 1]
[ERROR] 
[ERROR] To see the full stack trace of the errors, re-run Maven with the -e switch.
[ERROR] Re-run Maven using the -X switch to enable full debug logging.
[ERROR] 
[ERROR] For more information about the errors and possible solutions, please read the following articles:
[ERROR] [Help 1] http://cwiki.apache.org/confluence/display/MAVEN/MojoFailureException
[ERROR] 
[ERROR] After correcting the problems, you can resume the build with the command
[ERROR]   mvn <goals> -rf :phoenix-core
Build step 'Invoke top-level Maven targets' marked build as failure
Archiving artifacts
[Fast Archiver] Compressed 1.41 GB of artifacts by 42.5% relative to #1822
[JIRA] Updating issue PHOENIX-4418
Recording test results

Jenkins build is back to normal : Phoenix | 4.x-HBase-0.98 #1830

Posted by Apache Jenkins Server <je...@builds.apache.org>.
See <https://builds.apache.org/job/Phoenix-4.x-HBase-0.98/1830/display/redirect?page=changes>


Build failed in Jenkins: Phoenix | 4.x-HBase-0.98 #1829

Posted by Apache Jenkins Server <je...@builds.apache.org>.
See <https://builds.apache.org/job/Phoenix-4.x-HBase-0.98/1829/display/redirect?page=changes>

Changes:

[jtaylor] PHOENIX-4640 Don't consider STATS_UPDATE_FREQ_MS_ATTRIB in TTL for

[jtaylor] PHOENIX-4139 Incorrect query result for trailing duplicate GROUP BY

------------------------------------------
[...truncated 118.57 KB...]
	at org.apache.phoenix.index.PhoenixTransactionalIndexer.postBatchMutateIndispensably(PhoenixTransactionalIndexer.java:240)
	at org.apache.hadoop.hbase.regionserver.RegionCoprocessorHost$37.call(RegionCoprocessorHost.java:1040)
	at org.apache.hadoop.hbase.regionserver.RegionCoprocessorHost$RegionOperation.call(RegionCoprocessorHost.java:1656)
	at org.apache.hadoop.hbase.regionserver.RegionCoprocessorHost.execOperation(RegionCoprocessorHost.java:1733)
	at org.apache.hadoop.hbase.regionserver.RegionCoprocessorHost.execOperation(RegionCoprocessorHost.java:1688)
	at org.apache.hadoop.hbase.regionserver.RegionCoprocessorHost.postBatchMutateIndispensably(RegionCoprocessorHost.java:1036)
	at org.apache.hadoop.hbase.regionserver.HRegion.doMiniBatchMutation(HRegion.java:2767)
	at org.apache.hadoop.hbase.regionserver.HRegion.batchMutate(HRegion.java:2359)
	at org.apache.hadoop.hbase.regionserver.HRegion.batchMutate(HRegion.java:2314)
	at org.apache.hadoop.hbase.regionserver.HRegion.batchMutate(HRegion.java:2318)
	at org.apache.hadoop.hbase.regionserver.HRegionServer.doBatchOp(HRegionServer.java:4678)
	at org.apache.hadoop.hbase.regionserver.HRegionServer.doNonAtomicRegionMutation(HRegionServer.java:3835)
	at org.apache.hadoop.hbase.regionserver.HRegionServer.multi(HRegionServer.java:3680)
	at org.apache.hadoop.hbase.protobuf.generated.ClientProtos$ClientService$2.callBlockingMethod(ClientProtos.java:32500)
	at org.apache.hadoop.hbase.ipc.RpcServer.call(RpcServer.java:2195)
	at org.apache.hadoop.hbase.ipc.CallRunner.run(CallRunner.java:104)
	at org.apache.hadoop.hbase.ipc.RpcExecutor.consumerLoop(RpcExecutor.java:133)
	at org.apache.hadoop.hbase.ipc.RpcExecutor$1.run(RpcExecutor.java:108)
	at java.lang.Thread.run(Thread.java:745)
Caused by: org.apache.hadoop.hbase.client.RetriesExhaustedWithDetailsException: Failed 1 action: RegionOpeningException: 1 time, servers with issues: asf921.gq1.ygridcore.net,40816,1520793051929, 
	at org.apache.hadoop.hbase.client.AsyncProcess$BatchErrors.makeException(AsyncProcess.java:211)
	at org.apache.hadoop.hbase.client.AsyncProcess$BatchErrors.access$500(AsyncProcess.java:195)
	at org.apache.hadoop.hbase.client.AsyncProcess.getErrors(AsyncProcess.java:1082)
	at org.apache.hadoop.hbase.client.HConnectionManager$HConnectionImplementation.processBatchCallback(HConnectionManager.java:2479)
	at org.apache.hadoop.hbase.client.HTable.batchCallback(HTable.java:898)
	at org.apache.hadoop.hbase.client.HTable.batchCallback(HTable.java:913)
	at org.apache.hadoop.hbase.client.HTable.batch(HTable.java:888)
	at org.apache.phoenix.hbase.index.write.ParallelWriterIndexCommitter$1.call(ParallelWriterIndexCommitter.java:170)
	at org.apache.phoenix.hbase.index.write.ParallelWriterIndexCommitter$1.call(ParallelWriterIndexCommitter.java:133)
	at java.util.concurrent.FutureTask.run(FutureTask.java:262)
	at java.util.concurrent.ThreadPoolExecutor.runWorker(ThreadPoolExecutor.java:1145)
	at java.util.concurrent.ThreadPoolExecutor$Worker.run(ThreadPoolExecutor.java:615)
	... 1 more
: 1 time, servers with issues: asf921.gq1.ygridcore.net,40816,1520793051929, 
	at org.apache.phoenix.tx.ParameterizedTransactionIT.testNonTxToTxTable(ParameterizedTransactionIT.java:288)
Caused by: org.apache.hadoop.hbase.client.RetriesExhaustedWithDetailsException: 
Failed 1 action: org.apache.hadoop.hbase.DoNotRetryIOException: Failed 1 action: RegionOpeningException: 1 time, servers with issues: asf921.gq1.ygridcore.net,40816,1520793051929, 
	at org.apache.phoenix.util.ServerUtil.createIOException(ServerUtil.java:80)
	at org.apache.phoenix.util.ServerUtil.throwIOException(ServerUtil.java:62)
	at org.apache.phoenix.index.PhoenixTransactionalIndexer.postBatchMutateIndispensably(PhoenixTransactionalIndexer.java:240)
	at org.apache.hadoop.hbase.regionserver.RegionCoprocessorHost$37.call(RegionCoprocessorHost.java:1040)
	at org.apache.hadoop.hbase.regionserver.RegionCoprocessorHost$RegionOperation.call(RegionCoprocessorHost.java:1656)
	at org.apache.hadoop.hbase.regionserver.RegionCoprocessorHost.execOperation(RegionCoprocessorHost.java:1733)
	at org.apache.hadoop.hbase.regionserver.RegionCoprocessorHost.execOperation(RegionCoprocessorHost.java:1688)
	at org.apache.hadoop.hbase.regionserver.RegionCoprocessorHost.postBatchMutateIndispensably(RegionCoprocessorHost.java:1036)
	at org.apache.hadoop.hbase.regionserver.HRegion.doMiniBatchMutation(HRegion.java:2767)
	at org.apache.hadoop.hbase.regionserver.HRegion.batchMutate(HRegion.java:2359)
	at org.apache.hadoop.hbase.regionserver.HRegion.batchMutate(HRegion.java:2314)
	at org.apache.hadoop.hbase.regionserver.HRegion.batchMutate(HRegion.java:2318)
	at org.apache.hadoop.hbase.regionserver.HRegionServer.doBatchOp(HRegionServer.java:4678)
	at org.apache.hadoop.hbase.regionserver.HRegionServer.doNonAtomicRegionMutation(HRegionServer.java:3835)
	at org.apache.hadoop.hbase.regionserver.HRegionServer.multi(HRegionServer.java:3680)
	at org.apache.hadoop.hbase.protobuf.generated.ClientProtos$ClientService$2.callBlockingMethod(ClientProtos.java:32500)
	at org.apache.hadoop.hbase.ipc.RpcServer.call(RpcServer.java:2195)
	at org.apache.hadoop.hbase.ipc.CallRunner.run(CallRunner.java:104)
	at org.apache.hadoop.hbase.ipc.RpcExecutor.consumerLoop(RpcExecutor.java:133)
	at org.apache.hadoop.hbase.ipc.RpcExecutor$1.run(RpcExecutor.java:108)
	at java.lang.Thread.run(Thread.java:745)
Caused by: org.apache.hadoop.hbase.client.RetriesExhaustedWithDetailsException: Failed 1 action: RegionOpeningException: 1 time, servers with issues: asf921.gq1.ygridcore.net,40816,1520793051929, 
	at org.apache.hadoop.hbase.client.AsyncProcess$BatchErrors.makeException(AsyncProcess.java:211)
	at org.apache.hadoop.hbase.client.AsyncProcess$BatchErrors.access$500(AsyncProcess.java:195)
	at org.apache.hadoop.hbase.client.AsyncProcess.getErrors(AsyncProcess.java:1082)
	at org.apache.hadoop.hbase.client.HConnectionManager$HConnectionImplementation.processBatchCallback(HConnectionManager.java:2479)
	at org.apache.hadoop.hbase.client.HTable.batchCallback(HTable.java:898)
	at org.apache.hadoop.hbase.client.HTable.batchCallback(HTable.java:913)
	at org.apache.hadoop.hbase.client.HTable.batch(HTable.java:888)
	at org.apache.phoenix.hbase.index.write.ParallelWriterIndexCommitter$1.call(ParallelWriterIndexCommitter.java:170)
	at org.apache.phoenix.hbase.index.write.ParallelWriterIndexCommitter$1.call(ParallelWriterIndexCommitter.java:133)
	at java.util.concurrent.FutureTask.run(FutureTask.java:262)
	at java.util.concurrent.ThreadPoolExecutor.runWorker(ThreadPoolExecutor.java:1145)
	at java.util.concurrent.ThreadPoolExecutor$Worker.run(ThreadPoolExecutor.java:615)
	... 1 more
: 1 time, servers with issues: asf921.gq1.ygridcore.net,40816,1520793051929, 
	at org.apache.phoenix.tx.ParameterizedTransactionIT.testNonTxToTxTable(ParameterizedTransactionIT.java:288)

[INFO] Tests run: 34, Failures: 0, Errors: 0, Skipped: 0, Time elapsed: 469.715 s - in org.apache.phoenix.end2end.join.SortMergeJoinLocalIndexIT
[INFO] Tests run: 40, Failures: 0, Errors: 0, Skipped: 0, Time elapsed: 221.927 s - in org.apache.phoenix.tx.TxCheckpointIT
[INFO] 
[INFO] Results:
[INFO] 
[ERROR] Errors: 
[ERROR]   ParameterizedTransactionIT.testNonTxToTxTable:288 » Commit org.apache.hadoop.h...
[ERROR]   ParameterizedTransactionIT.testNonTxToTxTable:288 » Commit org.apache.hadoop.h...
[INFO] 
[ERROR] Tests run: 3387, Failures: 0, Errors: 2, Skipped: 7
[INFO] 
[INFO] 
[INFO] --- maven-failsafe-plugin:2.20:integration-test (HBaseManagedTimeTests) @ phoenix-core ---
[INFO] 
[INFO] -------------------------------------------------------
[INFO]  T E S T S
[INFO] -------------------------------------------------------
[INFO] 
[INFO] Results:
[INFO] 
[INFO] Tests run: 0, Failures: 0, Errors: 0, Skipped: 0
[INFO] 
[INFO] 
[INFO] --- maven-failsafe-plugin:2.20:integration-test (NeedTheirOwnClusterTests) @ phoenix-core ---
[INFO] 
[INFO] -------------------------------------------------------
[INFO]  T E S T S
[INFO] -------------------------------------------------------
[INFO] Running org.apache.hadoop.hbase.regionserver.wal.WALReplayWithIndexWritesAndCompressedWALIT
[INFO] Tests run: 1, Failures: 0, Errors: 0, Skipped: 0, Time elapsed: 19.593 s - in org.apache.hadoop.hbase.regionserver.wal.WALReplayWithIndexWritesAndCompressedWALIT
[INFO] Running org.apache.hadoop.hbase.regionserver.wal.WALRecoveryRegionPostOpenIT
[INFO] Tests run: 1, Failures: 0, Errors: 0, Skipped: 0, Time elapsed: 6.629 s - in org.apache.hadoop.hbase.regionserver.wal.WALRecoveryRegionPostOpenIT
[INFO] Running org.apache.phoenix.end2end.ColumnEncodedImmutableTxStatsCollectorIT
[INFO] Running org.apache.phoenix.end2end.ColumnEncodedImmutableNonTxStatsCollectorIT
[INFO] Running org.apache.phoenix.end2end.ColumnEncodedMutableNonTxStatsCollectorIT
[INFO] Running org.apache.phoenix.end2end.ColumnEncodedMutableTxStatsCollectorIT
[INFO] Running org.apache.phoenix.end2end.ConnectionUtilIT
[INFO] Tests run: 1, Failures: 0, Errors: 0, Skipped: 0, Time elapsed: 20.545 s - in org.apache.phoenix.end2end.ConnectionUtilIT
[WARNING] Tests run: 26, Failures: 0, Errors: 0, Skipped: 4, Time elapsed: 74.445 s - in org.apache.phoenix.end2end.ColumnEncodedImmutableNonTxStatsCollectorIT
[WARNING] Tests run: 26, Failures: 0, Errors: 0, Skipped: 4, Time elapsed: 79.495 s - in org.apache.phoenix.end2end.ColumnEncodedImmutableTxStatsCollectorIT
[INFO] Running org.apache.phoenix.end2end.ContextClassloaderIT
[WARNING] Tests run: 26, Failures: 0, Errors: 0, Skipped: 4, Time elapsed: 77.56 s - in org.apache.phoenix.end2end.ColumnEncodedMutableNonTxStatsCollectorIT
[INFO] Tests run: 3, Failures: 0, Errors: 0, Skipped: 0, Time elapsed: 1.922 s - in org.apache.phoenix.end2end.ContextClassloaderIT
[WARNING] Tests run: 26, Failures: 0, Errors: 0, Skipped: 4, Time elapsed: 83.671 s - in org.apache.phoenix.end2end.ColumnEncodedMutableTxStatsCollectorIT
[INFO] Running org.apache.phoenix.end2end.CountDistinctCompressionIT
[INFO] Running org.apache.phoenix.end2end.CsvBulkLoadToolIT
[INFO] Tests run: 1, Failures: 0, Errors: 0, Skipped: 0, Time elapsed: 2.914 s - in org.apache.phoenix.end2end.CountDistinctCompressionIT
[INFO] Running org.apache.phoenix.end2end.DropSchemaIT
[INFO] Tests run: 2, Failures: 0, Errors: 0, Skipped: 0, Time elapsed: 5.614 s - in org.apache.phoenix.end2end.DropSchemaIT
[INFO] Running org.apache.phoenix.end2end.FlappingLocalIndexIT
[INFO] Running org.apache.phoenix.end2end.IndexExtendedIT
[INFO] Running org.apache.phoenix.end2end.IndexScrutinyToolIT
[INFO] Running org.apache.phoenix.end2end.IndexToolForPartialBuildIT
[INFO] Tests run: 12, Failures: 0, Errors: 0, Skipped: 0, Time elapsed: 73.725 s - in org.apache.phoenix.end2end.CsvBulkLoadToolIT
[INFO] Tests run: 32, Failures: 0, Errors: 0, Skipped: 0, Time elapsed: 73.698 s - in org.apache.phoenix.end2end.IndexExtendedIT
[INFO] Running org.apache.phoenix.end2end.IndexToolForPartialBuildWithNamespaceEnabledIT
[INFO] Tests run: 12, Failures: 0, Errors: 0, Skipped: 0, Time elapsed: 114.4 s - in org.apache.phoenix.end2end.FlappingLocalIndexIT
[INFO] Running org.apache.phoenix.end2end.IndexToolIT
[INFO] Running org.apache.phoenix.end2end.LocalIndexSplitMergeIT
[WARNING] Tests run: 2, Failures: 0, Errors: 0, Skipped: 2, Time elapsed: 0.002 s - in org.apache.phoenix.end2end.LocalIndexSplitMergeIT
[INFO] Running org.apache.phoenix.end2end.MigrateSystemTablesToSystemNamespaceIT
[INFO] Tests run: 33, Failures: 0, Errors: 0, Skipped: 0, Time elapsed: 304.484 s - in org.apache.phoenix.end2end.IndexScrutinyToolIT
[INFO] Tests run: 4, Failures: 0, Errors: 0, Skipped: 0, Time elapsed: 204.554 s - in org.apache.phoenix.end2end.MigrateSystemTablesToSystemNamespaceIT
[INFO] Running org.apache.phoenix.end2end.NonColumnEncodedImmutableTxStatsCollectorIT
[INFO] Running org.apache.phoenix.end2end.NonColumnEncodedImmutableNonTxStatsCollectorIT
[WARNING] Tests run: 26, Failures: 0, Errors: 0, Skipped: 4, Time elapsed: 75.924 s - in org.apache.phoenix.end2end.NonColumnEncodedImmutableNonTxStatsCollectorIT
[WARNING] Tests run: 26, Failures: 0, Errors: 0, Skipped: 4, Time elapsed: 77.487 s - in org.apache.phoenix.end2end.NonColumnEncodedImmutableTxStatsCollectorIT
[INFO] Tests run: 32, Failures: 0, Errors: 0, Skipped: 0, Time elapsed: 352.034 s - in org.apache.phoenix.end2end.IndexToolIT
[INFO] Running org.apache.phoenix.end2end.PhoenixDriverIT
[INFO] Running org.apache.phoenix.end2end.QueryTimeoutIT
[INFO] Tests run: 2, Failures: 0, Errors: 0, Skipped: 0, Time elapsed: 8.511 s - in org.apache.phoenix.end2end.QueryTimeoutIT
[INFO] Running org.apache.phoenix.end2end.QueryWithLimitIT
[INFO] Tests run: 2, Failures: 0, Errors: 0, Skipped: 0, Time elapsed: 3.288 s - in org.apache.phoenix.end2end.QueryWithLimitIT
[INFO] Tests run: 4, Failures: 0, Errors: 0, Skipped: 0, Time elapsed: 42.623 s - in org.apache.phoenix.end2end.PhoenixDriverIT
[INFO] Running org.apache.phoenix.end2end.RegexBulkLoadToolIT
[INFO] Running org.apache.phoenix.end2end.RebuildIndexConnectionPropsIT
[INFO] Tests run: 1, Failures: 0, Errors: 0, Skipped: 0, Time elapsed: 0.818 s - in org.apache.phoenix.end2end.RebuildIndexConnectionPropsIT
[INFO] Running org.apache.phoenix.end2end.RenewLeaseIT
[INFO] Tests run: 1, Failures: 0, Errors: 0, Skipped: 0, Time elapsed: 26.218 s - in org.apache.phoenix.end2end.RenewLeaseIT
[INFO] Tests run: 2, Failures: 0, Errors: 0, Skipped: 0, Time elapsed: 575.531 s - in org.apache.phoenix.end2end.IndexToolForPartialBuildIT
[INFO] Running org.apache.phoenix.end2end.SystemTablePermissionsIT
[INFO] Tests run: 10, Failures: 0, Errors: 0, Skipped: 0, Time elapsed: 57.974 s - in org.apache.phoenix.end2end.RegexBulkLoadToolIT
[INFO] Running org.apache.phoenix.end2end.SpillableGroupByIT
[INFO] Tests run: 3, Failures: 0, Errors: 0, Skipped: 0, Time elapsed: 8.68 s - in org.apache.phoenix.end2end.SpillableGroupByIT
[INFO] Running org.apache.phoenix.end2end.SysTableNamespaceMappedStatsCollectorIT
[INFO] Running org.apache.phoenix.end2end.TableSnapshotReadsMapReduceIT
[INFO] Tests run: 3, Failures: 0, Errors: 0, Skipped: 0, Time elapsed: 19.505 s - in org.apache.phoenix.end2end.TableSnapshotReadsMapReduceIT
[INFO] Running org.apache.phoenix.end2end.UpdateCacheAcrossDifferentClientsIT
[INFO] Tests run: 2, Failures: 0, Errors: 0, Skipped: 0, Time elapsed: 574.816 s - in org.apache.phoenix.end2end.IndexToolForPartialBuildWithNamespaceEnabledIT
[INFO] Tests run: 6, Failures: 0, Errors: 0, Skipped: 0, Time elapsed: 20.262 s - in org.apache.phoenix.end2end.UpdateCacheAcrossDifferentClientsIT
[INFO] Tests run: 2, Failures: 0, Errors: 0, Skipped: 0, Time elapsed: 79.353 s - in org.apache.phoenix.end2end.SystemTablePermissionsIT
[WARNING] Tests run: 26, Failures: 0, Errors: 0, Skipped: 4, Time elapsed: 77.388 s - in org.apache.phoenix.end2end.SysTableNamespaceMappedStatsCollectorIT
[INFO] Running org.apache.phoenix.end2end.UserDefinedFunctionsIT
[INFO] Running org.apache.phoenix.end2end.index.ImmutableIndexIT
[INFO] Running org.apache.phoenix.end2end.index.MutableIndexFailureIT
[INFO] Running org.apache.phoenix.end2end.index.LocalIndexIT
[INFO] Running org.apache.phoenix.end2end.index.MutableIndexReplicationIT
[INFO] Tests run: 14, Failures: 0, Errors: 0, Skipped: 0, Time elapsed: 35.265 s - in org.apache.phoenix.end2end.UserDefinedFunctionsIT
[INFO] Tests run: 1, Failures: 0, Errors: 0, Skipped: 0, Time elapsed: 15.977 s - in org.apache.phoenix.end2end.index.MutableIndexReplicationIT
[INFO] Running org.apache.phoenix.end2end.index.PartialIndexRebuilderIT
[INFO] Running org.apache.phoenix.end2end.index.txn.TxWriteFailureIT
[INFO] Tests run: 8, Failures: 0, Errors: 0, Skipped: 0, Time elapsed: 42.313 s - in org.apache.phoenix.end2end.index.txn.TxWriteFailureIT
[INFO] Running org.apache.phoenix.execute.PartialCommitIT
[INFO] Tests run: 12, Failures: 0, Errors: 0, Skipped: 0, Time elapsed: 0.843 s - in org.apache.phoenix.execute.PartialCommitIT
[INFO] Running org.apache.phoenix.execute.UpsertSelectOverlappingBatchesIT
[INFO] Tests run: 25, Failures: 0, Errors: 0, Skipped: 0, Time elapsed: 201.058 s - in org.apache.phoenix.end2end.index.PartialIndexRebuilderIT
[INFO] Running org.apache.phoenix.hbase.index.FailForUnsupportedHBaseVersionsIT
[INFO] Tests run: 2, Failures: 0, Errors: 0, Skipped: 0, Time elapsed: 21.925 s - in org.apache.phoenix.hbase.index.FailForUnsupportedHBaseVersionsIT
[WARNING] Tests run: 40, Failures: 0, Errors: 0, Skipped: 16, Time elapsed: 304.291 s - in org.apache.phoenix.end2end.index.ImmutableIndexIT
[INFO] Tests run: 36, Failures: 0, Errors: 0, Skipped: 0, Time elapsed: 298.613 s - in org.apache.phoenix.end2end.index.LocalIndexIT
[INFO] Running org.apache.phoenix.iterate.RoundRobinResultIteratorWithStatsIT
[INFO] Tests run: 1, Failures: 0, Errors: 0, Skipped: 0, Time elapsed: 4.741 s - in org.apache.phoenix.iterate.RoundRobinResultIteratorWithStatsIT
[INFO] Running org.apache.phoenix.iterate.ScannerLeaseRenewalIT
[INFO] Running org.apache.phoenix.monitoring.PhoenixMetricsIT
[INFO] Running org.apache.phoenix.rpc.PhoenixClientRpcIT
[INFO] Tests run: 2, Failures: 0, Errors: 0, Skipped: 0, Time elapsed: 2.467 s - in org.apache.phoenix.rpc.PhoenixClientRpcIT
[INFO] Tests run: 22, Failures: 0, Errors: 0, Skipped: 0, Time elapsed: 59.963 s - in org.apache.phoenix.monitoring.PhoenixMetricsIT
[INFO] Running org.apache.phoenix.rpc.PhoenixServerRpcIT
[INFO] Tests run: 2, Failures: 0, Errors: 0, Skipped: 0, Time elapsed: 11.671 s - in org.apache.phoenix.rpc.PhoenixServerRpcIT
[INFO] Tests run: 3, Failures: 0, Errors: 0, Skipped: 0, Time elapsed: 223.419 s - in org.apache.phoenix.execute.UpsertSelectOverlappingBatchesIT
[INFO] Tests run: 2, Failures: 0, Errors: 0, Skipped: 0, Time elapsed: 160.552 s - in org.apache.phoenix.iterate.ScannerLeaseRenewalIT
[INFO] Tests run: 21, Failures: 0, Errors: 0, Skipped: 0, Time elapsed: 539.668 s - in org.apache.phoenix.end2end.index.MutableIndexFailureIT
[INFO] 
[INFO] Results:
[INFO] 
[WARNING] Tests run: 547, Failures: 0, Errors: 0, Skipped: 46
[INFO] 
[INFO] 
[INFO] --- maven-failsafe-plugin:2.20:verify (ParallelStatsEnabledTest) @ phoenix-core ---
[INFO] ------------------------------------------------------------------------
[INFO] Reactor Summary:
[INFO] 
[INFO] Apache Phoenix ..................................... SUCCESS [  1.930 s]
[INFO] Phoenix Core ....................................... FAILURE [  01:29 h]
[INFO] Phoenix - Flume .................................... SKIPPED
[INFO] Phoenix - Kafka .................................... SKIPPED
[INFO] Phoenix - Pig ...................................... SKIPPED
[INFO] Phoenix Query Server Client ........................ SKIPPED
[INFO] Phoenix Query Server ............................... SKIPPED
[INFO] Phoenix - Pherf .................................... SKIPPED
[INFO] Phoenix - Spark .................................... SKIPPED
[INFO] Phoenix - Hive ..................................... SKIPPED
[INFO] Phoenix Client ..................................... SKIPPED
[INFO] Phoenix Server ..................................... SKIPPED
[INFO] Phoenix Assembly ................................... SKIPPED
[INFO] Phoenix - Tracing Web Application .................. SKIPPED
[INFO] Phoenix Load Balancer .............................. SKIPPED
[INFO] ------------------------------------------------------------------------
[INFO] BUILD FAILURE
[INFO] ------------------------------------------------------------------------
[INFO] Total time: 01:29 h
[INFO] Finished at: 2018-03-11T18:59:38Z
[INFO] Final Memory: 60M/867M
[INFO] ------------------------------------------------------------------------
[ERROR] Failed to execute goal org.apache.maven.plugins:maven-failsafe-plugin:2.20:verify (ParallelStatsEnabledTest) on project phoenix-core: There are test failures.
[ERROR] 
[ERROR] Please refer to <https://builds.apache.org/job/Phoenix-4.x-HBase-0.98/ws/phoenix-core/target/failsafe-reports> for the individual test results.
[ERROR] Please refer to dump files (if any exist) [date]-jvmRun[N].dump, [date].dumpstream and [date]-jvmRun[N].dumpstream.
[ERROR] -> [Help 1]
[ERROR] 
[ERROR] To see the full stack trace of the errors, re-run Maven with the -e switch.
[ERROR] Re-run Maven using the -X switch to enable full debug logging.
[ERROR] 
[ERROR] For more information about the errors and possible solutions, please read the following articles:
[ERROR] [Help 1] http://cwiki.apache.org/confluence/display/MAVEN/MojoFailureException
[ERROR] 
[ERROR] After correcting the problems, you can resume the build with the command
[ERROR]   mvn <goals> -rf :phoenix-core
Build step 'Invoke top-level Maven targets' marked build as failure
Archiving artifacts
[Fast Archiver] Compressed 1.39 GB of artifacts by 46.4% relative to #1822
[JIRA] Updating issue PHOENIX-4640
[JIRA] Updating issue PHOENIX-4139
Recording test results