You are viewing a plain text version of this content. The canonical link for it is here.
Posted to yarn-dev@hadoop.apache.org by Apache Jenkins Server <je...@builds.apache.org> on 2013/05/30 23:31:25 UTC
Failed: YARN-117 PreCommit Build #1038
Jira: https://issues.apache.org/jira/browse/YARN-117
Build: https://builds.apache.org/job/PreCommit-YARN-Build/1038/
###################################################################################
########################## LAST 60 LINES OF THE CONSOLE ###########################
[...truncated 9 lines...]
no change for http://svn.apache.org/repos/asf/hadoop/nightly since the previous build
No emails were triggered.
[PreCommit-YARN-Build] $ /bin/bash /tmp/hudson852948891728533183.sh
32768
Running in Jenkins mode
======================================================================
======================================================================
Testing patch for YARN-117.
======================================================================
======================================================================
At revision 1488019.
YARN-117 patch is being downloaded at Thu May 30 21:31:20 UTC 2013 from
http://issues.apache.org/jira/secure/attachment/12585482/YARN-117-011.patch
cp: cannot stat `/home/jenkins/buildSupport/lib/*': No such file or directory
The patch does not appear to apply with p0 to p2
PATCH APPLICATION FAILED
{color:red}-1 overall{color}. Here are the results of testing the latest attachment
http://issues.apache.org/jira/secure/attachment/12585482/YARN-117-011.patch
against trunk revision .
{color:red}-1 patch{color}. The patch command could not apply the patch.
Console output: https://builds.apache.org/job/PreCommit-YARN-Build/1038//console
This message is automatically generated.
======================================================================
======================================================================
Adding comment to Jira.
======================================================================
======================================================================
Comment added.
6d4adc3d0ba18a2cafb23a83e64f2a2e396bd1ed logged out
======================================================================
======================================================================
Finished build.
======================================================================
======================================================================
Build step 'Execute shell' marked build as failure
Archiving artifacts
[description-setter] Could not determine description.
Recording test results
Email was triggered for: Failure
Sending email for trigger: Failure
###################################################################################
############################## FAILED TESTS (if any) ##############################
No tests ran.
Success: YARN-684 PreCommit Build #1040
Posted by Apache Jenkins Server <je...@builds.apache.org>.
Jira: https://issues.apache.org/jira/browse/YARN-684
Build: https://builds.apache.org/job/PreCommit-YARN-Build/1040/
###################################################################################
########################## LAST 60 LINES OF THE CONSOLE ###########################
[...truncated 3557 lines...]
/bin/kill -9 18116
kill: No such process
NOP
{color:green}+1 overall{color}. Here are the results of testing the latest attachment
http://issues.apache.org/jira/secure/attachment/12585504/YARN-684.20130530.4.txt
against trunk revision .
{color:green}+1 @author{color}. The patch does not contain any @author tags.
{color:green}+1 tests included{color}. The patch appears to include 28 new or modified test files.
{color:green}+1 javac{color}. The applied patch does not increase the total number of javac compiler warnings.
{color:green}+1 javadoc{color}. The javadoc tool did not generate any warning messages.
{color:green}+1 eclipse:eclipse{color}. The patch built with eclipse:eclipse.
{color:green}+1 findbugs{color}. The patch does not introduce any new Findbugs (version 1.3.9) warnings.
{color:green}+1 release audit{color}. The applied patch does not increase the total number of release audit warnings.
{color:green}+1 core tests{color}. The patch passed unit tests in hadoop-mapreduce-project/hadoop-mapreduce-client/hadoop-mapreduce-client-app hadoop-yarn-project/hadoop-yarn/hadoop-yarn-api hadoop-yarn-project/hadoop-yarn/hadoop-yarn-applications/hadoop-yarn-applications-distributedshell hadoop-yarn-project/hadoop-yarn/hadoop-yarn-client hadoop-yarn-project/hadoop-yarn/hadoop-yarn-common hadoop-yarn-project/hadoop-yarn/hadoop-yarn-server/hadoop-yarn-server-nodemanager hadoop-yarn-project/hadoop-yarn/hadoop-yarn-server/hadoop-yarn-server-resourcemanager hadoop-yarn-project/hadoop-yarn/hadoop-yarn-server/hadoop-yarn-server-tests.
{color:green}+1 contrib tests{color}. The patch passed contrib unit tests.
Test results: https://builds.apache.org/job/PreCommit-YARN-Build/1040//testReport/
Console output: https://builds.apache.org/job/PreCommit-YARN-Build/1040//console
This message is automatically generated.
======================================================================
======================================================================
Adding comment to Jira.
======================================================================
======================================================================
Comment added.
aa4510c0656bd8b56428c9d52761abd3ca028d32 logged out
======================================================================
======================================================================
Finished build.
======================================================================
======================================================================
Archiving artifacts
Description set: YARN-684
Recording test results
Email was triggered for: Success
Sending email for trigger: Success
###################################################################################
############################## FAILED TESTS (if any) ##############################
All tests passed
Failed: YARN-735 PreCommit Build #1039
Posted by Apache Jenkins Server <je...@builds.apache.org>.
Jira: https://issues.apache.org/jira/browse/YARN-735
Build: https://builds.apache.org/job/PreCommit-YARN-Build/1039/
###################################################################################
########################## LAST 60 LINES OF THE CONSOLE ###########################
[...truncated 3833 lines...]
NOP
{color:red}-1 overall{color}. Here are the results of testing the latest attachment
http://issues.apache.org/jira/secure/attachment/12585500/YARN-735.1.patch
against trunk revision .
{color:green}+1 @author{color}. The patch does not contain any @author tags.
{color:green}+1 tests included{color}. The patch appears to include 42 new or modified test files.
{color:green}+1 javac{color}. The applied patch does not increase the total number of javac compiler warnings.
{color:green}+1 javadoc{color}. The javadoc tool did not generate any warning messages.
{color:green}+1 eclipse:eclipse{color}. The patch built with eclipse:eclipse.
{color:green}+1 findbugs{color}. The patch does not introduce any new Findbugs (version 1.3.9) warnings.
{color:green}+1 release audit{color}. The applied patch does not increase the total number of release audit warnings.
{color:red}-1 core tests{color}. The patch failed these unit tests in hadoop-mapreduce-project/hadoop-mapreduce-client/hadoop-mapreduce-client-app hadoop-mapreduce-project/hadoop-mapreduce-client/hadoop-mapreduce-client-hs hadoop-yarn-project/hadoop-yarn/hadoop-yarn-api hadoop-yarn-project/hadoop-yarn/hadoop-yarn-applications/hadoop-yarn-applications-unmanaged-am-launcher hadoop-yarn-project/hadoop-yarn/hadoop-yarn-common hadoop-yarn-project/hadoop-yarn/hadoop-yarn-server/hadoop-yarn-server-nodemanager hadoop-yarn-project/hadoop-yarn/hadoop-yarn-server/hadoop-yarn-server-resourcemanager:
org.apache.hadoop.mapreduce.v2.app.job.impl.TestJobImpl
{color:green}+1 contrib tests{color}. The patch passed contrib unit tests.
Test results: https://builds.apache.org/job/PreCommit-YARN-Build/1039//testReport/
Console output: https://builds.apache.org/job/PreCommit-YARN-Build/1039//console
This message is automatically generated.
======================================================================
======================================================================
Adding comment to Jira.
======================================================================
======================================================================
Comment added.
2fa698ffe010e35f8c2b65af072609c508aeb6d3 logged out
======================================================================
======================================================================
Finished build.
======================================================================
======================================================================
Build step 'Execute shell' marked build as failure
Archiving artifacts
[description-setter] Could not determine description.
Recording test results
Email was triggered for: Failure
Sending email for trigger: Failure
###################################################################################
############################## FAILED TESTS (if any) ##############################
10 tests failed.
FAILED: org.apache.hadoop.mapreduce.v2.app.job.impl.TestJobImpl.testCommitJobFailsJob
Error Message:
null
Stack Trace:
java.lang.NullPointerException
at com.google.common.base.Preconditions.checkNotNull(Preconditions.java:187)
at org.apache.hadoop.yarn.api.records.impl.pb.ApplicationAttemptIdPBImpl.getAttemptId(ApplicationAttemptIdPBImpl.java:48)
at org.apache.hadoop.mapreduce.v2.app.job.impl.JobImpl$InitTransition.createMapTasks(JobImpl.java:1428)
at org.apache.hadoop.mapreduce.v2.app.job.impl.JobImpl$InitTransition.transition(JobImpl.java:1369)
at org.apache.hadoop.mapreduce.v2.app.job.impl.JobImpl$InitTransition.transition(JobImpl.java:1291)
at org.apache.hadoop.yarn.state.StateMachineFactory$MultipleInternalArc.doTransition(StateMachineFactory.java:382)
at org.apache.hadoop.yarn.state.StateMachineFactory.doTransition(StateMachineFactory.java:299)
at org.apache.hadoop.yarn.state.StateMachineFactory.access$300(StateMachineFactory.java:43)
at org.apache.hadoop.yarn.state.StateMachineFactory$InternalStateMachine.doTransition(StateMachineFactory.java:445)
at org.apache.hadoop.mapreduce.v2.app.job.impl.JobImpl.handle(JobImpl.java:922)
at org.apache.hadoop.mapreduce.v2.app.job.impl.TestJobImpl.createRunningStubbedJob(TestJobImpl.java:666)
at org.apache.hadoop.mapreduce.v2.app.job.impl.TestJobImpl.testCommitJobFailsJob(TestJobImpl.java:165)
at sun.reflect.NativeMethodAccessorImpl.invoke0(Native Method)
at sun.reflect.NativeMethodAccessorImpl.invoke(NativeMethodAccessorImpl.java:39)
at sun.reflect.DelegatingMethodAccessorImpl.invoke(DelegatingMethodAccessorImpl.java:25)
at java.lang.reflect.Method.invoke(Method.java:597)
at org.junit.runners.model.FrameworkMethod$1.runReflectiveCall(FrameworkMethod.java:45)
at org.junit.internal.runners.model.ReflectiveCallable.run(ReflectiveCallable.java:15)
at org.junit.runners.model.FrameworkMethod.invokeExplosively(FrameworkMethod.java:42)
at org.junit.internal.runners.statements.InvokeMethod.evaluate(InvokeMethod.java:20)
at org.junit.internal.runners.statements.FailOnTimeout$StatementThread.run(FailOnTimeout.java:62)
FAILED: org.apache.hadoop.mapreduce.v2.app.job.impl.TestJobImpl.testCheckJobCompleteSuccess
Error Message:
null
Stack Trace:
java.lang.NullPointerException
at com.google.common.base.Preconditions.checkNotNull(Preconditions.java:187)
at org.apache.hadoop.yarn.api.records.impl.pb.ApplicationAttemptIdPBImpl.getAttemptId(ApplicationAttemptIdPBImpl.java:48)
at org.apache.hadoop.mapreduce.v2.app.job.impl.JobImpl$InitTransition.createMapTasks(JobImpl.java:1428)
at org.apache.hadoop.mapreduce.v2.app.job.impl.JobImpl$InitTransition.transition(JobImpl.java:1369)
at org.apache.hadoop.mapreduce.v2.app.job.impl.JobImpl$InitTransition.transition(JobImpl.java:1291)
at org.apache.hadoop.yarn.state.StateMachineFactory$MultipleInternalArc.doTransition(StateMachineFactory.java:382)
at org.apache.hadoop.yarn.state.StateMachineFactory.doTransition(StateMachineFactory.java:299)
at org.apache.hadoop.yarn.state.StateMachineFactory.access$300(StateMachineFactory.java:43)
at org.apache.hadoop.yarn.state.StateMachineFactory$InternalStateMachine.doTransition(StateMachineFactory.java:445)
at org.apache.hadoop.mapreduce.v2.app.job.impl.JobImpl.handle(JobImpl.java:922)
at org.apache.hadoop.mapreduce.v2.app.job.impl.TestJobImpl.createRunningStubbedJob(TestJobImpl.java:666)
at org.apache.hadoop.mapreduce.v2.app.job.impl.TestJobImpl.testCheckJobCompleteSuccess(TestJobImpl.java:190)
at sun.reflect.NativeMethodAccessorImpl.invoke0(Native Method)
at sun.reflect.NativeMethodAccessorImpl.invoke(NativeMethodAccessorImpl.java:39)
at sun.reflect.DelegatingMethodAccessorImpl.invoke(DelegatingMethodAccessorImpl.java:25)
at java.lang.reflect.Method.invoke(Method.java:597)
at org.junit.runners.model.FrameworkMethod$1.runReflectiveCall(FrameworkMethod.java:45)
at org.junit.internal.runners.model.ReflectiveCallable.run(ReflectiveCallable.java:15)
at org.junit.runners.model.FrameworkMethod.invokeExplosively(FrameworkMethod.java:42)
at org.junit.internal.runners.statements.InvokeMethod.evaluate(InvokeMethod.java:20)
at org.junit.internal.runners.statements.FailOnTimeout$StatementThread.run(FailOnTimeout.java:62)
FAILED: org.apache.hadoop.mapreduce.v2.app.job.impl.TestJobImpl.testRebootedDuringSetup
Error Message:
null
Stack Trace:
java.lang.NullPointerException
at com.google.common.base.Preconditions.checkNotNull(Preconditions.java:187)
at org.apache.hadoop.yarn.api.records.impl.pb.ApplicationAttemptIdPBImpl.getAttemptId(ApplicationAttemptIdPBImpl.java:48)
at org.apache.hadoop.mapreduce.v2.app.job.impl.JobImpl$InitTransition.createMapTasks(JobImpl.java:1428)
at org.apache.hadoop.mapreduce.v2.app.job.impl.JobImpl$InitTransition.transition(JobImpl.java:1369)
at org.apache.hadoop.mapreduce.v2.app.job.impl.JobImpl$InitTransition.transition(JobImpl.java:1291)
at org.apache.hadoop.yarn.state.StateMachineFactory$MultipleInternalArc.doTransition(StateMachineFactory.java:382)
at org.apache.hadoop.yarn.state.StateMachineFactory.doTransition(StateMachineFactory.java:299)
at org.apache.hadoop.yarn.state.StateMachineFactory.access$300(StateMachineFactory.java:43)
at org.apache.hadoop.yarn.state.StateMachineFactory$InternalStateMachine.doTransition(StateMachineFactory.java:445)
at org.apache.hadoop.mapreduce.v2.app.job.impl.JobImpl.handle(JobImpl.java:922)
at org.apache.hadoop.mapreduce.v2.app.job.impl.TestJobImpl.testRebootedDuringSetup(TestJobImpl.java:227)
at sun.reflect.NativeMethodAccessorImpl.invoke0(Native Method)
at sun.reflect.NativeMethodAccessorImpl.invoke(NativeMethodAccessorImpl.java:39)
at sun.reflect.DelegatingMethodAccessorImpl.invoke(DelegatingMethodAccessorImpl.java:25)
at java.lang.reflect.Method.invoke(Method.java:597)
at org.junit.runners.model.FrameworkMethod$1.runReflectiveCall(FrameworkMethod.java:45)
at org.junit.internal.runners.model.ReflectiveCallable.run(ReflectiveCallable.java:15)
at org.junit.runners.model.FrameworkMethod.invokeExplosively(FrameworkMethod.java:42)
at org.junit.internal.runners.statements.InvokeMethod.evaluate(InvokeMethod.java:20)
at org.junit.internal.runners.statements.FailOnTimeout$StatementThread.run(FailOnTimeout.java:62)
FAILED: org.apache.hadoop.mapreduce.v2.app.job.impl.TestJobImpl.testRebootedDuringCommit
Error Message:
null
Stack Trace:
java.lang.NullPointerException
at com.google.common.base.Preconditions.checkNotNull(Preconditions.java:187)
at org.apache.hadoop.yarn.api.records.impl.pb.ApplicationAttemptIdPBImpl.getAttemptId(ApplicationAttemptIdPBImpl.java:48)
at org.apache.hadoop.mapreduce.v2.app.job.impl.JobImpl$InitTransition.createMapTasks(JobImpl.java:1428)
at org.apache.hadoop.mapreduce.v2.app.job.impl.JobImpl$InitTransition.transition(JobImpl.java:1369)
at org.apache.hadoop.mapreduce.v2.app.job.impl.JobImpl$InitTransition.transition(JobImpl.java:1291)
at org.apache.hadoop.yarn.state.StateMachineFactory$MultipleInternalArc.doTransition(StateMachineFactory.java:382)
at org.apache.hadoop.yarn.state.StateMachineFactory.doTransition(StateMachineFactory.java:299)
at org.apache.hadoop.yarn.state.StateMachineFactory.access$300(StateMachineFactory.java:43)
at org.apache.hadoop.yarn.state.StateMachineFactory$InternalStateMachine.doTransition(StateMachineFactory.java:445)
at org.apache.hadoop.mapreduce.v2.app.job.impl.JobImpl.handle(JobImpl.java:922)
at org.apache.hadoop.mapreduce.v2.app.job.impl.TestJobImpl.createRunningStubbedJob(TestJobImpl.java:666)
at org.apache.hadoop.mapreduce.v2.app.job.impl.TestJobImpl.testRebootedDuringCommit(TestJobImpl.java:252)
at sun.reflect.NativeMethodAccessorImpl.invoke0(Native Method)
at sun.reflect.NativeMethodAccessorImpl.invoke(NativeMethodAccessorImpl.java:39)
at sun.reflect.DelegatingMethodAccessorImpl.invoke(DelegatingMethodAccessorImpl.java:25)
at java.lang.reflect.Method.invoke(Method.java:597)
at org.junit.runners.model.FrameworkMethod$1.runReflectiveCall(FrameworkMethod.java:45)
at org.junit.internal.runners.model.ReflectiveCallable.run(ReflectiveCallable.java:15)
at org.junit.runners.model.FrameworkMethod.invokeExplosively(FrameworkMethod.java:42)
at org.junit.internal.runners.statements.InvokeMethod.evaluate(InvokeMethod.java:20)
at org.junit.internal.runners.statements.FailOnTimeout$StatementThread.run(FailOnTimeout.java:62)
FAILED: org.apache.hadoop.mapreduce.v2.app.job.impl.TestJobImpl.testKilledDuringSetup
Error Message:
null
Stack Trace:
java.lang.NullPointerException
at com.google.common.base.Preconditions.checkNotNull(Preconditions.java:187)
at org.apache.hadoop.yarn.api.records.impl.pb.ApplicationAttemptIdPBImpl.getAttemptId(ApplicationAttemptIdPBImpl.java:48)
at org.apache.hadoop.mapreduce.v2.app.job.impl.JobImpl$InitTransition.createMapTasks(JobImpl.java:1428)
at org.apache.hadoop.mapreduce.v2.app.job.impl.JobImpl$InitTransition.transition(JobImpl.java:1369)
at org.apache.hadoop.mapreduce.v2.app.job.impl.JobImpl$InitTransition.transition(JobImpl.java:1291)
at org.apache.hadoop.yarn.state.StateMachineFactory$MultipleInternalArc.doTransition(StateMachineFactory.java:382)
at org.apache.hadoop.yarn.state.StateMachineFactory.doTransition(StateMachineFactory.java:299)
at org.apache.hadoop.yarn.state.StateMachineFactory.access$300(StateMachineFactory.java:43)
at org.apache.hadoop.yarn.state.StateMachineFactory$InternalStateMachine.doTransition(StateMachineFactory.java:445)
at org.apache.hadoop.mapreduce.v2.app.job.impl.JobImpl.handle(JobImpl.java:922)
at org.apache.hadoop.mapreduce.v2.app.job.impl.TestJobImpl.testKilledDuringSetup(TestJobImpl.java:289)
at sun.reflect.NativeMethodAccessorImpl.invoke0(Native Method)
at sun.reflect.NativeMethodAccessorImpl.invoke(NativeMethodAccessorImpl.java:39)
at sun.reflect.DelegatingMethodAccessorImpl.invoke(DelegatingMethodAccessorImpl.java:25)
at java.lang.reflect.Method.invoke(Method.java:597)
at org.junit.runners.model.FrameworkMethod$1.runReflectiveCall(FrameworkMethod.java:45)
at org.junit.internal.runners.model.ReflectiveCallable.run(ReflectiveCallable.java:15)
at org.junit.runners.model.FrameworkMethod.invokeExplosively(FrameworkMethod.java:42)
at org.junit.internal.runners.statements.InvokeMethod.evaluate(InvokeMethod.java:20)
at org.junit.internal.runners.statements.FailOnTimeout$StatementThread.run(FailOnTimeout.java:62)
FAILED: org.apache.hadoop.mapreduce.v2.app.job.impl.TestJobImpl.testKilledDuringCommit
Error Message:
null
Stack Trace:
java.lang.NullPointerException
at com.google.common.base.Preconditions.checkNotNull(Preconditions.java:187)
at org.apache.hadoop.yarn.api.records.impl.pb.ApplicationAttemptIdPBImpl.getAttemptId(ApplicationAttemptIdPBImpl.java:48)
at org.apache.hadoop.mapreduce.v2.app.job.impl.JobImpl$InitTransition.createMapTasks(JobImpl.java:1428)
at org.apache.hadoop.mapreduce.v2.app.job.impl.JobImpl$InitTransition.transition(JobImpl.java:1369)
at org.apache.hadoop.mapreduce.v2.app.job.impl.JobImpl$InitTransition.transition(JobImpl.java:1291)
at org.apache.hadoop.yarn.state.StateMachineFactory$MultipleInternalArc.doTransition(StateMachineFactory.java:382)
at org.apache.hadoop.yarn.state.StateMachineFactory.doTransition(StateMachineFactory.java:299)
at org.apache.hadoop.yarn.state.StateMachineFactory.access$300(StateMachineFactory.java:43)
at org.apache.hadoop.yarn.state.StateMachineFactory$InternalStateMachine.doTransition(StateMachineFactory.java:445)
at org.apache.hadoop.mapreduce.v2.app.job.impl.JobImpl.handle(JobImpl.java:922)
at org.apache.hadoop.mapreduce.v2.app.job.impl.TestJobImpl.createRunningStubbedJob(TestJobImpl.java:666)
at org.apache.hadoop.mapreduce.v2.app.job.impl.TestJobImpl.testKilledDuringCommit(TestJobImpl.java:314)
at sun.reflect.NativeMethodAccessorImpl.invoke0(Native Method)
at sun.reflect.NativeMethodAccessorImpl.invoke(NativeMethodAccessorImpl.java:39)
at sun.reflect.DelegatingMethodAccessorImpl.invoke(DelegatingMethodAccessorImpl.java:25)
at java.lang.reflect.Method.invoke(Method.java:597)
at org.junit.runners.model.FrameworkMethod$1.runReflectiveCall(FrameworkMethod.java:45)
at org.junit.internal.runners.model.ReflectiveCallable.run(ReflectiveCallable.java:15)
at org.junit.runners.model.FrameworkMethod.invokeExplosively(FrameworkMethod.java:42)
at org.junit.internal.runners.statements.InvokeMethod.evaluate(InvokeMethod.java:20)
at org.junit.internal.runners.statements.FailOnTimeout$StatementThread.run(FailOnTimeout.java:62)
FAILED: org.apache.hadoop.mapreduce.v2.app.job.impl.TestJobImpl.testKilledDuringFailAbort
Error Message:
null
Stack Trace:
java.lang.NullPointerException
at com.google.common.base.Preconditions.checkNotNull(Preconditions.java:187)
at org.apache.hadoop.yarn.api.records.impl.pb.ApplicationAttemptIdPBImpl.getAttemptId(ApplicationAttemptIdPBImpl.java:48)
at org.apache.hadoop.mapreduce.v2.app.job.impl.JobImpl$InitTransition.createMapTasks(JobImpl.java:1428)
at org.apache.hadoop.mapreduce.v2.app.job.impl.JobImpl$InitTransition.transition(JobImpl.java:1369)
at org.apache.hadoop.mapreduce.v2.app.job.impl.JobImpl$InitTransition.transition(JobImpl.java:1291)
at org.apache.hadoop.yarn.state.StateMachineFactory$MultipleInternalArc.doTransition(StateMachineFactory.java:382)
at org.apache.hadoop.yarn.state.StateMachineFactory.doTransition(StateMachineFactory.java:299)
at org.apache.hadoop.yarn.state.StateMachineFactory.access$300(StateMachineFactory.java:43)
at org.apache.hadoop.yarn.state.StateMachineFactory$InternalStateMachine.doTransition(StateMachineFactory.java:445)
at org.apache.hadoop.mapreduce.v2.app.job.impl.JobImpl.handle(JobImpl.java:922)
at org.apache.hadoop.mapreduce.v2.app.job.impl.TestJobImpl.testKilledDuringFailAbort(TestJobImpl.java:356)
at sun.reflect.NativeMethodAccessorImpl.invoke0(Native Method)
at sun.reflect.NativeMethodAccessorImpl.invoke(NativeMethodAccessorImpl.java:39)
at sun.reflect.DelegatingMethodAccessorImpl.invoke(DelegatingMethodAccessorImpl.java:25)
at java.lang.reflect.Method.invoke(Method.java:597)
at org.junit.runners.model.FrameworkMethod$1.runReflectiveCall(FrameworkMethod.java:45)
at org.junit.internal.runners.model.ReflectiveCallable.run(ReflectiveCallable.java:15)
at org.junit.runners.model.FrameworkMethod.invokeExplosively(FrameworkMethod.java:42)
at org.junit.internal.runners.statements.InvokeMethod.evaluate(InvokeMethod.java:20)
at org.junit.internal.runners.statements.FailOnTimeout$StatementThread.run(FailOnTimeout.java:62)
FAILED: org.apache.hadoop.mapreduce.v2.app.job.impl.TestJobImpl.testKilledDuringKillAbort
Error Message:
null
Stack Trace:
java.lang.NullPointerException
at com.google.common.base.Preconditions.checkNotNull(Preconditions.java:187)
at org.apache.hadoop.yarn.api.records.impl.pb.ApplicationAttemptIdPBImpl.getAttemptId(ApplicationAttemptIdPBImpl.java:48)
at org.apache.hadoop.mapreduce.v2.app.job.impl.JobImpl$InitTransition.createMapTasks(JobImpl.java:1428)
at org.apache.hadoop.mapreduce.v2.app.job.impl.JobImpl$InitTransition.transition(JobImpl.java:1369)
at org.apache.hadoop.mapreduce.v2.app.job.impl.JobImpl$InitTransition.transition(JobImpl.java:1291)
at org.apache.hadoop.yarn.state.StateMachineFactory$MultipleInternalArc.doTransition(StateMachineFactory.java:382)
at org.apache.hadoop.yarn.state.StateMachineFactory.doTransition(StateMachineFactory.java:299)
at org.apache.hadoop.yarn.state.StateMachineFactory.access$300(StateMachineFactory.java:43)
at org.apache.hadoop.yarn.state.StateMachineFactory$InternalStateMachine.doTransition(StateMachineFactory.java:445)
at org.apache.hadoop.mapreduce.v2.app.job.impl.JobImpl.handle(JobImpl.java:922)
at org.apache.hadoop.mapreduce.v2.app.job.impl.TestJobImpl.testKilledDuringKillAbort(TestJobImpl.java:393)
at sun.reflect.NativeMethodAccessorImpl.invoke0(Native Method)
at sun.reflect.NativeMethodAccessorImpl.invoke(NativeMethodAccessorImpl.java:39)
at sun.reflect.DelegatingMethodAccessorImpl.invoke(DelegatingMethodAccessorImpl.java:25)
at java.lang.reflect.Method.invoke(Method.java:597)
at org.junit.runners.model.FrameworkMethod$1.runReflectiveCall(FrameworkMethod.java:45)
at org.junit.internal.runners.model.ReflectiveCallable.run(ReflectiveCallable.java:15)
at org.junit.runners.model.FrameworkMethod.invokeExplosively(FrameworkMethod.java:42)
at org.junit.internal.runners.statements.InvokeMethod.evaluate(InvokeMethod.java:20)
at org.junit.internal.runners.statements.FailOnTimeout$StatementThread.run(FailOnTimeout.java:62)
FAILED: org.apache.hadoop.mapreduce.v2.app.job.impl.TestJobImpl.testUberDecision
Error Message:
null
Stack Trace:
java.lang.NullPointerException
at com.google.common.base.Preconditions.checkNotNull(Preconditions.java:187)
at org.apache.hadoop.yarn.api.records.impl.pb.ApplicationAttemptIdPBImpl.getAttemptId(ApplicationAttemptIdPBImpl.java:48)
at org.apache.hadoop.mapreduce.v2.app.job.impl.JobImpl$InitTransition.createMapTasks(JobImpl.java:1428)
at org.apache.hadoop.mapreduce.v2.app.job.impl.JobImpl$InitTransition.transition(JobImpl.java:1369)
at org.apache.hadoop.mapreduce.v2.app.job.impl.TestJobImpl.testUberDecision(TestJobImpl.java:566)
at org.apache.hadoop.mapreduce.v2.app.job.impl.TestJobImpl.testUberDecision(TestJobImpl.java:521)
at sun.reflect.NativeMethodAccessorImpl.invoke0(Native Method)
at sun.reflect.NativeMethodAccessorImpl.invoke(NativeMethodAccessorImpl.java:39)
at sun.reflect.DelegatingMethodAccessorImpl.invoke(DelegatingMethodAccessorImpl.java:25)
at java.lang.reflect.Method.invoke(Method.java:597)
at org.junit.runners.model.FrameworkMethod$1.runReflectiveCall(FrameworkMethod.java:45)
at org.junit.internal.runners.model.ReflectiveCallable.run(ReflectiveCallable.java:15)
at org.junit.runners.model.FrameworkMethod.invokeExplosively(FrameworkMethod.java:42)
at org.junit.internal.runners.statements.InvokeMethod.evaluate(InvokeMethod.java:20)
at org.junit.internal.runners.statements.RunBefores.evaluate(RunBefores.java:28)
at org.junit.runners.ParentRunner.runLeaf(ParentRunner.java:263)
at org.junit.runners.BlockJUnit4ClassRunner.runChild(BlockJUnit4ClassRunner.java:68)
at org.junit.runners.BlockJUnit4ClassRunner.runChild(BlockJUnit4ClassRunner.java:47)
at org.junit.runners.ParentRunner$3.run(ParentRunner.java:231)
at org.junit.runners.ParentRunner$1.schedule(ParentRunner.java:60)
at org.junit.runners.ParentRunner.runChildren(ParentRunner.java:229)
at org.junit.runners.ParentRunner.access$000(ParentRunner.java:50)
at org.junit.runners.ParentRunner$2.evaluate(ParentRunner.java:222)
at org.junit.internal.runners.statements.RunBefores.evaluate(RunBefores.java:28)
at org.junit.runners.ParentRunner.run(ParentRunner.java:300)
at org.apache.maven.surefire.junit4.JUnit4Provider.execute(JUnit4Provider.java:252)
at org.apache.maven.surefire.junit4.JUnit4Provider.executeTestSet(JUnit4Provider.java:141)
at org.apache.maven.surefire.junit4.JUnit4Provider.invoke(JUnit4Provider.java:112)
at sun.reflect.NativeMethodAccessorImpl.invoke0(Native Method)
at sun.reflect.NativeMethodAccessorImpl.invoke(NativeMethodAccessorImpl.java:39)
at sun.reflect.DelegatingMethodAccessorImpl.invoke(DelegatingMethodAccessorImpl.java:25)
at java.lang.reflect.Method.invoke(Method.java:597)
at org.apache.maven.surefire.util.ReflectionUtils.invokeMethodWithArray(ReflectionUtils.java:189)
at org.apache.maven.surefire.booter.ProviderFactory$ProviderProxy.invoke(ProviderFactory.java:165)
at org.apache.maven.surefire.booter.ProviderFactory.invokeProvider(ProviderFactory.java:85)
at org.apache.maven.surefire.booter.ForkedBooter.runSuitesInProcess(ForkedBooter.java:115)
at org.apache.maven.surefire.booter.ForkedBooter.main(ForkedBooter.java:75)
FAILED: org.apache.hadoop.mapreduce.v2.app.job.impl.TestJobImpl.testTransitionsAtFailed
Error Message:
null
Stack Trace:
java.lang.NullPointerException
at com.google.common.base.Preconditions.checkNotNull(Preconditions.java:187)
at org.apache.hadoop.yarn.api.records.impl.pb.ApplicationAttemptIdPBImpl.getAttemptId(ApplicationAttemptIdPBImpl.java:48)
at org.apache.hadoop.mapreduce.v2.app.job.impl.JobImpl$InitTransition.createMapTasks(JobImpl.java:1428)
at org.apache.hadoop.mapreduce.v2.app.job.impl.JobImpl$InitTransition.transition(JobImpl.java:1369)
at org.apache.hadoop.mapreduce.v2.app.job.impl.JobImpl$InitTransition.transition(JobImpl.java:1291)
at org.apache.hadoop.yarn.state.StateMachineFactory$MultipleInternalArc.doTransition(StateMachineFactory.java:382)
at org.apache.hadoop.yarn.state.StateMachineFactory.doTransition(StateMachineFactory.java:299)
at org.apache.hadoop.yarn.state.StateMachineFactory.access$300(StateMachineFactory.java:43)
at org.apache.hadoop.yarn.state.StateMachineFactory$InternalStateMachine.doTransition(StateMachineFactory.java:445)
at org.apache.hadoop.mapreduce.v2.app.job.impl.JobImpl.handle(JobImpl.java:922)
at org.apache.hadoop.mapreduce.v2.app.job.impl.TestJobImpl.testTransitionsAtFailed(TestJobImpl.java:602)
at sun.reflect.NativeMethodAccessorImpl.invoke0(Native Method)
at sun.reflect.NativeMethodAccessorImpl.invoke(NativeMethodAccessorImpl.java:39)
at sun.reflect.DelegatingMethodAccessorImpl.invoke(DelegatingMethodAccessorImpl.java:25)
at java.lang.reflect.Method.invoke(Method.java:597)
at org.junit.runners.model.FrameworkMethod$1.runReflectiveCall(FrameworkMethod.java:45)
at org.junit.internal.runners.model.ReflectiveCallable.run(ReflectiveCallable.java:15)
at org.junit.runners.model.FrameworkMethod.invokeExplosively(FrameworkMethod.java:42)
at org.junit.internal.runners.statements.InvokeMethod.evaluate(InvokeMethod.java:20)
at org.junit.internal.runners.statements.RunBefores.evaluate(RunBefores.java:28)
at org.junit.runners.ParentRunner.runLeaf(ParentRunner.java:263)
at org.junit.runners.BlockJUnit4ClassRunner.runChild(BlockJUnit4ClassRunner.java:68)
at org.junit.runners.BlockJUnit4ClassRunner.runChild(BlockJUnit4ClassRunner.java:47)
at org.junit.runners.ParentRunner$3.run(ParentRunner.java:231)
at org.junit.runners.ParentRunner$1.schedule(ParentRunner.java:60)
at org.junit.runners.ParentRunner.runChildren(ParentRunner.java:229)
at org.junit.runners.ParentRunner.access$000(ParentRunner.java:50)
at org.junit.runners.ParentRunner$2.evaluate(ParentRunner.java:222)
at org.junit.internal.runners.statements.RunBefores.evaluate(RunBefores.java:28)
at org.junit.runners.ParentRunner.run(ParentRunner.java:300)
at org.apache.maven.surefire.junit4.JUnit4Provider.execute(JUnit4Provider.java:252)
at org.apache.maven.surefire.junit4.JUnit4Provider.executeTestSet(JUnit4Provider.java:141)
at org.apache.maven.surefire.junit4.JUnit4Provider.invoke(JUnit4Provider.java:112)
at sun.reflect.NativeMethodAccessorImpl.invoke0(Native Method)
at sun.reflect.NativeMethodAccessorImpl.invoke(NativeMethodAccessorImpl.java:39)
at sun.reflect.DelegatingMethodAccessorImpl.invoke(DelegatingMethodAccessorImpl.java:25)
at java.lang.reflect.Method.invoke(Method.java:597)
at org.apache.maven.surefire.util.ReflectionUtils.invokeMethodWithArray(ReflectionUtils.java:189)
at org.apache.maven.surefire.booter.ProviderFactory$ProviderProxy.invoke(ProviderFactory.java:165)
at org.apache.maven.surefire.booter.ProviderFactory.invokeProvider(ProviderFactory.java:85)
at org.apache.maven.surefire.booter.ForkedBooter.runSuitesInProcess(ForkedBooter.java:115)
at org.apache.maven.surefire.booter.ForkedBooter.main(ForkedBooter.java:75)