You are viewing a plain text version of this content. The canonical link for it is here.
Posted to commits@beam.apache.org by Apache Jenkins Server <je...@builds.apache.org> on 2018/10/11 18:47:11 UTC
Build failed in Jenkins: beam_PostCommit_Java_Nexmark_Spark #733
See <https://builds.apache.org/job/beam_PostCommit_Java_Nexmark_Spark/733/display/redirect?page=changes>
Changes:
[scott] [BEAM-5717] Only pass PR ID to Gradle if available
[scott] Trim PR ID property before checking for truthiness
------------------------------------------
[...truncated 105.40 KB...]
Custom actions are attached to task ':beam-sdks-java-extensions-join-library:compileJava'.
All input files are considered out-of-date for incremental task ':beam-sdks-java-extensions-join-library:compileJava'.
Full recompilation is required because no incremental change information is available. This is usually caused by clean builds or changing compiler arguments.
Compiling with error-prone compiler
Note: <https://builds.apache.org/job/beam_PostCommit_Java_Nexmark_Spark/ws/src/sdks/java/extensions/join-library/src/main/java/org/apache/beam/sdk/extensions/joinlibrary/Join.java> uses unchecked or unsafe operations.
Note: Recompile with -Xlint:unchecked for details.
Created classpath snapshot for incremental compilation in 3.618 secs. 39 duplicate classes found in classpath (see all with --debug).
Packing task ':beam-sdks-java-extensions-join-library:compileJava'
:beam-sdks-java-extensions-join-library:compileJava (Thread[Task worker for ':' Thread 8,5,main]) completed. Took 9.28 secs.
> Task :beam-sdks-java-extensions-protobuf:compileJava
Build cache key for task ':beam-sdks-java-extensions-protobuf:compileJava' is 9a75491097eab4a9fb2283a78282a2b5
Task ':beam-sdks-java-extensions-protobuf:compileJava' is not up-to-date because:
No history is available.
Custom actions are attached to task ':beam-sdks-java-extensions-protobuf:compileJava'.
All input files are considered out-of-date for incremental task ':beam-sdks-java-extensions-protobuf:compileJava'.
Full recompilation is required because no incremental change information is available. This is usually caused by clean builds or changing compiler arguments.
file or directory '<https://builds.apache.org/job/beam_PostCommit_Java_Nexmark_Spark/ws/src/sdks/java/extensions/protobuf/build/generated/source/proto/main/java',> not found
file or directory '<https://builds.apache.org/job/beam_PostCommit_Java_Nexmark_Spark/ws/src/sdks/java/extensions/protobuf/build/generated/source/proto/main/grpc',> not found
Compiling with error-prone compiler
Note: Some input files use or override a deprecated API.
Note: Recompile with -Xlint:deprecation for details.
Created classpath snapshot for incremental compilation in 3.202 secs. 39 duplicate classes found in classpath (see all with --debug).
Packing task ':beam-sdks-java-extensions-protobuf:compileJava'
:beam-runners-local-java-core:classes (Thread[Task worker for ':' Thread 5,5,main]) started.
:beam-sdks-java-extensions-protobuf:compileJava (Thread[Task worker for ':' Thread 9,5,main]) completed. Took 8.962 secs.
> Task :beam-vendor-sdks-java-extensions-protobuf:compileJava
Created classpath snapshot for incremental compilation in 3.17 secs. 39 duplicate classes found in classpath (see all with --debug).
Packing task ':beam-vendor-sdks-java-extensions-protobuf:compileJava'
:beam-vendor-sdks-java-extensions-protobuf:compileJava (Thread[Task worker for ':' Thread 10,5,main]) completed. Took 9.282 secs.
> Task :beam-runners-local-java-core:classes
Skipping task ':beam-runners-local-java-core:classes' as it has no actions.
:beam-sdks-java-extensions-protobuf:classes (Thread[Task worker for ':' Thread 9,5,main]) started.
:beam-runners-local-java-core:classes (Thread[Task worker for ':' Thread 5,5,main]) completed. Took 0.0 secs.
:beam-vendor-sdks-java-extensions-protobuf:classes (Thread[Task worker for ':' Thread 10,5,main]) started.
> Task :beam-sdks-java-extensions-protobuf:classes
Skipping task ':beam-sdks-java-extensions-protobuf:classes' as it has no actions.
:beam-sdks-java-extensions-protobuf:classes (Thread[Task worker for ':' Thread 9,5,main]) completed. Took 0.0 secs.
> Task :beam-vendor-sdks-java-extensions-protobuf:classes
Skipping task ':beam-vendor-sdks-java-extensions-protobuf:classes' as it has no actions.
:beam-vendor-sdks-java-extensions-protobuf:classes (Thread[Task worker for ':' Thread 10,5,main]) completed. Took 0.0 secs.
:beam-runners-local-java-core:shadowJar (Thread[Task worker for ':' Thread 5,5,main]) started.
:beam-vendor-sdks-java-extensions-protobuf:shadowJar (Thread[Task worker for ':' Thread 10,5,main]) started.
:beam-sdks-java-extensions-join-library:classes (Thread[Task worker for ':' Thread 8,5,main]) started.
> Task :beam-sdks-java-extensions-join-library:classes
Skipping task ':beam-sdks-java-extensions-join-library:classes' as it has no actions.
:beam-sdks-java-extensions-join-library:classes (Thread[Task worker for ':' Thread 8,5,main]) completed. Took 0.0 secs.
:beam-sdks-java-extensions-protobuf:shadowJar (Thread[Task worker for ':' Thread 9,5,main]) started.
:beam-sdks-java-extensions-join-library:shadowJar (Thread[Task worker for ':' Thread 8,5,main]) started.
> Task :beam-runners-local-java-core:shadowJar
Build cache key for task ':beam-runners-local-java-core:shadowJar' is 12bc1987ddd1f280f6999a5270ef8d3f
Caching disabled for task ':beam-runners-local-java-core:shadowJar': Caching has not been enabled for the task
Task ':beam-runners-local-java-core:shadowJar' is not up-to-date because:
No history is available.
*******************
GRADLE SHADOW STATS
Total Jars: 1 (includes project)
Total Time: 0.0s [0ms]
Average Time/Jar: 0.0s [0.0ms]
*******************
:beam-runners-local-java-core:shadowJar (Thread[Task worker for ':' Thread 5,5,main]) completed. Took 0.038 secs.
> Task :beam-model-fn-execution:shadowJar
Build cache key for task ':beam-model-fn-execution:shadowJar' is cd72273b4175a26ab53afd8469208ce9
Caching disabled for task ':beam-model-fn-execution:shadowJar': Caching has not been enabled for the task
Task ':beam-model-fn-execution:shadowJar' is not up-to-date because:
No history is available.
> Task :beam-vendor-sdks-java-extensions-protobuf:shadowJar
Build cache key for task ':beam-vendor-sdks-java-extensions-protobuf:shadowJar' is 341a852d24c08f3e19e50f2099f4f230
Caching disabled for task ':beam-vendor-sdks-java-extensions-protobuf:shadowJar': Caching has not been enabled for the task
Task ':beam-vendor-sdks-java-extensions-protobuf:shadowJar' is not up-to-date because:
No history is available.
*******************
GRADLE SHADOW STATS
Total Jars: 2 (includes project)
Total Time: 1.803s [1803ms]
Average Time/Jar: 0.9015s [901.5ms]
*******************
:beam-vendor-sdks-java-extensions-protobuf:shadowJar (Thread[Task worker for ':' Thread 10,5,main]) completed. Took 1.866 secs.
> Task :beam-model-job-management:shadowJar
Build cache key for task ':beam-model-job-management:shadowJar' is 1fb056f6ca4ceab795c6670516ce160a
Caching disabled for task ':beam-model-job-management:shadowJar': Caching has not been enabled for the task
Task ':beam-model-job-management:shadowJar' is not up-to-date because:
No history is available.
> Task :beam-sdks-java-extensions-protobuf:shadowJar
Build cache key for task ':beam-sdks-java-extensions-protobuf:shadowJar' is 341a852d24c08f3e19e50f2099f4f230
Caching disabled for task ':beam-sdks-java-extensions-protobuf:shadowJar': Caching has not been enabled for the task
Task ':beam-sdks-java-extensions-protobuf:shadowJar' is not up-to-date because:
No history is available.
*******************
GRADLE SHADOW STATS
Total Jars: 2 (includes project)
Total Time: 2.147s [2147ms]
Average Time/Jar: 1.0735s [1073.5ms]
*******************
:beam-sdks-java-extensions-protobuf:shadowJar (Thread[Task worker for ':' Thread 9,5,main]) completed. Took 2.203 secs.
> Task :beam-sdks-java-extensions-join-library:shadowJar
Build cache key for task ':beam-sdks-java-extensions-join-library:shadowJar' is f7a0e43f1764b8fe60ddb93a2bad981e
Caching disabled for task ':beam-sdks-java-extensions-join-library:shadowJar': Caching has not been enabled for the task
Task ':beam-sdks-java-extensions-join-library:shadowJar' is not up-to-date because:
No history is available.
*******************
GRADLE SHADOW STATS
Total Jars: 2 (includes project)
Total Time: 2.187s [2187ms]
Average Time/Jar: 1.0935s [1093.5ms]
*******************
:beam-sdks-java-extensions-join-library:shadowJar (Thread[Task worker for ':' Thread 8,5,main]) completed. Took 2.236 secs.
> Task :beam-model-job-management:shadowJar
*******************
GRADLE SHADOW STATS
Total Jars: 37 (includes project)
Total Time: 21.224s [21224ms]
Average Time/Jar: 0.5736216216215999s [573.6216216216ms]
*******************
:beam-model-job-management:shadowJar (Thread[Task worker for ':' Thread 11,5,main]) completed. Took 23.964 secs.
:beam-runners-core-construction-java:compileJava (Thread[Task worker for ':' Thread 11,5,main]) started.
> Task :beam-model-fn-execution:shadowJar
*******************
GRADLE SHADOW STATS
Total Jars: 37 (includes project)
Total Time: 20.978s [20978ms]
Average Time/Jar: 0.566972972973s [566.972972973ms]
*******************
:beam-model-fn-execution:shadowJar (Thread[Task worker for ':' Thread 7,5,main]) completed. Took 24.457 secs.
:beam-sdks-java-fn-execution:compileJava (Thread[Task worker for ':' Thread 7,5,main]) started.
> Task :beam-runners-core-construction-java:compileJava
Build cache key for task ':beam-runners-core-construction-java:compileJava' is 3949f2ff5f38eac219fa039a4488f375
Task ':beam-runners-core-construction-java:compileJava' is not up-to-date because:
No history is available.
Custom actions are attached to task ':beam-runners-core-construction-java:compileJava'.
All input files are considered out-of-date for incremental task ':beam-runners-core-construction-java:compileJava'.
Full recompilation is required because no incremental change information is available. This is usually caused by clean builds or changing compiler arguments.
Compiling with error-prone compiler
<https://builds.apache.org/job/beam_PostCommit_Java_Nexmark_Spark/ws/src/runners/core-construction-java/src/main/java/org/apache/beam/runners/core/construction/ParDoTranslation.java>:573: warning: [BadImport] Importing nested classes/static methods/static fields with commonly-used names can make code harder to read, because it may not be clear from the context exactly which type is being referred to. Qualifying the name with that of the containing class can make the code clearer.
Builder builder = SideInput.newBuilder();
^
(see https://errorprone.info/bugpattern/BadImport)
Did you mean 'SideInput.Builder builder = SideInput.newBuilder();'?
error: warnings found and -Werror specified
Note: Some input files use or override a deprecated API.
Note: Recompile with -Xlint:deprecation for details.
Note: Some input files use unchecked or unsafe operations.
Note: Recompile with -Xlint:unchecked for details.
1 error
1 warning
> Task :beam-runners-core-construction-java:compileJava FAILED
:beam-runners-core-construction-java:compileJava (Thread[Task worker for ':' Thread 11,5,main]) completed. Took 8.227 secs.
> Task :beam-sdks-java-fn-execution:compileJava
Build cache key for task ':beam-sdks-java-fn-execution:compileJava' is 304c5cab1ee33dff4b90cad5e9259cf5
Task ':beam-sdks-java-fn-execution:compileJava' is not up-to-date because:
No history is available.
Custom actions are attached to task ':beam-sdks-java-fn-execution:compileJava'.
All input files are considered out-of-date for incremental task ':beam-sdks-java-fn-execution:compileJava'.
Full recompilation is required because no incremental change information is available. This is usually caused by clean builds or changing compiler arguments.
Compiling with error-prone compiler
Note: Some input files use unchecked or unsafe operations.
Note: Recompile with -Xlint:unchecked for details.
Created classpath snapshot for incremental compilation in 1.999 secs. 6714 duplicate classes found in classpath (see all with --debug).
Packing task ':beam-sdks-java-fn-execution:compileJava'
:beam-sdks-java-fn-execution:compileJava (Thread[Task worker for ':' Thread 7,5,main]) completed. Took 9.497 secs.
:beam-sdks-java-fn-execution:classes (Thread[Task worker for ':' Thread 7,5,main]) started.
> Task :beam-sdks-java-fn-execution:classes
Skipping task ':beam-sdks-java-fn-execution:classes' as it has no actions.
:beam-sdks-java-fn-execution:classes (Thread[Task worker for ':' Thread 7,5,main]) completed. Took 0.0 secs.
:beam-sdks-java-fn-execution:shadowJar (Thread[Task worker for ':' Thread 2,5,main]) started.
> Task :beam-sdks-java-fn-execution:shadowJar
Build cache key for task ':beam-sdks-java-fn-execution:shadowJar' is 38412c7957e7e1b71b0c0ee8304d2a53
Caching disabled for task ':beam-sdks-java-fn-execution:shadowJar': Caching has not been enabled for the task
Task ':beam-sdks-java-fn-execution:shadowJar' is not up-to-date because:
No history is available.
*******************
GRADLE SHADOW STATS
Total Jars: 2 (includes project)
Total Time: 2.093s [2093ms]
Average Time/Jar: 1.0465s [1046.5ms]
*******************
:beam-sdks-java-fn-execution:shadowJar (Thread[Task worker for ':' Thread 2,5,main]) completed. Took 2.173 secs.
FAILURE: Build completed with 3 failures.
1: Task failed with an exception.
-----------
* What went wrong:
Execution failed for task ':beam-sdks-java-extensions-google-cloud-platform-core:compileJava'.
> Compilation failed with exit code 1; see the compiler error output for details.
* Try:
Run with --stacktrace option to get the stack trace. Run with --debug option to get more log output. Run with --scan to get full insights.
==============================================================================
2: Task failed with an exception.
-----------
* What went wrong:
Execution failed for task ':beam-sdks-java-io-kafka:compileJava'.
> Compilation failed with exit code 1; see the compiler error output for details.
* Try:
Run with --stacktrace option to get the stack trace. Run with --debug option to get more log output. Run with --scan to get full insights.
==============================================================================
3: Task failed with an exception.
-----------
* What went wrong:
Execution failed for task ':beam-runners-core-construction-java:compileJava'.
> Compilation failed with exit code 1; see the compiler error output for details.
* Try:
Run with --stacktrace option to get the stack trace. Run with --debug option to get more log output. Run with --scan to get full insights.
==============================================================================
* Get more help at https://help.gradle.org
Deprecated Gradle features were used in this build, making it incompatible with Gradle 5.0.
Use '--warning-mode all' to show the individual deprecation warnings.
See https://docs.gradle.org/4.10.2/userguide/command_line_interface.html#sec:command_line_warnings
BUILD FAILED in 59s
43 actionable tasks: 39 executed, 4 from cache
Publishing build scan...
https://gradle.com/s/pk6w3a6jkxcyu
Build step 'Invoke Gradle script' changed build result to FAILURE
Build step 'Invoke Gradle script' marked build as failure
Jenkins build is back to normal :
beam_PostCommit_Java_Nexmark_Spark #735
Posted by Apache Jenkins Server <je...@builds.apache.org>.
See <https://builds.apache.org/job/beam_PostCommit_Java_Nexmark_Spark/735/display/redirect?page=changes>
Build failed in Jenkins: beam_PostCommit_Java_Nexmark_Spark #734
Posted by Apache Jenkins Server <je...@builds.apache.org>.
See <https://builds.apache.org/job/beam_PostCommit_Java_Nexmark_Spark/734/display/redirect?page=changes>
Changes:
[valentyn] Skip tests that halt test suite execution on Python 3
[plovytsimon] [BEAM-5624] avro.schema parser for py3
------------------------------------------
[...truncated 105.48 KB...]
Task ':beam-sdks-java-extensions-join-library:compileJava' is not up-to-date because:
No history is available.
Custom actions are attached to task ':beam-sdks-java-extensions-join-library:compileJava'.
All input files are considered out-of-date for incremental task ':beam-sdks-java-extensions-join-library:compileJava'.
Full recompilation is required because no incremental change information is available. This is usually caused by clean builds or changing compiler arguments.
Compiling with error-prone compiler
Note: <https://builds.apache.org/job/beam_PostCommit_Java_Nexmark_Spark/ws/src/sdks/java/extensions/join-library/src/main/java/org/apache/beam/sdk/extensions/joinlibrary/Join.java> uses unchecked or unsafe operations.
Note: Recompile with -Xlint:unchecked for details.
Created classpath snapshot for incremental compilation in 3.65 secs. 39 duplicate classes found in classpath (see all with --debug).
Packing task ':beam-sdks-java-extensions-join-library:compileJava'
:beam-sdks-java-extensions-join-library:compileJava (Thread[Task worker for ':',5,main]) completed. Took 9.834 secs.
:beam-runners-local-java-core:classes (Thread[Task worker for ':' Thread 11,5,main]) started.
:beam-vendor-sdks-java-extensions-protobuf:compileJava (Thread[Task worker for ':' Thread 8,5,main]) completed. Took 9.836 secs.
:beam-sdks-java-extensions-join-library:classes (Thread[Task worker for ':',5,main]) started.
:beam-vendor-sdks-java-extensions-protobuf:classes (Thread[Task worker for ':' Thread 8,5,main]) started.
> Task :beam-sdks-java-extensions-join-library:classes
Skipping task ':beam-sdks-java-extensions-join-library:classes' as it has no actions.
> Task :beam-runners-local-java-core:classes
Skipping task ':beam-runners-local-java-core:classes' as it has no actions.
:beam-sdks-java-extensions-join-library:classes (Thread[Task worker for ':',5,main]) completed. Took 0.0 secs.
:beam-runners-local-java-core:classes (Thread[Task worker for ':' Thread 11,5,main]) completed. Took 0.0 secs.
:beam-sdks-java-extensions-protobuf:classes (Thread[Task worker for ':' Thread 10,5,main]) started.
> Task :beam-sdks-java-extensions-protobuf:classes
Skipping task ':beam-sdks-java-extensions-protobuf:classes' as it has no actions.
:beam-sdks-java-extensions-protobuf:classes (Thread[Task worker for ':' Thread 10,5,main]) completed. Took 0.0 secs.
> Task :beam-vendor-sdks-java-extensions-protobuf:classes
Skipping task ':beam-vendor-sdks-java-extensions-protobuf:classes' as it has no actions.
:beam-runners-local-java-core:shadowJar (Thread[Task worker for ':',5,main]) started.
:beam-vendor-sdks-java-extensions-protobuf:classes (Thread[Task worker for ':' Thread 8,5,main]) completed. Took 0.0 secs.
:beam-sdks-java-extensions-join-library:shadowJar (Thread[Daemon worker,5,main]) started.
:beam-vendor-sdks-java-extensions-protobuf:shadowJar (Thread[Task worker for ':' Thread 8,5,main]) started.
:beam-sdks-java-extensions-protobuf:shadowJar (Thread[Task worker for ':' Thread 10,5,main]) started.
> Task :beam-runners-local-java-core:shadowJar
Build cache key for task ':beam-runners-local-java-core:shadowJar' is 40928858b19ab50deef25530e31f13f4
Caching disabled for task ':beam-runners-local-java-core:shadowJar': Caching has not been enabled for the task
Task ':beam-runners-local-java-core:shadowJar' is not up-to-date because:
No history is available.
*******************
GRADLE SHADOW STATS
Total Jars: 1 (includes project)
Total Time: 0.0s [0ms]
Average Time/Jar: 0.0s [0.0ms]
*******************
:beam-runners-local-java-core:shadowJar (Thread[Task worker for ':',5,main]) completed. Took 0.035 secs.
> Task :beam-sdks-java-io-kafka:compileJava FAILED
Build cache key for task ':beam-sdks-java-io-kafka:compileJava' is 335758cbe2901f4926f743e0e97f782f
Task ':beam-sdks-java-io-kafka:compileJava' is not up-to-date because:
No history is available.
Custom actions are attached to task ':beam-sdks-java-io-kafka:compileJava'.
All input files are considered out-of-date for incremental task ':beam-sdks-java-io-kafka:compileJava'.
Full recompilation is required because no incremental change information is available. This is usually caused by clean builds or changing compiler arguments.
Compiling with error-prone compiler
<https://builds.apache.org/job/beam_PostCommit_Java_Nexmark_Spark/ws/src/sdks/java/io/kafka/src/main/java/org/apache/beam/sdk/io/kafka/KafkaUnboundedReader.java>:149: warning: [UnnecessaryParentheses] Unnecessary use of grouping parentheses
name, (new Random()).nextInt(Integer.MAX_VALUE), (groupId == null ? "none" : groupId));
^
(see https://errorprone.info/bugpattern/UnnecessaryParentheses)
Did you mean 'name, new Random().nextInt(Integer.MAX_VALUE), (groupId == null ? "none" : groupId));'?
error: warnings found and -Werror specified
1 error
1 warning
:beam-sdks-java-io-kafka:compileJava (Thread[Task worker for ':' Thread 3,5,main]) completed. Took 9.892 secs.
> Task :beam-model-fn-execution:shadowJar
Build cache key for task ':beam-model-fn-execution:shadowJar' is 03e69d299886d627ee0e3b54722c49f6
Caching disabled for task ':beam-model-fn-execution:shadowJar': Caching has not been enabled for the task
Task ':beam-model-fn-execution:shadowJar' is not up-to-date because:
No history is available.
> Task :beam-vendor-sdks-java-extensions-protobuf:shadowJar
Build cache key for task ':beam-vendor-sdks-java-extensions-protobuf:shadowJar' is 2fa81635dc7804ce386236e3b18f82d8
Caching disabled for task ':beam-vendor-sdks-java-extensions-protobuf:shadowJar': Caching has not been enabled for the task
Task ':beam-vendor-sdks-java-extensions-protobuf:shadowJar' is not up-to-date because:
No history is available.
*******************
GRADLE SHADOW STATS
Total Jars: 2 (includes project)
Total Time: 1.789s [1789ms]
Average Time/Jar: 0.8945s [894.5ms]
*******************
:beam-vendor-sdks-java-extensions-protobuf:shadowJar (Thread[Task worker for ':' Thread 8,5,main]) completed. Took 1.856 secs.
> Task :beam-model-job-management:shadowJar
Build cache key for task ':beam-model-job-management:shadowJar' is 727a5828c3191f3702150d4bb5795ecd
Caching disabled for task ':beam-model-job-management:shadowJar': Caching has not been enabled for the task
Task ':beam-model-job-management:shadowJar' is not up-to-date because:
No history is available.
> Task :beam-sdks-java-extensions-join-library:shadowJar
Build cache key for task ':beam-sdks-java-extensions-join-library:shadowJar' is ee217ad0afd0aab3c61fe8f28c9f31f8
Caching disabled for task ':beam-sdks-java-extensions-join-library:shadowJar': Caching has not been enabled for the task
Task ':beam-sdks-java-extensions-join-library:shadowJar' is not up-to-date because:
No history is available.
*******************
GRADLE SHADOW STATS
Total Jars: 2 (includes project)
Total Time: 2.131s [2131ms]
Average Time/Jar: 1.0655s [1065.5ms]
*******************
:beam-sdks-java-extensions-join-library:shadowJar (Thread[Daemon worker,5,main]) completed. Took 2.194 secs.
> Task :beam-sdks-java-extensions-protobuf:shadowJar
Build cache key for task ':beam-sdks-java-extensions-protobuf:shadowJar' is 2fa81635dc7804ce386236e3b18f82d8
Caching disabled for task ':beam-sdks-java-extensions-protobuf:shadowJar': Caching has not been enabled for the task
Task ':beam-sdks-java-extensions-protobuf:shadowJar' is not up-to-date because:
No history is available.
*******************
GRADLE SHADOW STATS
Total Jars: 2 (includes project)
Total Time: 2.138s [2138ms]
Average Time/Jar: 1.069s [1069.0ms]
*******************
:beam-sdks-java-extensions-protobuf:shadowJar (Thread[Task worker for ':' Thread 10,5,main]) completed. Took 2.203 secs.
> Task :beam-model-job-management:shadowJar
*******************
GRADLE SHADOW STATS
Total Jars: 37 (includes project)
Total Time: 21.773s [21773ms]
Average Time/Jar: 0.5884594594595s [588.4594594595ms]
*******************
:beam-model-job-management:shadowJar (Thread[Task worker for ':' Thread 6,5,main]) completed. Took 24.255 secs.
:beam-runners-core-construction-java:compileJava (Thread[Task worker for ':' Thread 6,5,main]) started.
> Task :beam-model-fn-execution:shadowJar
*******************
GRADLE SHADOW STATS
Total Jars: 37 (includes project)
Total Time: 21.357s [21357ms]
Average Time/Jar: 0.5772162162162s [577.2162162162ms]
*******************
:beam-model-fn-execution:shadowJar (Thread[Task worker for ':' Thread 2,5,main]) completed. Took 24.708 secs.
:beam-sdks-java-fn-execution:compileJava (Thread[Task worker for ':' Thread 2,5,main]) started.
> Task :beam-runners-core-construction-java:compileJava
Build cache key for task ':beam-runners-core-construction-java:compileJava' is 207c510a28bcc215f8d493fa8adcd07e
Task ':beam-runners-core-construction-java:compileJava' is not up-to-date because:
No history is available.
Custom actions are attached to task ':beam-runners-core-construction-java:compileJava'.
All input files are considered out-of-date for incremental task ':beam-runners-core-construction-java:compileJava'.
Full recompilation is required because no incremental change information is available. This is usually caused by clean builds or changing compiler arguments.
Compiling with error-prone compiler
<https://builds.apache.org/job/beam_PostCommit_Java_Nexmark_Spark/ws/src/runners/core-construction-java/src/main/java/org/apache/beam/runners/core/construction/ParDoTranslation.java>:573: warning: [BadImport] Importing nested classes/static methods/static fields with commonly-used names can make code harder to read, because it may not be clear from the context exactly which type is being referred to. Qualifying the name with that of the containing class can make the code clearer.
Builder builder = SideInput.newBuilder();
^
(see https://errorprone.info/bugpattern/BadImport)
Did you mean 'SideInput.Builder builder = SideInput.newBuilder();'?
error: warnings found and -Werror specified
Note: Some input files use or override a deprecated API.
Note: Recompile with -Xlint:deprecation for details.
Note: Some input files use unchecked or unsafe operations.
Note: Recompile with -Xlint:unchecked for details.
1 error
1 warning
> Task :beam-runners-core-construction-java:compileJava FAILED
:beam-runners-core-construction-java:compileJava (Thread[Task worker for ':' Thread 6,5,main]) completed. Took 8.426 secs.
> Task :beam-sdks-java-fn-execution:compileJava
Build cache key for task ':beam-sdks-java-fn-execution:compileJava' is 2dadce20f3b47432bcb71da0dddf90c5
Task ':beam-sdks-java-fn-execution:compileJava' is not up-to-date because:
No history is available.
Custom actions are attached to task ':beam-sdks-java-fn-execution:compileJava'.
All input files are considered out-of-date for incremental task ':beam-sdks-java-fn-execution:compileJava'.
Full recompilation is required because no incremental change information is available. This is usually caused by clean builds or changing compiler arguments.
Compiling with error-prone compiler
Note: Some input files use unchecked or unsafe operations.
Note: Recompile with -Xlint:unchecked for details.
Created classpath snapshot for incremental compilation in 1.955 secs. 6714 duplicate classes found in classpath (see all with --debug).
Packing task ':beam-sdks-java-fn-execution:compileJava'
:beam-sdks-java-fn-execution:compileJava (Thread[Task worker for ':' Thread 2,5,main]) completed. Took 9.436 secs.
:beam-sdks-java-fn-execution:classes (Thread[Task worker for ':' Thread 2,5,main]) started.
> Task :beam-sdks-java-fn-execution:classes
Skipping task ':beam-sdks-java-fn-execution:classes' as it has no actions.
:beam-sdks-java-fn-execution:classes (Thread[Task worker for ':' Thread 2,5,main]) completed. Took 0.0 secs.
:beam-sdks-java-fn-execution:shadowJar (Thread[Task worker for ':' Thread 2,5,main]) started.
> Task :beam-sdks-java-fn-execution:shadowJar
Build cache key for task ':beam-sdks-java-fn-execution:shadowJar' is 6c528b6ae362e00d55817e749166c919
Caching disabled for task ':beam-sdks-java-fn-execution:shadowJar': Caching has not been enabled for the task
Task ':beam-sdks-java-fn-execution:shadowJar' is not up-to-date because:
No history is available.
*******************
GRADLE SHADOW STATS
Total Jars: 2 (includes project)
Total Time: 2.024s [2024ms]
Average Time/Jar: 1.012s [1012.0ms]
*******************
:beam-sdks-java-fn-execution:shadowJar (Thread[Task worker for ':' Thread 2,5,main]) completed. Took 2.099 secs.
FAILURE: Build completed with 3 failures.
1: Task failed with an exception.
-----------
* What went wrong:
Execution failed for task ':beam-sdks-java-extensions-google-cloud-platform-core:compileJava'.
> Compilation failed with exit code 1; see the compiler error output for details.
* Try:
Run with --stacktrace option to get the stack trace. Run with --debug option to get more log output. Run with --scan to get full insights.
==============================================================================
2: Task failed with an exception.
-----------
* What went wrong:
Execution failed for task ':beam-sdks-java-io-kafka:compileJava'.
> Compilation failed with exit code 1; see the compiler error output for details.
* Try:
Run with --stacktrace option to get the stack trace. Run with --debug option to get more log output. Run with --scan to get full insights.
==============================================================================
3: Task failed with an exception.
-----------
* What went wrong:
Execution failed for task ':beam-runners-core-construction-java:compileJava'.
> Compilation failed with exit code 1; see the compiler error output for details.
* Try:
Run with --stacktrace option to get the stack trace. Run with --debug option to get more log output. Run with --scan to get full insights.
==============================================================================
* Get more help at https://help.gradle.org
Deprecated Gradle features were used in this build, making it incompatible with Gradle 5.0.
Use '--warning-mode all' to show the individual deprecation warnings.
See https://docs.gradle.org/4.10.2/userguide/command_line_interface.html#sec:command_line_warnings
BUILD FAILED in 1m 1s
43 actionable tasks: 39 executed, 4 from cache
Publishing build scan...
https://gradle.com/s/2fkfidsi6nsmq
Build step 'Invoke Gradle script' changed build result to FAILURE
Build step 'Invoke Gradle script' marked build as failure