You are viewing a plain text version of this content. The canonical link for it is here.
Posted to builds@beam.apache.org by Apache Jenkins Server <je...@builds.apache.org> on 2022/12/06 17:21:07 UTC

Build failed in Jenkins: beam_PostCommit_XVR_Flink #6220

See <https://ci-beam.apache.org/job/beam_PostCommit_XVR_Flink/6220/display/redirect?page=changes>

Changes:

[bulatkazan] [Website] center the main content #24521

[Moritz Mack] [Spark Dataset runner] Broadcast pipeline options

[bulatkazan] [Website] update copy icon positioning #24426

[noreply] Update google-cloud-bigquery-storage requirement from <2.14,>=2.6.3 to

[noreply] Bump cloud.google.com/go/pubsub from 1.27.1 to 1.28.0 in /sdks (#24534)

[noreply] Bump golang.org/x/net from 0.2.0 to 0.3.0 in /sdks (#24544)


------------------------------------------
[...truncated 2.74 MB...]
-------------------------------- live log call ---------------------------------
INFO     apache_beam.utils.subprocess_server:subprocess_server.py:239 Using pre-built snapshot at <https://ci-beam.apache.org/job/beam_PostCommit_XVR_Flink/ws/src/sdks/java/extensions/sql/expansion-service/build/libs/beam-sdks-java-extensions-sql-expansion-service-2.45.0-SNAPSHOT.jar>
INFO     root:external.py:847 Starting a JAR-based expansion service from JAR <https://ci-beam.apache.org/job/beam_PostCommit_XVR_Flink/ws/src/sdks/java/extensions/sql/expansion-service/build/libs/beam-sdks-java-extensions-sql-expansion-service-2.45.0-SNAPSHOT.jar> 
INFO     apache_beam.utils.subprocess_server:subprocess_server.py:116 Starting service with ['java' '-jar' '<https://ci-beam.apache.org/job/beam_PostCommit_XVR_Flink/ws/src/sdks/java/extensions/sql/expansion-service/build/libs/beam-sdks-java-extensions-sql-expansion-service-2.45.0-SNAPSHOT.jar'> '41273' '--filesToStage=<https://ci-beam.apache.org/job/beam_PostCommit_XVR_Flink/ws/src/sdks/java/extensions/sql/expansion-service/build/libs/beam-sdks-java-extensions-sql-expansion-service-2.45.0-SNAPSHOT.jar']>
INFO     apache_beam.utils.subprocess_server:subprocess_server.py:126 Starting expansion service at localhost:41273
INFO     apache_beam.utils.subprocess_server:subprocess_server.py:126 Dec 06, 2022 5:19:52 PM org.apache.beam.sdk.expansion.service.ExpansionService loadRegisteredTransforms
INFO     apache_beam.utils.subprocess_server:subprocess_server.py:126 INFO: Registering external transforms: [beam:external:java:sql:v1, beam:transform:org.apache.beam:pubsub_read:v1, beam:transform:org.apache.beam:pubsub_write:v1, beam:transform:org.apache.beam:pubsublite_write:v1, beam:transform:org.apache.beam:pubsublite_read:v1, beam:transform:org.apache.beam:spanner_insert:v1, beam:transform:org.apache.beam:spanner_update:v1, beam:transform:org.apache.beam:spanner_replace:v1, beam:transform:org.apache.beam:spanner_insert_or_update:v1, beam:transform:org.apache.beam:spanner_delete:v1, beam:transform:org.apache.beam:spanner_read:v1, beam:transform:org.apache.beam:kafka_read_with_metadata:v1, beam:transform:org.apache.beam:kafka_read_without_metadata:v1, beam:transform:org.apache.beam:kafka_write:v1, beam:external:java:generate_sequence:v1]
INFO     apache_beam.utils.subprocess_server:subprocess_server.py:126 
INFO     apache_beam.utils.subprocess_server:subprocess_server.py:126 Registered transforms:
INFO     apache_beam.utils.subprocess_server:subprocess_server.py:126 	beam:external:java:sql:v1: org.apache.beam.sdk.expansion.service.ExpansionService$ExternalTransformRegistrarLoader$1@38425407
INFO     apache_beam.utils.subprocess_server:subprocess_server.py:126 	beam:transform:org.apache.beam:pubsub_read:v1: org.apache.beam.sdk.expansion.service.ExpansionService$ExternalTransformRegistrarLoader$1@43bc63a3
INFO     apache_beam.utils.subprocess_server:subprocess_server.py:126 	beam:transform:org.apache.beam:pubsub_write:v1: org.apache.beam.sdk.expansion.service.ExpansionService$ExternalTransformRegistrarLoader$1@702657cc
INFO     apache_beam.utils.subprocess_server:subprocess_server.py:126 	beam:transform:org.apache.beam:pubsublite_write:v1: org.apache.beam.sdk.expansion.service.ExpansionService$ExternalTransformRegistrarLoader$1@6a6cb05c
INFO     apache_beam.utils.subprocess_server:subprocess_server.py:126 	beam:transform:org.apache.beam:pubsublite_read:v1: org.apache.beam.sdk.expansion.service.ExpansionService$ExternalTransformRegistrarLoader$1@40a4337a
INFO     apache_beam.utils.subprocess_server:subprocess_server.py:126 	beam:transform:org.apache.beam:spanner_insert:v1: org.apache.beam.sdk.expansion.service.ExpansionService$ExternalTransformRegistrarLoader$1@6025e1b6
INFO     apache_beam.utils.subprocess_server:subprocess_server.py:126 	beam:transform:org.apache.beam:spanner_update:v1: org.apache.beam.sdk.expansion.service.ExpansionService$ExternalTransformRegistrarLoader$1@22ff4249
INFO     apache_beam.utils.subprocess_server:subprocess_server.py:126 	beam:transform:org.apache.beam:spanner_replace:v1: org.apache.beam.sdk.expansion.service.ExpansionService$ExternalTransformRegistrarLoader$1@2d1ef81a
INFO     apache_beam.utils.subprocess_server:subprocess_server.py:126 	beam:transform:org.apache.beam:spanner_insert_or_update:v1: org.apache.beam.sdk.expansion.service.ExpansionService$ExternalTransformRegistrarLoader$1@4c402120
INFO     apache_beam.utils.subprocess_server:subprocess_server.py:126 	beam:transform:org.apache.beam:spanner_delete:v1: org.apache.beam.sdk.expansion.service.ExpansionService$ExternalTransformRegistrarLoader$1@327514f
INFO     apache_beam.utils.subprocess_server:subprocess_server.py:126 	beam:transform:org.apache.beam:spanner_read:v1: org.apache.beam.sdk.expansion.service.ExpansionService$ExternalTransformRegistrarLoader$1@5b12b668
INFO     apache_beam.utils.subprocess_server:subprocess_server.py:126 	beam:transform:org.apache.beam:kafka_read_with_metadata:v1: org.apache.beam.sdk.expansion.service.ExpansionService$ExternalTransformRegistrarLoader$1@1165b38
INFO     apache_beam.utils.subprocess_server:subprocess_server.py:126 	beam:transform:org.apache.beam:kafka_read_without_metadata:v1: org.apache.beam.sdk.expansion.service.ExpansionService$ExternalTransformRegistrarLoader$1@4c12331b
INFO     apache_beam.utils.subprocess_server:subprocess_server.py:126 	beam:transform:org.apache.beam:kafka_write:v1: org.apache.beam.sdk.expansion.service.ExpansionService$ExternalTransformRegistrarLoader$1@7586beff
INFO     apache_beam.utils.subprocess_server:subprocess_server.py:126 	beam:external:java:generate_sequence:v1: org.apache.beam.sdk.expansion.service.ExpansionService$ExternalTransformRegistrarLoader$1@3b69e7d1
INFO     apache_beam.utils.subprocess_server:subprocess_server.py:126 
INFO     apache_beam.utils.subprocess_server:subprocess_server.py:126 Registered SchemaTransformProviders:
INFO     apache_beam.utils.subprocess_server:subprocess_server.py:126 	beam:schematransform:org.apache.beam:kafka_read:v1
INFO     apache_beam.utils.subprocess_server:subprocess_server.py:126 	beam:schematransform:org.apache.beam:spanner_write:v1
INFO     apache_beam.utils.subprocess_server:subprocess_server.py:126 	beam:transform:org.apache.beam:bigquery_storage_read:v1
INFO     apache_beam.utils.subprocess_server:subprocess_server.py:126 Dec 06, 2022 5:19:53 PM org.apache.beam.sdk.expansion.service.ExpansionService expand
INFO     apache_beam.utils.subprocess_server:subprocess_server.py:126 INFO: Expanding 'SqlTransform(beam:external:java:sql:v1)' with URN 'beam:external:java:sql:v1'
INFO     apache_beam.utils.subprocess_server:subprocess_server.py:126 Dec 06, 2022 5:19:53 PM org.apache.beam.sdk.expansion.service.ExpansionService$ExternalTransformRegistrarLoader payloadToConfig
INFO     apache_beam.utils.subprocess_server:subprocess_server.py:126 WARNING: Configuration class 'org.apache.beam.sdk.extensions.sql.expansion.ExternalSqlTransformRegistrar$Configuration' has no schema registered. Attempting to construct with setter approach.
INFO     apache_beam.utils.subprocess_server:subprocess_server.py:126 Dec 06, 2022 5:19:54 PM org.apache.beam.sdk.expansion.service.ExpansionService$ExternalTransformRegistrarLoader payloadToConfig
INFO     apache_beam.utils.subprocess_server:subprocess_server.py:126 WARNING: Configuration class 'org.apache.beam.sdk.extensions.sql.expansion.ExternalSqlTransformRegistrar$Configuration' has no schema registered. Attempting to construct with setter approach.
INFO     apache_beam.utils.subprocess_server:subprocess_server.py:126 Dec 06, 2022 5:19:56 PM org.apache.beam.sdk.extensions.sql.impl.CalciteQueryPlanner convertToBeamRel
INFO     apache_beam.utils.subprocess_server:subprocess_server.py:126 INFO: SQL:
INFO     apache_beam.utils.subprocess_server:subprocess_server.py:126 SELECT `simple`.`id` AS `id`, `enrich`.`metadata` AS `metadata`
INFO     apache_beam.utils.subprocess_server:subprocess_server.py:126 FROM `beam`.`simple` AS `simple`
INFO     apache_beam.utils.subprocess_server:subprocess_server.py:126 INNER JOIN `beam`.`enrich` AS `enrich` ON `simple`.`id` = `enrich`.`id`
INFO     apache_beam.utils.subprocess_server:subprocess_server.py:126 Dec 06, 2022 5:19:56 PM org.apache.beam.sdk.extensions.sql.impl.CalciteQueryPlanner convertToBeamRel
INFO     apache_beam.utils.subprocess_server:subprocess_server.py:126 INFO: SQLPlan>
INFO     apache_beam.utils.subprocess_server:subprocess_server.py:126 LogicalProject(id=[$0], metadata=[$4])
INFO     apache_beam.utils.subprocess_server:subprocess_server.py:126   LogicalJoin(condition=[=($0, $3)], joinType=[inner])
INFO     apache_beam.utils.subprocess_server:subprocess_server.py:126     BeamIOSourceRel(table=[[beam, simple]])
INFO     apache_beam.utils.subprocess_server:subprocess_server.py:126     BeamIOSourceRel(table=[[beam, enrich]])
INFO     apache_beam.utils.subprocess_server:subprocess_server.py:126 
INFO     apache_beam.utils.subprocess_server:subprocess_server.py:126 Dec 06, 2022 5:19:56 PM org.apache.beam.sdk.extensions.sql.impl.CalciteQueryPlanner convertToBeamRel
INFO     apache_beam.utils.subprocess_server:subprocess_server.py:126 INFO: BEAMPlan>
INFO     apache_beam.utils.subprocess_server:subprocess_server.py:126 BeamCalcRel(expr#0..4=[{inputs}], id=[$t0], metadata=[$t4])
INFO     apache_beam.utils.subprocess_server:subprocess_server.py:126   BeamCoGBKJoinRel(condition=[=($0, $3)], joinType=[inner])
INFO     apache_beam.utils.subprocess_server:subprocess_server.py:126     BeamIOSourceRel(table=[[beam, simple]])
INFO     apache_beam.utils.subprocess_server:subprocess_server.py:126     BeamIOSourceRel(table=[[beam, enrich]])
INFO     apache_beam.utils.subprocess_server:subprocess_server.py:126 
INFO     root:environments.py:376 Default Python SDK image for environment is apache/beam_python3.10_sdk:2.45.0.dev
INFO     root:environments.py:299 No image given, using default Python SDK image
INFO     root:environments.py:376 Default Python SDK image for environment is apache/beam_python3.10_sdk:2.45.0.dev
INFO     root:environments.py:302 Python SDK container image set to "apache/beam_python3.10_sdk:2.45.0.dev" for Docker environment
INFO     apache_beam.runners.portability.fn_api_runner.translations:translations.py:710 ==================== <function pack_combiners at 0x7faa0ed127a0> ====================
INFO     apache_beam.runners.portability.fn_api_runner.translations:translations.py:710 ==================== <function lift_combiners at 0x7faa0ed12830> ====================
INFO     apache_beam.runners.portability.fn_api_runner.translations:translations.py:710 ==================== <function sort_stages at 0x7faa0ed12f80> ====================
INFO     apache_beam.runners.portability.portable_runner:portable_runner.py:581 Job state changed to STOPPED
INFO     apache_beam.runners.portability.portable_runner:portable_runner.py:581 Job state changed to STARTING
INFO     apache_beam.runners.portability.portable_runner:portable_runner.py:581 Job state changed to RUNNING
INFO     apache_beam.runners.portability.portable_runner:portable_runner.py:581 Job state changed to DONE
PASSED                                                                   [ 77%]
apache_beam/transforms/sql_test.py::SqlTransformTest::test_windowing_before_sql 
-------------------------------- live log call ---------------------------------
INFO     apache_beam.utils.subprocess_server:subprocess_server.py:239 Using pre-built snapshot at <https://ci-beam.apache.org/job/beam_PostCommit_XVR_Flink/ws/src/sdks/java/extensions/sql/expansion-service/build/libs/beam-sdks-java-extensions-sql-expansion-service-2.45.0-SNAPSHOT.jar>
INFO     root:external.py:847 Starting a JAR-based expansion service from JAR <https://ci-beam.apache.org/job/beam_PostCommit_XVR_Flink/ws/src/sdks/java/extensions/sql/expansion-service/build/libs/beam-sdks-java-extensions-sql-expansion-service-2.45.0-SNAPSHOT.jar> 
INFO     apache_beam.utils.subprocess_server:subprocess_server.py:116 Starting service with ['java' '-jar' '<https://ci-beam.apache.org/job/beam_PostCommit_XVR_Flink/ws/src/sdks/java/extensions/sql/expansion-service/build/libs/beam-sdks-java-extensions-sql-expansion-service-2.45.0-SNAPSHOT.jar'> '48059' '--filesToStage=<https://ci-beam.apache.org/job/beam_PostCommit_XVR_Flink/ws/src/sdks/java/extensions/sql/expansion-service/build/libs/beam-sdks-java-extensions-sql-expansion-service-2.45.0-SNAPSHOT.jar']>
INFO     apache_beam.utils.subprocess_server:subprocess_server.py:126 Starting expansion service at localhost:48059
INFO     apache_beam.utils.subprocess_server:subprocess_server.py:126 Dec 06, 2022 5:20:17 PM org.apache.beam.sdk.expansion.service.ExpansionService loadRegisteredTransforms
INFO     apache_beam.utils.subprocess_server:subprocess_server.py:126 INFO: Registering external transforms: [beam:external:java:sql:v1, beam:transform:org.apache.beam:pubsub_read:v1, beam:transform:org.apache.beam:pubsub_write:v1, beam:transform:org.apache.beam:pubsublite_write:v1, beam:transform:org.apache.beam:pubsublite_read:v1, beam:transform:org.apache.beam:spanner_insert:v1, beam:transform:org.apache.beam:spanner_update:v1, beam:transform:org.apache.beam:spanner_replace:v1, beam:transform:org.apache.beam:spanner_insert_or_update:v1, beam:transform:org.apache.beam:spanner_delete:v1, beam:transform:org.apache.beam:spanner_read:v1, beam:transform:org.apache.beam:kafka_read_with_metadata:v1, beam:transform:org.apache.beam:kafka_read_without_metadata:v1, beam:transform:org.apache.beam:kafka_write:v1, beam:external:java:generate_sequence:v1]
INFO     apache_beam.utils.subprocess_server:subprocess_server.py:126 
INFO     apache_beam.utils.subprocess_server:subprocess_server.py:126 Registered transforms:
INFO     apache_beam.utils.subprocess_server:subprocess_server.py:126 	beam:external:java:sql:v1: org.apache.beam.sdk.expansion.service.ExpansionService$ExternalTransformRegistrarLoader$1@38425407
INFO     apache_beam.utils.subprocess_server:subprocess_server.py:126 	beam:transform:org.apache.beam:pubsub_read:v1: org.apache.beam.sdk.expansion.service.ExpansionService$ExternalTransformRegistrarLoader$1@43bc63a3
INFO     apache_beam.utils.subprocess_server:subprocess_server.py:126 	beam:transform:org.apache.beam:pubsub_write:v1: org.apache.beam.sdk.expansion.service.ExpansionService$ExternalTransformRegistrarLoader$1@702657cc
INFO     apache_beam.utils.subprocess_server:subprocess_server.py:126 	beam:transform:org.apache.beam:pubsublite_write:v1: org.apache.beam.sdk.expansion.service.ExpansionService$ExternalTransformRegistrarLoader$1@6a6cb05c
INFO     apache_beam.utils.subprocess_server:subprocess_server.py:126 	beam:transform:org.apache.beam:pubsublite_read:v1: org.apache.beam.sdk.expansion.service.ExpansionService$ExternalTransformRegistrarLoader$1@40a4337a
INFO     apache_beam.utils.subprocess_server:subprocess_server.py:126 	beam:transform:org.apache.beam:spanner_insert:v1: org.apache.beam.sdk.expansion.service.ExpansionService$ExternalTransformRegistrarLoader$1@6025e1b6
INFO     apache_beam.utils.subprocess_server:subprocess_server.py:126 	beam:transform:org.apache.beam:spanner_update:v1: org.apache.beam.sdk.expansion.service.ExpansionService$ExternalTransformRegistrarLoader$1@22ff4249
INFO     apache_beam.utils.subprocess_server:subprocess_server.py:126 	beam:transform:org.apache.beam:spanner_replace:v1: org.apache.beam.sdk.expansion.service.ExpansionService$ExternalTransformRegistrarLoader$1@2d1ef81a
INFO     apache_beam.utils.subprocess_server:subprocess_server.py:126 	beam:transform:org.apache.beam:spanner_insert_or_update:v1: org.apache.beam.sdk.expansion.service.ExpansionService$ExternalTransformRegistrarLoader$1@4c402120
INFO     apache_beam.utils.subprocess_server:subprocess_server.py:126 	beam:transform:org.apache.beam:spanner_delete:v1: org.apache.beam.sdk.expansion.service.ExpansionService$ExternalTransformRegistrarLoader$1@327514f
INFO     apache_beam.utils.subprocess_server:subprocess_server.py:126 	beam:transform:org.apache.beam:spanner_read:v1: org.apache.beam.sdk.expansion.service.ExpansionService$ExternalTransformRegistrarLoader$1@5b12b668
INFO     apache_beam.utils.subprocess_server:subprocess_server.py:126 	beam:transform:org.apache.beam:kafka_read_with_metadata:v1: org.apache.beam.sdk.expansion.service.ExpansionService$ExternalTransformRegistrarLoader$1@1165b38
INFO     apache_beam.utils.subprocess_server:subprocess_server.py:126 	beam:transform:org.apache.beam:kafka_read_without_metadata:v1: org.apache.beam.sdk.expansion.service.ExpansionService$ExternalTransformRegistrarLoader$1@4c12331b
INFO     apache_beam.utils.subprocess_server:subprocess_server.py:126 	beam:transform:org.apache.beam:kafka_write:v1: org.apache.beam.sdk.expansion.service.ExpansionService$ExternalTransformRegistrarLoader$1@7586beff
INFO     apache_beam.utils.subprocess_server:subprocess_server.py:126 	beam:external:java:generate_sequence:v1: org.apache.beam.sdk.expansion.service.ExpansionService$ExternalTransformRegistrarLoader$1@3b69e7d1
INFO     apache_beam.utils.subprocess_server:subprocess_server.py:126 
INFO     apache_beam.utils.subprocess_server:subprocess_server.py:126 Registered SchemaTransformProviders:
INFO     apache_beam.utils.subprocess_server:subprocess_server.py:126 	beam:schematransform:org.apache.beam:kafka_read:v1
INFO     apache_beam.utils.subprocess_server:subprocess_server.py:126 	beam:schematransform:org.apache.beam:spanner_write:v1
INFO     apache_beam.utils.subprocess_server:subprocess_server.py:126 	beam:transform:org.apache.beam:bigquery_storage_read:v1
INFO     apache_beam.utils.subprocess_server:subprocess_server.py:126 Dec 06, 2022 5:20:18 PM org.apache.beam.sdk.expansion.service.ExpansionService expand
INFO     apache_beam.utils.subprocess_server:subprocess_server.py:126 INFO: Expanding 'SqlTransform(beam:external:java:sql:v1)' with URN 'beam:external:java:sql:v1'
INFO     apache_beam.utils.subprocess_server:subprocess_server.py:126 Dec 06, 2022 5:20:18 PM org.apache.beam.sdk.expansion.service.ExpansionService$ExternalTransformRegistrarLoader payloadToConfig
INFO     apache_beam.utils.subprocess_server:subprocess_server.py:126 WARNING: Configuration class 'org.apache.beam.sdk.extensions.sql.expansion.ExternalSqlTransformRegistrar$Configuration' has no schema registered. Attempting to construct with setter approach.
INFO     apache_beam.utils.subprocess_server:subprocess_server.py:126 Dec 06, 2022 5:20:19 PM org.apache.beam.sdk.expansion.service.ExpansionService$ExternalTransformRegistrarLoader payloadToConfig
INFO     apache_beam.utils.subprocess_server:subprocess_server.py:126 WARNING: Configuration class 'org.apache.beam.sdk.extensions.sql.expansion.ExternalSqlTransformRegistrar$Configuration' has no schema registered. Attempting to construct with setter approach.
INFO     apache_beam.utils.subprocess_server:subprocess_server.py:126 Dec 06, 2022 5:20:20 PM org.apache.beam.sdk.extensions.sql.impl.CalciteQueryPlanner convertToBeamRel
INFO     apache_beam.utils.subprocess_server:subprocess_server.py:126 INFO: SQL:
INFO     apache_beam.utils.subprocess_server:subprocess_server.py:126 SELECT COUNT(*) AS `count`
INFO     apache_beam.utils.subprocess_server:subprocess_server.py:126 FROM `beam`.`PCOLLECTION` AS `PCOLLECTION`
INFO     apache_beam.utils.subprocess_server:subprocess_server.py:126 Dec 06, 2022 5:20:21 PM org.apache.beam.sdk.extensions.sql.impl.CalciteQueryPlanner convertToBeamRel
INFO     apache_beam.utils.subprocess_server:subprocess_server.py:126 INFO: SQLPlan>
INFO     apache_beam.utils.subprocess_server:subprocess_server.py:126 LogicalAggregate(group=[{}], count=[COUNT()])
INFO     apache_beam.utils.subprocess_server:subprocess_server.py:126   BeamIOSourceRel(table=[[beam, PCOLLECTION]])
INFO     apache_beam.utils.subprocess_server:subprocess_server.py:126 
INFO     apache_beam.utils.subprocess_server:subprocess_server.py:126 Dec 06, 2022 5:20:21 PM org.apache.beam.sdk.extensions.sql.impl.CalciteQueryPlanner convertToBeamRel
INFO     apache_beam.utils.subprocess_server:subprocess_server.py:126 INFO: BEAMPlan>
INFO     apache_beam.utils.subprocess_server:subprocess_server.py:126 BeamAggregationRel(group=[{}], count=[COUNT()])
INFO     apache_beam.utils.subprocess_server:subprocess_server.py:126   BeamIOSourceRel(table=[[beam, PCOLLECTION]])
INFO     apache_beam.utils.subprocess_server:subprocess_server.py:126 
INFO     root:environments.py:376 Default Python SDK image for environment is apache/beam_python3.10_sdk:2.45.0.dev
INFO     root:environments.py:299 No image given, using default Python SDK image
INFO     root:environments.py:376 Default Python SDK image for environment is apache/beam_python3.10_sdk:2.45.0.dev
INFO     root:environments.py:302 Python SDK container image set to "apache/beam_python3.10_sdk:2.45.0.dev" for Docker environment
INFO     apache_beam.runners.portability.fn_api_runner.translations:translations.py:710 ==================== <function pack_combiners at 0x7faa0ed127a0> ====================
INFO     apache_beam.runners.portability.fn_api_runner.translations:translations.py:710 ==================== <function lift_combiners at 0x7faa0ed12830> ====================
INFO     apache_beam.runners.portability.fn_api_runner.translations:translations.py:710 ==================== <function sort_stages at 0x7faa0ed12f80> ====================
INFO     apache_beam.runners.portability.portable_runner:portable_runner.py:581 Job state changed to STOPPED
INFO     apache_beam.runners.portability.portable_runner:portable_runner.py:581 Job state changed to STARTING
INFO     apache_beam.runners.portability.portable_runner:portable_runner.py:581 Job state changed to RUNNING
INFO     apache_beam.runners.portability.portable_runner:portable_runner.py:581 Job state changed to DONE
PASSED                                                                   [ 88%]
apache_beam/transforms/sql_test.py::SqlTransformTest::test_zetasql_generate_data 
-------------------------------- live log call ---------------------------------
INFO     apache_beam.utils.subprocess_server:subprocess_server.py:239 Using pre-built snapshot at <https://ci-beam.apache.org/job/beam_PostCommit_XVR_Flink/ws/src/sdks/java/extensions/sql/expansion-service/build/libs/beam-sdks-java-extensions-sql-expansion-service-2.45.0-SNAPSHOT.jar>
INFO     root:external.py:847 Starting a JAR-based expansion service from JAR <https://ci-beam.apache.org/job/beam_PostCommit_XVR_Flink/ws/src/sdks/java/extensions/sql/expansion-service/build/libs/beam-sdks-java-extensions-sql-expansion-service-2.45.0-SNAPSHOT.jar> 
INFO     apache_beam.utils.subprocess_server:subprocess_server.py:116 Starting service with ['java' '-jar' '<https://ci-beam.apache.org/job/beam_PostCommit_XVR_Flink/ws/src/sdks/java/extensions/sql/expansion-service/build/libs/beam-sdks-java-extensions-sql-expansion-service-2.45.0-SNAPSHOT.jar'> '53055' '--filesToStage=<https://ci-beam.apache.org/job/beam_PostCommit_XVR_Flink/ws/src/sdks/java/extensions/sql/expansion-service/build/libs/beam-sdks-java-extensions-sql-expansion-service-2.45.0-SNAPSHOT.jar']>
INFO     apache_beam.utils.subprocess_server:subprocess_server.py:126 Starting expansion service at localhost:53055
INFO     apache_beam.utils.subprocess_server:subprocess_server.py:126 Dec 06, 2022 5:20:40 PM org.apache.beam.sdk.expansion.service.ExpansionService loadRegisteredTransforms
INFO     apache_beam.utils.subprocess_server:subprocess_server.py:126 INFO: Registering external transforms: [beam:external:java:sql:v1, beam:transform:org.apache.beam:pubsub_read:v1, beam:transform:org.apache.beam:pubsub_write:v1, beam:transform:org.apache.beam:pubsublite_write:v1, beam:transform:org.apache.beam:pubsublite_read:v1, beam:transform:org.apache.beam:spanner_insert:v1, beam:transform:org.apache.beam:spanner_update:v1, beam:transform:org.apache.beam:spanner_replace:v1, beam:transform:org.apache.beam:spanner_insert_or_update:v1, beam:transform:org.apache.beam:spanner_delete:v1, beam:transform:org.apache.beam:spanner_read:v1, beam:transform:org.apache.beam:kafka_read_with_metadata:v1, beam:transform:org.apache.beam:kafka_read_without_metadata:v1, beam:transform:org.apache.beam:kafka_write:v1, beam:external:java:generate_sequence:v1]
INFO     apache_beam.utils.subprocess_server:subprocess_server.py:126 
INFO     apache_beam.utils.subprocess_server:subprocess_server.py:126 Registered transforms:
INFO     apache_beam.utils.subprocess_server:subprocess_server.py:126 	beam:external:java:sql:v1: org.apache.beam.sdk.expansion.service.ExpansionService$ExternalTransformRegistrarLoader$1@38425407
INFO     apache_beam.utils.subprocess_server:subprocess_server.py:126 	beam:transform:org.apache.beam:pubsub_read:v1: org.apache.beam.sdk.expansion.service.ExpansionService$ExternalTransformRegistrarLoader$1@43bc63a3
INFO     apache_beam.utils.subprocess_server:subprocess_server.py:126 	beam:transform:org.apache.beam:pubsub_write:v1: org.apache.beam.sdk.expansion.service.ExpansionService$ExternalTransformRegistrarLoader$1@702657cc
INFO     apache_beam.utils.subprocess_server:subprocess_server.py:126 	beam:transform:org.apache.beam:pubsublite_write:v1: org.apache.beam.sdk.expansion.service.ExpansionService$ExternalTransformRegistrarLoader$1@6a6cb05c
INFO     apache_beam.utils.subprocess_server:subprocess_server.py:126 	beam:transform:org.apache.beam:pubsublite_read:v1: org.apache.beam.sdk.expansion.service.ExpansionService$ExternalTransformRegistrarLoader$1@40a4337a
INFO     apache_beam.utils.subprocess_server:subprocess_server.py:126 	beam:transform:org.apache.beam:spanner_insert:v1: org.apache.beam.sdk.expansion.service.ExpansionService$ExternalTransformRegistrarLoader$1@6025e1b6
INFO     apache_beam.utils.subprocess_server:subprocess_server.py:126 	beam:transform:org.apache.beam:spanner_update:v1: org.apache.beam.sdk.expansion.service.ExpansionService$ExternalTransformRegistrarLoader$1@22ff4249
INFO     apache_beam.utils.subprocess_server:subprocess_server.py:126 	beam:transform:org.apache.beam:spanner_replace:v1: org.apache.beam.sdk.expansion.service.ExpansionService$ExternalTransformRegistrarLoader$1@2d1ef81a
INFO     apache_beam.utils.subprocess_server:subprocess_server.py:126 	beam:transform:org.apache.beam:spanner_insert_or_update:v1: org.apache.beam.sdk.expansion.service.ExpansionService$ExternalTransformRegistrarLoader$1@4c402120
INFO     apache_beam.utils.subprocess_server:subprocess_server.py:126 	beam:transform:org.apache.beam:spanner_delete:v1: org.apache.beam.sdk.expansion.service.ExpansionService$ExternalTransformRegistrarLoader$1@327514f
INFO     apache_beam.utils.subprocess_server:subprocess_server.py:126 	beam:transform:org.apache.beam:spanner_read:v1: org.apache.beam.sdk.expansion.service.ExpansionService$ExternalTransformRegistrarLoader$1@5b12b668
INFO     apache_beam.utils.subprocess_server:subprocess_server.py:126 	beam:transform:org.apache.beam:kafka_read_with_metadata:v1: org.apache.beam.sdk.expansion.service.ExpansionService$ExternalTransformRegistrarLoader$1@1165b38
INFO     apache_beam.utils.subprocess_server:subprocess_server.py:126 	beam:transform:org.apache.beam:kafka_read_without_metadata:v1: org.apache.beam.sdk.expansion.service.ExpansionService$ExternalTransformRegistrarLoader$1@4c12331b
INFO     apache_beam.utils.subprocess_server:subprocess_server.py:126 	beam:transform:org.apache.beam:kafka_write:v1: org.apache.beam.sdk.expansion.service.ExpansionService$ExternalTransformRegistrarLoader$1@7586beff
INFO     apache_beam.utils.subprocess_server:subprocess_server.py:126 	beam:external:java:generate_sequence:v1: org.apache.beam.sdk.expansion.service.ExpansionService$ExternalTransformRegistrarLoader$1@3b69e7d1
INFO     apache_beam.utils.subprocess_server:subprocess_server.py:126 
INFO     apache_beam.utils.subprocess_server:subprocess_server.py:126 Registered SchemaTransformProviders:
INFO     apache_beam.utils.subprocess_server:subprocess_server.py:126 	beam:schematransform:org.apache.beam:kafka_read:v1
INFO     apache_beam.utils.subprocess_server:subprocess_server.py:126 	beam:schematransform:org.apache.beam:spanner_write:v1
INFO     apache_beam.utils.subprocess_server:subprocess_server.py:126 	beam:transform:org.apache.beam:bigquery_storage_read:v1
INFO     apache_beam.utils.subprocess_server:subprocess_server.py:126 Dec 06, 2022 5:20:42 PM org.apache.beam.sdk.expansion.service.ExpansionService expand
INFO     apache_beam.utils.subprocess_server:subprocess_server.py:126 INFO: Expanding 'SqlTransform(beam:external:java:sql:v1)' with URN 'beam:external:java:sql:v1'
INFO     apache_beam.utils.subprocess_server:subprocess_server.py:126 Dec 06, 2022 5:20:42 PM org.apache.beam.sdk.expansion.service.ExpansionService$ExternalTransformRegistrarLoader payloadToConfig
INFO     apache_beam.utils.subprocess_server:subprocess_server.py:126 WARNING: Configuration class 'org.apache.beam.sdk.extensions.sql.expansion.ExternalSqlTransformRegistrar$Configuration' has no schema registered. Attempting to construct with setter approach.
INFO     apache_beam.utils.subprocess_server:subprocess_server.py:126 Dec 06, 2022 5:20:42 PM org.apache.beam.sdk.expansion.service.ExpansionService$ExternalTransformRegistrarLoader payloadToConfig
INFO     apache_beam.utils.subprocess_server:subprocess_server.py:126 WARNING: Configuration class 'org.apache.beam.sdk.extensions.sql.expansion.ExternalSqlTransformRegistrar$Configuration' has no schema registered. Attempting to construct with setter approach.
INFO     apache_beam.utils.subprocess_server:subprocess_server.py:126 Dec 06, 2022 5:20:44 PM com.google.zetasql.io.grpc.NameResolverRegistry getDefaultRegistry
INFO     apache_beam.utils.subprocess_server:subprocess_server.py:126 WARNING: No NameResolverProviders found via ServiceLoader, including for DNS. This is probably due to a broken build. If using ProGuard, check your configuration
INFO     apache_beam.utils.subprocess_server:subprocess_server.py:126 Dec 06, 2022 5:20:46 PM org.apache.beam.sdk.extensions.sql.zetasql.ZetaSQLQueryPlanner convertToBeamRelInternal
INFO     apache_beam.utils.subprocess_server:subprocess_server.py:126 INFO: BEAMPlan>
INFO     apache_beam.utils.subprocess_server:subprocess_server.py:126 BeamZetaSqlCalcRel(expr#0=[{inputs}], expr#1=[1:BIGINT], expr#2=['foo':VARCHAR], expr#3=[3.1400000000000001243E0:DOUBLE], int=[$t1], str=[$t2], flt=[$t3])
INFO     apache_beam.utils.subprocess_server:subprocess_server.py:126   BeamValuesRel(tuples=[[{ 0 }]])
INFO     apache_beam.utils.subprocess_server:subprocess_server.py:126 
INFO     root:environments.py:376 Default Python SDK image for environment is apache/beam_python3.10_sdk:2.45.0.dev
INFO     root:environments.py:299 No image given, using default Python SDK image
INFO     root:environments.py:376 Default Python SDK image for environment is apache/beam_python3.10_sdk:2.45.0.dev
INFO     root:environments.py:302 Python SDK container image set to "apache/beam_python3.10_sdk:2.45.0.dev" for Docker environment
INFO     apache_beam.runners.portability.fn_api_runner.translations:translations.py:710 ==================== <function pack_combiners at 0x7faa0ed127a0> ====================
INFO     apache_beam.runners.portability.fn_api_runner.translations:translations.py:710 ==================== <function lift_combiners at 0x7faa0ed12830> ====================
INFO     apache_beam.runners.portability.fn_api_runner.translations:translations.py:710 ==================== <function sort_stages at 0x7faa0ed12f80> ====================
INFO     apache_beam.runners.portability.portable_runner:portable_runner.py:581 Job state changed to STOPPED
INFO     apache_beam.runners.portability.portable_runner:portable_runner.py:581 Job state changed to STARTING
INFO     apache_beam.runners.portability.portable_runner:portable_runner.py:581 Job state changed to RUNNING
INFO     apache_beam.runners.portability.portable_runner:portable_runner.py:581 Job state changed to DONE
PASSED                                                                   [100%]

=============================== warnings summary ===============================
../../build/gradleenv/1922375555/lib/python3.10/site-packages/hdfs/config.py:15
  <https://ci-beam.apache.org/job/beam_PostCommit_XVR_Flink/ws/src/build/gradleenv/1922375555/lib/python3.10/site-packages/hdfs/config.py>:15: DeprecationWarning: the imp module is deprecated in favour of importlib and slated for removal in Python 3.12; see the module's documentation for alternative uses
    from imp import load_source

../../build/gradleenv/1922375555/lib/python3.10/site-packages/google/api_core/operations_v1/abstract_operations_client.py:17
  <https://ci-beam.apache.org/job/beam_PostCommit_XVR_Flink/ws/src/build/gradleenv/1922375555/lib/python3.10/site-packages/google/api_core/operations_v1/abstract_operations_client.py>:17: DeprecationWarning: The distutils package is deprecated and slated for removal in Python 3.12. Use setuptools or check PEP 632 for potential alternatives
    from distutils import util

../../build/gradleenv/1922375555/lib/python3.10/site-packages/tenacity/_asyncio.py:42
  <https://ci-beam.apache.org/job/beam_PostCommit_XVR_Flink/ws/src/build/gradleenv/1922375555/lib/python3.10/site-packages/tenacity/_asyncio.py>:42: DeprecationWarning: "@coroutine" decorator is deprecated since Python 3.8, use "async def" instead
    def call(self, fn, *args, **kwargs):

apache_beam/typehints/pandas_type_compatibility_test.py:67
  <https://ci-beam.apache.org/job/beam_PostCommit_XVR_Flink/ws/src/sdks/python/apache_beam/typehints/pandas_type_compatibility_test.py>:67: FutureWarning: pandas.Int64Index is deprecated and will be removed from pandas in a future version. Use pandas.Index with the appropriate dtype instead.
    }).set_index(pd.Int64Index(range(123, 223), name='an_index')),

apache_beam/typehints/pandas_type_compatibility_test.py:90
  <https://ci-beam.apache.org/job/beam_PostCommit_XVR_Flink/ws/src/sdks/python/apache_beam/typehints/pandas_type_compatibility_test.py>:90: FutureWarning: pandas.Int64Index is deprecated and will be removed from pandas in a future version. Use pandas.Index with the appropriate dtype instead.
    pd.Int64Index(range(123, 223), name='an_index'),

apache_beam/typehints/pandas_type_compatibility_test.py:91
  <https://ci-beam.apache.org/job/beam_PostCommit_XVR_Flink/ws/src/sdks/python/apache_beam/typehints/pandas_type_compatibility_test.py>:91: FutureWarning: pandas.Int64Index is deprecated and will be removed from pandas in a future version. Use pandas.Index with the appropriate dtype instead.
    pd.Int64Index(range(475, 575), name='another_index'),

-- Docs: https://docs.pytest.org/en/stable/how-to/capture-warnings.html
- generated xml file: <https://ci-beam.apache.org/job/beam_PostCommit_XVR_Flink/ws/src/sdks/python/pytest_xlangSqlValidateRunner.xml> -
==== 9 passed, 5 skipped, 6735 deselected, 6 warnings in 221.06s (0:03:41) =====

> Task :runners:flink:1.15:job-server:flinkJobServerCleanup
Stopping job server pid: 2476093.

> Task :runners:flink:1.15:job-server:validatesCrossLanguageRunnerCleanup
Stopping expansion service pid: 2502378.
Stopping expansion service pid: 2502379.

FAILURE: Build failed with an exception.

* What went wrong:
Execution failed for task ':runners:flink:1.15:job-server:validatesCrossLanguageRunnerJavaUsingPython'.
> There were failing tests. See the report at: file://<https://ci-beam.apache.org/job/beam_PostCommit_XVR_Flink/ws/src/runners/flink/1.15/job-server/build/reports/tests/validatesCrossLanguageRunnerJavaUsingPython/index.html>

* Try:
> Run with --stacktrace option to get the stack trace.
> Run with --info or --debug option to get more log output.

* Get more help at https://help.gradle.org

Deprecated Gradle features were used in this build, making it incompatible with Gradle 8.0.

You can use '--warning-mode all' to show the individual deprecation warnings and determine if they come from your own scripts or plugins.

See https://docs.gradle.org/7.5.1/userguide/command_line_interface.html#sec:command_line_warnings

Execution optimizations have been disabled for 1 invalid unit(s) of work during this build to ensure correctness.
Please consult deprecation warnings for more details.

BUILD FAILED in 30m 12s
255 actionable tasks: 32 executed, 223 up-to-date

Publishing build scan...
https://gradle.com/s/ga5jlfev4it6c

Build step 'Invoke Gradle script' changed build result to FAILURE
Build step 'Invoke Gradle script' marked build as failure

---------------------------------------------------------------------
To unsubscribe, e-mail: builds-unsubscribe@beam.apache.org
For additional commands, e-mail: builds-help@beam.apache.org


Jenkins build is back to normal : beam_PostCommit_XVR_Flink #6226

Posted by Apache Jenkins Server <je...@builds.apache.org>.
See <https://ci-beam.apache.org/job/beam_PostCommit_XVR_Flink/6226/display/redirect?page=changes>


---------------------------------------------------------------------
To unsubscribe, e-mail: builds-unsubscribe@beam.apache.org
For additional commands, e-mail: builds-help@beam.apache.org


Build failed in Jenkins: beam_PostCommit_XVR_Flink #6225

Posted by Apache Jenkins Server <je...@builds.apache.org>.
See <https://ci-beam.apache.org/job/beam_PostCommit_XVR_Flink/6225/display/redirect?page=changes>

Changes:

[Kenneth Knowles] Suppress keyfor warnings

[Kenneth Knowles] Suppress checker warnings that are confusing and difficult

[Kenneth Knowles] Add @Pure annotations to MongoDbIO autovalue fields

[Kenneth Knowles] Suppress checker in FnApiDoFnRunner due to crash

[Kenneth Knowles] Suppress checker framework in Dataflow

[Kenneth Knowles] Fix some nullness errors in Spark runner

[Kenneth Knowles] Upgrade checker framework to 3.27.0

[noreply] fix go lints (#24566)

[noreply] Samza runner support for non unique stateId across multiple ParDos

[noreply] Bump to Hadoop 3.3.4 for performance tests (#24550)


------------------------------------------
[...truncated 2.75 MB...]
-------------------------------- live log call ---------------------------------
INFO     apache_beam.utils.subprocess_server:subprocess_server.py:239 Using pre-built snapshot at <https://ci-beam.apache.org/job/beam_PostCommit_XVR_Flink/ws/src/sdks/java/extensions/sql/expansion-service/build/libs/beam-sdks-java-extensions-sql-expansion-service-2.45.0-SNAPSHOT.jar>
INFO     root:external.py:847 Starting a JAR-based expansion service from JAR <https://ci-beam.apache.org/job/beam_PostCommit_XVR_Flink/ws/src/sdks/java/extensions/sql/expansion-service/build/libs/beam-sdks-java-extensions-sql-expansion-service-2.45.0-SNAPSHOT.jar> 
INFO     apache_beam.utils.subprocess_server:subprocess_server.py:116 Starting service with ['java' '-jar' '<https://ci-beam.apache.org/job/beam_PostCommit_XVR_Flink/ws/src/sdks/java/extensions/sql/expansion-service/build/libs/beam-sdks-java-extensions-sql-expansion-service-2.45.0-SNAPSHOT.jar'> '46523' '--filesToStage=<https://ci-beam.apache.org/job/beam_PostCommit_XVR_Flink/ws/src/sdks/java/extensions/sql/expansion-service/build/libs/beam-sdks-java-extensions-sql-expansion-service-2.45.0-SNAPSHOT.jar']>
INFO     apache_beam.utils.subprocess_server:subprocess_server.py:126 Starting expansion service at localhost:46523
INFO     apache_beam.utils.subprocess_server:subprocess_server.py:126 Dec 07, 2022 11:34:35 PM org.apache.beam.sdk.expansion.service.ExpansionService loadRegisteredTransforms
INFO     apache_beam.utils.subprocess_server:subprocess_server.py:126 INFO: Registering external transforms: [beam:external:java:sql:v1, beam:transform:org.apache.beam:pubsub_read:v1, beam:transform:org.apache.beam:pubsub_write:v1, beam:transform:org.apache.beam:pubsublite_write:v1, beam:transform:org.apache.beam:pubsublite_read:v1, beam:transform:org.apache.beam:spanner_insert:v1, beam:transform:org.apache.beam:spanner_update:v1, beam:transform:org.apache.beam:spanner_replace:v1, beam:transform:org.apache.beam:spanner_insert_or_update:v1, beam:transform:org.apache.beam:spanner_delete:v1, beam:transform:org.apache.beam:spanner_read:v1, beam:transform:org.apache.beam:kafka_read_with_metadata:v1, beam:transform:org.apache.beam:kafka_read_without_metadata:v1, beam:transform:org.apache.beam:kafka_write:v1, beam:external:java:generate_sequence:v1]
INFO     apache_beam.utils.subprocess_server:subprocess_server.py:126 
INFO     apache_beam.utils.subprocess_server:subprocess_server.py:126 Registered transforms:
INFO     apache_beam.utils.subprocess_server:subprocess_server.py:126 	beam:external:java:sql:v1: org.apache.beam.sdk.expansion.service.ExpansionService$ExternalTransformRegistrarLoader$1@38425407
INFO     apache_beam.utils.subprocess_server:subprocess_server.py:126 	beam:transform:org.apache.beam:pubsub_read:v1: org.apache.beam.sdk.expansion.service.ExpansionService$ExternalTransformRegistrarLoader$1@43bc63a3
INFO     apache_beam.utils.subprocess_server:subprocess_server.py:126 	beam:transform:org.apache.beam:pubsub_write:v1: org.apache.beam.sdk.expansion.service.ExpansionService$ExternalTransformRegistrarLoader$1@702657cc
INFO     apache_beam.utils.subprocess_server:subprocess_server.py:126 	beam:transform:org.apache.beam:pubsublite_write:v1: org.apache.beam.sdk.expansion.service.ExpansionService$ExternalTransformRegistrarLoader$1@6a6cb05c
INFO     apache_beam.utils.subprocess_server:subprocess_server.py:126 	beam:transform:org.apache.beam:pubsublite_read:v1: org.apache.beam.sdk.expansion.service.ExpansionService$ExternalTransformRegistrarLoader$1@40a4337a
INFO     apache_beam.utils.subprocess_server:subprocess_server.py:126 	beam:transform:org.apache.beam:spanner_insert:v1: org.apache.beam.sdk.expansion.service.ExpansionService$ExternalTransformRegistrarLoader$1@6025e1b6
INFO     apache_beam.utils.subprocess_server:subprocess_server.py:126 	beam:transform:org.apache.beam:spanner_update:v1: org.apache.beam.sdk.expansion.service.ExpansionService$ExternalTransformRegistrarLoader$1@22ff4249
INFO     apache_beam.utils.subprocess_server:subprocess_server.py:126 	beam:transform:org.apache.beam:spanner_replace:v1: org.apache.beam.sdk.expansion.service.ExpansionService$ExternalTransformRegistrarLoader$1@2d1ef81a
INFO     apache_beam.utils.subprocess_server:subprocess_server.py:126 	beam:transform:org.apache.beam:spanner_insert_or_update:v1: org.apache.beam.sdk.expansion.service.ExpansionService$ExternalTransformRegistrarLoader$1@4c402120
INFO     apache_beam.utils.subprocess_server:subprocess_server.py:126 	beam:transform:org.apache.beam:spanner_delete:v1: org.apache.beam.sdk.expansion.service.ExpansionService$ExternalTransformRegistrarLoader$1@327514f
INFO     apache_beam.utils.subprocess_server:subprocess_server.py:126 	beam:transform:org.apache.beam:spanner_read:v1: org.apache.beam.sdk.expansion.service.ExpansionService$ExternalTransformRegistrarLoader$1@5b12b668
INFO     apache_beam.utils.subprocess_server:subprocess_server.py:126 	beam:transform:org.apache.beam:kafka_read_with_metadata:v1: org.apache.beam.sdk.expansion.service.ExpansionService$ExternalTransformRegistrarLoader$1@1165b38
INFO     apache_beam.utils.subprocess_server:subprocess_server.py:126 	beam:transform:org.apache.beam:kafka_read_without_metadata:v1: org.apache.beam.sdk.expansion.service.ExpansionService$ExternalTransformRegistrarLoader$1@4c12331b
INFO     apache_beam.utils.subprocess_server:subprocess_server.py:126 	beam:transform:org.apache.beam:kafka_write:v1: org.apache.beam.sdk.expansion.service.ExpansionService$ExternalTransformRegistrarLoader$1@7586beff
INFO     apache_beam.utils.subprocess_server:subprocess_server.py:126 	beam:external:java:generate_sequence:v1: org.apache.beam.sdk.expansion.service.ExpansionService$ExternalTransformRegistrarLoader$1@3b69e7d1
INFO     apache_beam.utils.subprocess_server:subprocess_server.py:126 
INFO     apache_beam.utils.subprocess_server:subprocess_server.py:126 Registered SchemaTransformProviders:
INFO     apache_beam.utils.subprocess_server:subprocess_server.py:126 	beam:schematransform:org.apache.beam:kafka_read:v1
INFO     apache_beam.utils.subprocess_server:subprocess_server.py:126 	beam:schematransform:org.apache.beam:spanner_write:v1
INFO     apache_beam.utils.subprocess_server:subprocess_server.py:126 	beam:transform:org.apache.beam:bigquery_storage_read:v1
INFO     apache_beam.utils.subprocess_server:subprocess_server.py:126 Dec 07, 2022 11:34:36 PM org.apache.beam.sdk.expansion.service.ExpansionService expand
INFO     apache_beam.utils.subprocess_server:subprocess_server.py:126 INFO: Expanding 'SqlTransform(beam:external:java:sql:v1)' with URN 'beam:external:java:sql:v1'
INFO     apache_beam.utils.subprocess_server:subprocess_server.py:126 Dec 07, 2022 11:34:37 PM org.apache.beam.sdk.expansion.service.ExpansionService$ExternalTransformRegistrarLoader payloadToConfig
INFO     apache_beam.utils.subprocess_server:subprocess_server.py:126 WARNING: Configuration class 'org.apache.beam.sdk.extensions.sql.expansion.ExternalSqlTransformRegistrar$Configuration' has no schema registered. Attempting to construct with setter approach.
INFO     apache_beam.utils.subprocess_server:subprocess_server.py:126 Dec 07, 2022 11:34:37 PM org.apache.beam.sdk.expansion.service.ExpansionService$ExternalTransformRegistrarLoader payloadToConfig
INFO     apache_beam.utils.subprocess_server:subprocess_server.py:126 WARNING: Configuration class 'org.apache.beam.sdk.extensions.sql.expansion.ExternalSqlTransformRegistrar$Configuration' has no schema registered. Attempting to construct with setter approach.
INFO     apache_beam.utils.subprocess_server:subprocess_server.py:126 Dec 07, 2022 11:34:38 PM org.apache.beam.sdk.extensions.sql.impl.CalciteQueryPlanner convertToBeamRel
INFO     apache_beam.utils.subprocess_server:subprocess_server.py:126 INFO: SQL:
INFO     apache_beam.utils.subprocess_server:subprocess_server.py:126 SELECT `simple`.`id` AS `id`, `enrich`.`metadata` AS `metadata`
INFO     apache_beam.utils.subprocess_server:subprocess_server.py:126 FROM `beam`.`simple` AS `simple`
INFO     apache_beam.utils.subprocess_server:subprocess_server.py:126 INNER JOIN `beam`.`enrich` AS `enrich` ON `simple`.`id` = `enrich`.`id`
INFO     apache_beam.utils.subprocess_server:subprocess_server.py:126 Dec 07, 2022 11:34:39 PM org.apache.beam.sdk.extensions.sql.impl.CalciteQueryPlanner convertToBeamRel
INFO     apache_beam.utils.subprocess_server:subprocess_server.py:126 INFO: SQLPlan>
INFO     apache_beam.utils.subprocess_server:subprocess_server.py:126 LogicalProject(id=[$0], metadata=[$4])
INFO     apache_beam.utils.subprocess_server:subprocess_server.py:126   LogicalJoin(condition=[=($0, $3)], joinType=[inner])
INFO     apache_beam.utils.subprocess_server:subprocess_server.py:126     BeamIOSourceRel(table=[[beam, simple]])
INFO     apache_beam.utils.subprocess_server:subprocess_server.py:126     BeamIOSourceRel(table=[[beam, enrich]])
INFO     apache_beam.utils.subprocess_server:subprocess_server.py:126 
INFO     apache_beam.utils.subprocess_server:subprocess_server.py:126 Dec 07, 2022 11:34:39 PM org.apache.beam.sdk.extensions.sql.impl.CalciteQueryPlanner convertToBeamRel
INFO     apache_beam.utils.subprocess_server:subprocess_server.py:126 INFO: BEAMPlan>
INFO     apache_beam.utils.subprocess_server:subprocess_server.py:126 BeamCalcRel(expr#0..4=[{inputs}], id=[$t0], metadata=[$t4])
INFO     apache_beam.utils.subprocess_server:subprocess_server.py:126   BeamCoGBKJoinRel(condition=[=($0, $3)], joinType=[inner])
INFO     apache_beam.utils.subprocess_server:subprocess_server.py:126     BeamIOSourceRel(table=[[beam, simple]])
INFO     apache_beam.utils.subprocess_server:subprocess_server.py:126     BeamIOSourceRel(table=[[beam, enrich]])
INFO     apache_beam.utils.subprocess_server:subprocess_server.py:126 
INFO     root:environments.py:376 Default Python SDK image for environment is apache/beam_python3.10_sdk:2.45.0.dev
INFO     root:environments.py:299 No image given, using default Python SDK image
INFO     root:environments.py:376 Default Python SDK image for environment is apache/beam_python3.10_sdk:2.45.0.dev
INFO     root:environments.py:302 Python SDK container image set to "apache/beam_python3.10_sdk:2.45.0.dev" for Docker environment
INFO     apache_beam.runners.portability.fn_api_runner.translations:translations.py:710 ==================== <function pack_combiners at 0x7fbbbad2e5f0> ====================
INFO     apache_beam.runners.portability.fn_api_runner.translations:translations.py:710 ==================== <function lift_combiners at 0x7fbbbad2e680> ====================
INFO     apache_beam.runners.portability.fn_api_runner.translations:translations.py:710 ==================== <function sort_stages at 0x7fbbbad2edd0> ====================
INFO     apache_beam.runners.portability.portable_runner:portable_runner.py:581 Job state changed to STOPPED
INFO     apache_beam.runners.portability.portable_runner:portable_runner.py:581 Job state changed to STARTING
INFO     apache_beam.runners.portability.portable_runner:portable_runner.py:581 Job state changed to RUNNING
INFO     apache_beam.runners.portability.portable_runner:portable_runner.py:581 Job state changed to DONE
PASSED                                                                   [ 77%]
apache_beam/transforms/sql_test.py::SqlTransformTest::test_windowing_before_sql 
-------------------------------- live log call ---------------------------------
INFO     apache_beam.utils.subprocess_server:subprocess_server.py:239 Using pre-built snapshot at <https://ci-beam.apache.org/job/beam_PostCommit_XVR_Flink/ws/src/sdks/java/extensions/sql/expansion-service/build/libs/beam-sdks-java-extensions-sql-expansion-service-2.45.0-SNAPSHOT.jar>
INFO     root:external.py:847 Starting a JAR-based expansion service from JAR <https://ci-beam.apache.org/job/beam_PostCommit_XVR_Flink/ws/src/sdks/java/extensions/sql/expansion-service/build/libs/beam-sdks-java-extensions-sql-expansion-service-2.45.0-SNAPSHOT.jar> 
INFO     apache_beam.utils.subprocess_server:subprocess_server.py:116 Starting service with ['java' '-jar' '<https://ci-beam.apache.org/job/beam_PostCommit_XVR_Flink/ws/src/sdks/java/extensions/sql/expansion-service/build/libs/beam-sdks-java-extensions-sql-expansion-service-2.45.0-SNAPSHOT.jar'> '39257' '--filesToStage=<https://ci-beam.apache.org/job/beam_PostCommit_XVR_Flink/ws/src/sdks/java/extensions/sql/expansion-service/build/libs/beam-sdks-java-extensions-sql-expansion-service-2.45.0-SNAPSHOT.jar']>
INFO     apache_beam.utils.subprocess_server:subprocess_server.py:126 Starting expansion service at localhost:39257
INFO     apache_beam.utils.subprocess_server:subprocess_server.py:126 Dec 07, 2022 11:34:59 PM org.apache.beam.sdk.expansion.service.ExpansionService loadRegisteredTransforms
INFO     apache_beam.utils.subprocess_server:subprocess_server.py:126 INFO: Registering external transforms: [beam:external:java:sql:v1, beam:transform:org.apache.beam:pubsub_read:v1, beam:transform:org.apache.beam:pubsub_write:v1, beam:transform:org.apache.beam:pubsublite_write:v1, beam:transform:org.apache.beam:pubsublite_read:v1, beam:transform:org.apache.beam:spanner_insert:v1, beam:transform:org.apache.beam:spanner_update:v1, beam:transform:org.apache.beam:spanner_replace:v1, beam:transform:org.apache.beam:spanner_insert_or_update:v1, beam:transform:org.apache.beam:spanner_delete:v1, beam:transform:org.apache.beam:spanner_read:v1, beam:transform:org.apache.beam:kafka_read_with_metadata:v1, beam:transform:org.apache.beam:kafka_read_without_metadata:v1, beam:transform:org.apache.beam:kafka_write:v1, beam:external:java:generate_sequence:v1]
INFO     apache_beam.utils.subprocess_server:subprocess_server.py:126 
INFO     apache_beam.utils.subprocess_server:subprocess_server.py:126 Registered transforms:
INFO     apache_beam.utils.subprocess_server:subprocess_server.py:126 	beam:external:java:sql:v1: org.apache.beam.sdk.expansion.service.ExpansionService$ExternalTransformRegistrarLoader$1@38425407
INFO     apache_beam.utils.subprocess_server:subprocess_server.py:126 	beam:transform:org.apache.beam:pubsub_read:v1: org.apache.beam.sdk.expansion.service.ExpansionService$ExternalTransformRegistrarLoader$1@43bc63a3
INFO     apache_beam.utils.subprocess_server:subprocess_server.py:126 	beam:transform:org.apache.beam:pubsub_write:v1: org.apache.beam.sdk.expansion.service.ExpansionService$ExternalTransformRegistrarLoader$1@702657cc
INFO     apache_beam.utils.subprocess_server:subprocess_server.py:126 	beam:transform:org.apache.beam:pubsublite_write:v1: org.apache.beam.sdk.expansion.service.ExpansionService$ExternalTransformRegistrarLoader$1@6a6cb05c
INFO     apache_beam.utils.subprocess_server:subprocess_server.py:126 	beam:transform:org.apache.beam:pubsublite_read:v1: org.apache.beam.sdk.expansion.service.ExpansionService$ExternalTransformRegistrarLoader$1@40a4337a
INFO     apache_beam.utils.subprocess_server:subprocess_server.py:126 	beam:transform:org.apache.beam:spanner_insert:v1: org.apache.beam.sdk.expansion.service.ExpansionService$ExternalTransformRegistrarLoader$1@6025e1b6
INFO     apache_beam.utils.subprocess_server:subprocess_server.py:126 	beam:transform:org.apache.beam:spanner_update:v1: org.apache.beam.sdk.expansion.service.ExpansionService$ExternalTransformRegistrarLoader$1@22ff4249
INFO     apache_beam.utils.subprocess_server:subprocess_server.py:126 	beam:transform:org.apache.beam:spanner_replace:v1: org.apache.beam.sdk.expansion.service.ExpansionService$ExternalTransformRegistrarLoader$1@2d1ef81a
INFO     apache_beam.utils.subprocess_server:subprocess_server.py:126 	beam:transform:org.apache.beam:spanner_insert_or_update:v1: org.apache.beam.sdk.expansion.service.ExpansionService$ExternalTransformRegistrarLoader$1@4c402120
INFO     apache_beam.utils.subprocess_server:subprocess_server.py:126 	beam:transform:org.apache.beam:spanner_delete:v1: org.apache.beam.sdk.expansion.service.ExpansionService$ExternalTransformRegistrarLoader$1@327514f
INFO     apache_beam.utils.subprocess_server:subprocess_server.py:126 	beam:transform:org.apache.beam:spanner_read:v1: org.apache.beam.sdk.expansion.service.ExpansionService$ExternalTransformRegistrarLoader$1@5b12b668
INFO     apache_beam.utils.subprocess_server:subprocess_server.py:126 	beam:transform:org.apache.beam:kafka_read_with_metadata:v1: org.apache.beam.sdk.expansion.service.ExpansionService$ExternalTransformRegistrarLoader$1@1165b38
INFO     apache_beam.utils.subprocess_server:subprocess_server.py:126 	beam:transform:org.apache.beam:kafka_read_without_metadata:v1: org.apache.beam.sdk.expansion.service.ExpansionService$ExternalTransformRegistrarLoader$1@4c12331b
INFO     apache_beam.utils.subprocess_server:subprocess_server.py:126 	beam:transform:org.apache.beam:kafka_write:v1: org.apache.beam.sdk.expansion.service.ExpansionService$ExternalTransformRegistrarLoader$1@7586beff
INFO     apache_beam.utils.subprocess_server:subprocess_server.py:126 	beam:external:java:generate_sequence:v1: org.apache.beam.sdk.expansion.service.ExpansionService$ExternalTransformRegistrarLoader$1@3b69e7d1
INFO     apache_beam.utils.subprocess_server:subprocess_server.py:126 
INFO     apache_beam.utils.subprocess_server:subprocess_server.py:126 Registered SchemaTransformProviders:
INFO     apache_beam.utils.subprocess_server:subprocess_server.py:126 	beam:schematransform:org.apache.beam:kafka_read:v1
INFO     apache_beam.utils.subprocess_server:subprocess_server.py:126 	beam:schematransform:org.apache.beam:spanner_write:v1
INFO     apache_beam.utils.subprocess_server:subprocess_server.py:126 	beam:transform:org.apache.beam:bigquery_storage_read:v1
INFO     apache_beam.utils.subprocess_server:subprocess_server.py:126 Dec 07, 2022 11:35:01 PM org.apache.beam.sdk.expansion.service.ExpansionService expand
INFO     apache_beam.utils.subprocess_server:subprocess_server.py:126 INFO: Expanding 'SqlTransform(beam:external:java:sql:v1)' with URN 'beam:external:java:sql:v1'
INFO     apache_beam.utils.subprocess_server:subprocess_server.py:126 Dec 07, 2022 11:35:01 PM org.apache.beam.sdk.expansion.service.ExpansionService$ExternalTransformRegistrarLoader payloadToConfig
INFO     apache_beam.utils.subprocess_server:subprocess_server.py:126 WARNING: Configuration class 'org.apache.beam.sdk.extensions.sql.expansion.ExternalSqlTransformRegistrar$Configuration' has no schema registered. Attempting to construct with setter approach.
INFO     apache_beam.utils.subprocess_server:subprocess_server.py:126 Dec 07, 2022 11:35:02 PM org.apache.beam.sdk.expansion.service.ExpansionService$ExternalTransformRegistrarLoader payloadToConfig
INFO     apache_beam.utils.subprocess_server:subprocess_server.py:126 WARNING: Configuration class 'org.apache.beam.sdk.extensions.sql.expansion.ExternalSqlTransformRegistrar$Configuration' has no schema registered. Attempting to construct with setter approach.
INFO     apache_beam.utils.subprocess_server:subprocess_server.py:126 Dec 07, 2022 11:35:03 PM org.apache.beam.sdk.extensions.sql.impl.CalciteQueryPlanner convertToBeamRel
INFO     apache_beam.utils.subprocess_server:subprocess_server.py:126 INFO: SQL:
INFO     apache_beam.utils.subprocess_server:subprocess_server.py:126 SELECT COUNT(*) AS `count`
INFO     apache_beam.utils.subprocess_server:subprocess_server.py:126 FROM `beam`.`PCOLLECTION` AS `PCOLLECTION`
INFO     apache_beam.utils.subprocess_server:subprocess_server.py:126 Dec 07, 2022 11:35:03 PM org.apache.beam.sdk.extensions.sql.impl.CalciteQueryPlanner convertToBeamRel
INFO     apache_beam.utils.subprocess_server:subprocess_server.py:126 INFO: SQLPlan>
INFO     apache_beam.utils.subprocess_server:subprocess_server.py:126 LogicalAggregate(group=[{}], count=[COUNT()])
INFO     apache_beam.utils.subprocess_server:subprocess_server.py:126   BeamIOSourceRel(table=[[beam, PCOLLECTION]])
INFO     apache_beam.utils.subprocess_server:subprocess_server.py:126 
INFO     apache_beam.utils.subprocess_server:subprocess_server.py:126 Dec 07, 2022 11:35:04 PM org.apache.beam.sdk.extensions.sql.impl.CalciteQueryPlanner convertToBeamRel
INFO     apache_beam.utils.subprocess_server:subprocess_server.py:126 INFO: BEAMPlan>
INFO     apache_beam.utils.subprocess_server:subprocess_server.py:126 BeamAggregationRel(group=[{}], count=[COUNT()])
INFO     apache_beam.utils.subprocess_server:subprocess_server.py:126   BeamIOSourceRel(table=[[beam, PCOLLECTION]])
INFO     apache_beam.utils.subprocess_server:subprocess_server.py:126 
INFO     root:environments.py:376 Default Python SDK image for environment is apache/beam_python3.10_sdk:2.45.0.dev
INFO     root:environments.py:299 No image given, using default Python SDK image
INFO     root:environments.py:376 Default Python SDK image for environment is apache/beam_python3.10_sdk:2.45.0.dev
INFO     root:environments.py:302 Python SDK container image set to "apache/beam_python3.10_sdk:2.45.0.dev" for Docker environment
INFO     apache_beam.runners.portability.fn_api_runner.translations:translations.py:710 ==================== <function pack_combiners at 0x7fbbbad2e5f0> ====================
INFO     apache_beam.runners.portability.fn_api_runner.translations:translations.py:710 ==================== <function lift_combiners at 0x7fbbbad2e680> ====================
INFO     apache_beam.runners.portability.fn_api_runner.translations:translations.py:710 ==================== <function sort_stages at 0x7fbbbad2edd0> ====================
INFO     apache_beam.runners.portability.portable_runner:portable_runner.py:581 Job state changed to STOPPED
INFO     apache_beam.runners.portability.portable_runner:portable_runner.py:581 Job state changed to STARTING
INFO     apache_beam.runners.portability.portable_runner:portable_runner.py:581 Job state changed to RUNNING
INFO     apache_beam.runners.portability.portable_runner:portable_runner.py:581 Job state changed to DONE
PASSED                                                                   [ 88%]
apache_beam/transforms/sql_test.py::SqlTransformTest::test_zetasql_generate_data 
-------------------------------- live log call ---------------------------------
INFO     apache_beam.utils.subprocess_server:subprocess_server.py:239 Using pre-built snapshot at <https://ci-beam.apache.org/job/beam_PostCommit_XVR_Flink/ws/src/sdks/java/extensions/sql/expansion-service/build/libs/beam-sdks-java-extensions-sql-expansion-service-2.45.0-SNAPSHOT.jar>
INFO     root:external.py:847 Starting a JAR-based expansion service from JAR <https://ci-beam.apache.org/job/beam_PostCommit_XVR_Flink/ws/src/sdks/java/extensions/sql/expansion-service/build/libs/beam-sdks-java-extensions-sql-expansion-service-2.45.0-SNAPSHOT.jar> 
INFO     apache_beam.utils.subprocess_server:subprocess_server.py:116 Starting service with ['java' '-jar' '<https://ci-beam.apache.org/job/beam_PostCommit_XVR_Flink/ws/src/sdks/java/extensions/sql/expansion-service/build/libs/beam-sdks-java-extensions-sql-expansion-service-2.45.0-SNAPSHOT.jar'> '57751' '--filesToStage=<https://ci-beam.apache.org/job/beam_PostCommit_XVR_Flink/ws/src/sdks/java/extensions/sql/expansion-service/build/libs/beam-sdks-java-extensions-sql-expansion-service-2.45.0-SNAPSHOT.jar']>
INFO     apache_beam.utils.subprocess_server:subprocess_server.py:126 Starting expansion service at localhost:57751
INFO     apache_beam.utils.subprocess_server:subprocess_server.py:126 Dec 07, 2022 11:35:22 PM org.apache.beam.sdk.expansion.service.ExpansionService loadRegisteredTransforms
INFO     apache_beam.utils.subprocess_server:subprocess_server.py:126 INFO: Registering external transforms: [beam:external:java:sql:v1, beam:transform:org.apache.beam:pubsub_read:v1, beam:transform:org.apache.beam:pubsub_write:v1, beam:transform:org.apache.beam:pubsublite_write:v1, beam:transform:org.apache.beam:pubsublite_read:v1, beam:transform:org.apache.beam:spanner_insert:v1, beam:transform:org.apache.beam:spanner_update:v1, beam:transform:org.apache.beam:spanner_replace:v1, beam:transform:org.apache.beam:spanner_insert_or_update:v1, beam:transform:org.apache.beam:spanner_delete:v1, beam:transform:org.apache.beam:spanner_read:v1, beam:transform:org.apache.beam:kafka_read_with_metadata:v1, beam:transform:org.apache.beam:kafka_read_without_metadata:v1, beam:transform:org.apache.beam:kafka_write:v1, beam:external:java:generate_sequence:v1]
INFO     apache_beam.utils.subprocess_server:subprocess_server.py:126 
INFO     apache_beam.utils.subprocess_server:subprocess_server.py:126 Registered transforms:
INFO     apache_beam.utils.subprocess_server:subprocess_server.py:126 	beam:external:java:sql:v1: org.apache.beam.sdk.expansion.service.ExpansionService$ExternalTransformRegistrarLoader$1@38425407
INFO     apache_beam.utils.subprocess_server:subprocess_server.py:126 	beam:transform:org.apache.beam:pubsub_read:v1: org.apache.beam.sdk.expansion.service.ExpansionService$ExternalTransformRegistrarLoader$1@43bc63a3
INFO     apache_beam.utils.subprocess_server:subprocess_server.py:126 	beam:transform:org.apache.beam:pubsub_write:v1: org.apache.beam.sdk.expansion.service.ExpansionService$ExternalTransformRegistrarLoader$1@702657cc
INFO     apache_beam.utils.subprocess_server:subprocess_server.py:126 	beam:transform:org.apache.beam:pubsublite_write:v1: org.apache.beam.sdk.expansion.service.ExpansionService$ExternalTransformRegistrarLoader$1@6a6cb05c
INFO     apache_beam.utils.subprocess_server:subprocess_server.py:126 	beam:transform:org.apache.beam:pubsublite_read:v1: org.apache.beam.sdk.expansion.service.ExpansionService$ExternalTransformRegistrarLoader$1@40a4337a
INFO     apache_beam.utils.subprocess_server:subprocess_server.py:126 	beam:transform:org.apache.beam:spanner_insert:v1: org.apache.beam.sdk.expansion.service.ExpansionService$ExternalTransformRegistrarLoader$1@6025e1b6
INFO     apache_beam.utils.subprocess_server:subprocess_server.py:126 	beam:transform:org.apache.beam:spanner_update:v1: org.apache.beam.sdk.expansion.service.ExpansionService$ExternalTransformRegistrarLoader$1@22ff4249
INFO     apache_beam.utils.subprocess_server:subprocess_server.py:126 	beam:transform:org.apache.beam:spanner_replace:v1: org.apache.beam.sdk.expansion.service.ExpansionService$ExternalTransformRegistrarLoader$1@2d1ef81a
INFO     apache_beam.utils.subprocess_server:subprocess_server.py:126 	beam:transform:org.apache.beam:spanner_insert_or_update:v1: org.apache.beam.sdk.expansion.service.ExpansionService$ExternalTransformRegistrarLoader$1@4c402120
INFO     apache_beam.utils.subprocess_server:subprocess_server.py:126 	beam:transform:org.apache.beam:spanner_delete:v1: org.apache.beam.sdk.expansion.service.ExpansionService$ExternalTransformRegistrarLoader$1@327514f
INFO     apache_beam.utils.subprocess_server:subprocess_server.py:126 	beam:transform:org.apache.beam:spanner_read:v1: org.apache.beam.sdk.expansion.service.ExpansionService$ExternalTransformRegistrarLoader$1@5b12b668
INFO     apache_beam.utils.subprocess_server:subprocess_server.py:126 	beam:transform:org.apache.beam:kafka_read_with_metadata:v1: org.apache.beam.sdk.expansion.service.ExpansionService$ExternalTransformRegistrarLoader$1@1165b38
INFO     apache_beam.utils.subprocess_server:subprocess_server.py:126 	beam:transform:org.apache.beam:kafka_read_without_metadata:v1: org.apache.beam.sdk.expansion.service.ExpansionService$ExternalTransformRegistrarLoader$1@4c12331b
INFO     apache_beam.utils.subprocess_server:subprocess_server.py:126 	beam:transform:org.apache.beam:kafka_write:v1: org.apache.beam.sdk.expansion.service.ExpansionService$ExternalTransformRegistrarLoader$1@7586beff
INFO     apache_beam.utils.subprocess_server:subprocess_server.py:126 	beam:external:java:generate_sequence:v1: org.apache.beam.sdk.expansion.service.ExpansionService$ExternalTransformRegistrarLoader$1@3b69e7d1
INFO     apache_beam.utils.subprocess_server:subprocess_server.py:126 
INFO     apache_beam.utils.subprocess_server:subprocess_server.py:126 Registered SchemaTransformProviders:
INFO     apache_beam.utils.subprocess_server:subprocess_server.py:126 	beam:schematransform:org.apache.beam:kafka_read:v1
INFO     apache_beam.utils.subprocess_server:subprocess_server.py:126 	beam:schematransform:org.apache.beam:spanner_write:v1
INFO     apache_beam.utils.subprocess_server:subprocess_server.py:126 	beam:transform:org.apache.beam:bigquery_storage_read:v1
INFO     apache_beam.utils.subprocess_server:subprocess_server.py:126 Dec 07, 2022 11:35:24 PM org.apache.beam.sdk.expansion.service.ExpansionService expand
INFO     apache_beam.utils.subprocess_server:subprocess_server.py:126 INFO: Expanding 'SqlTransform(beam:external:java:sql:v1)' with URN 'beam:external:java:sql:v1'
INFO     apache_beam.utils.subprocess_server:subprocess_server.py:126 Dec 07, 2022 11:35:24 PM org.apache.beam.sdk.expansion.service.ExpansionService$ExternalTransformRegistrarLoader payloadToConfig
INFO     apache_beam.utils.subprocess_server:subprocess_server.py:126 WARNING: Configuration class 'org.apache.beam.sdk.extensions.sql.expansion.ExternalSqlTransformRegistrar$Configuration' has no schema registered. Attempting to construct with setter approach.
INFO     apache_beam.utils.subprocess_server:subprocess_server.py:126 Dec 07, 2022 11:35:24 PM org.apache.beam.sdk.expansion.service.ExpansionService$ExternalTransformRegistrarLoader payloadToConfig
INFO     apache_beam.utils.subprocess_server:subprocess_server.py:126 WARNING: Configuration class 'org.apache.beam.sdk.extensions.sql.expansion.ExternalSqlTransformRegistrar$Configuration' has no schema registered. Attempting to construct with setter approach.
INFO     apache_beam.utils.subprocess_server:subprocess_server.py:126 Dec 07, 2022 11:35:26 PM com.google.zetasql.io.grpc.NameResolverRegistry getDefaultRegistry
INFO     apache_beam.utils.subprocess_server:subprocess_server.py:126 WARNING: No NameResolverProviders found via ServiceLoader, including for DNS. This is probably due to a broken build. If using ProGuard, check your configuration
INFO     apache_beam.utils.subprocess_server:subprocess_server.py:126 Dec 07, 2022 11:35:27 PM org.apache.beam.sdk.extensions.sql.zetasql.ZetaSQLQueryPlanner convertToBeamRelInternal
INFO     apache_beam.utils.subprocess_server:subprocess_server.py:126 INFO: BEAMPlan>
INFO     apache_beam.utils.subprocess_server:subprocess_server.py:126 BeamZetaSqlCalcRel(expr#0=[{inputs}], expr#1=[1:BIGINT], expr#2=['foo':VARCHAR], expr#3=[3.1400000000000001243E0:DOUBLE], int=[$t1], str=[$t2], flt=[$t3])
INFO     apache_beam.utils.subprocess_server:subprocess_server.py:126   BeamValuesRel(tuples=[[{ 0 }]])
INFO     apache_beam.utils.subprocess_server:subprocess_server.py:126 
INFO     root:environments.py:376 Default Python SDK image for environment is apache/beam_python3.10_sdk:2.45.0.dev
INFO     root:environments.py:299 No image given, using default Python SDK image
INFO     root:environments.py:376 Default Python SDK image for environment is apache/beam_python3.10_sdk:2.45.0.dev
INFO     root:environments.py:302 Python SDK container image set to "apache/beam_python3.10_sdk:2.45.0.dev" for Docker environment
INFO     apache_beam.runners.portability.fn_api_runner.translations:translations.py:710 ==================== <function pack_combiners at 0x7fbbbad2e5f0> ====================
INFO     apache_beam.runners.portability.fn_api_runner.translations:translations.py:710 ==================== <function lift_combiners at 0x7fbbbad2e680> ====================
INFO     apache_beam.runners.portability.fn_api_runner.translations:translations.py:710 ==================== <function sort_stages at 0x7fbbbad2edd0> ====================
INFO     apache_beam.runners.portability.portable_runner:portable_runner.py:581 Job state changed to STOPPED
INFO     apache_beam.runners.portability.portable_runner:portable_runner.py:581 Job state changed to STARTING
INFO     apache_beam.runners.portability.portable_runner:portable_runner.py:581 Job state changed to RUNNING
INFO     apache_beam.runners.portability.portable_runner:portable_runner.py:581 Job state changed to DONE
PASSED                                                                   [100%]

=============================== warnings summary ===============================
../../build/gradleenv/1922375555/lib/python3.10/site-packages/hdfs/config.py:15
  <https://ci-beam.apache.org/job/beam_PostCommit_XVR_Flink/ws/src/build/gradleenv/1922375555/lib/python3.10/site-packages/hdfs/config.py>:15: DeprecationWarning: the imp module is deprecated in favour of importlib and slated for removal in Python 3.12; see the module's documentation for alternative uses
    from imp import load_source

../../build/gradleenv/1922375555/lib/python3.10/site-packages/google/api_core/operations_v1/abstract_operations_client.py:17
  <https://ci-beam.apache.org/job/beam_PostCommit_XVR_Flink/ws/src/build/gradleenv/1922375555/lib/python3.10/site-packages/google/api_core/operations_v1/abstract_operations_client.py>:17: DeprecationWarning: The distutils package is deprecated and slated for removal in Python 3.12. Use setuptools or check PEP 632 for potential alternatives
    from distutils import util

../../build/gradleenv/1922375555/lib/python3.10/site-packages/tenacity/_asyncio.py:42
  <https://ci-beam.apache.org/job/beam_PostCommit_XVR_Flink/ws/src/build/gradleenv/1922375555/lib/python3.10/site-packages/tenacity/_asyncio.py>:42: DeprecationWarning: "@coroutine" decorator is deprecated since Python 3.8, use "async def" instead
    def call(self, fn, *args, **kwargs):

apache_beam/typehints/pandas_type_compatibility_test.py:67
  <https://ci-beam.apache.org/job/beam_PostCommit_XVR_Flink/ws/src/sdks/python/apache_beam/typehints/pandas_type_compatibility_test.py>:67: FutureWarning: pandas.Int64Index is deprecated and will be removed from pandas in a future version. Use pandas.Index with the appropriate dtype instead.
    }).set_index(pd.Int64Index(range(123, 223), name='an_index')),

apache_beam/typehints/pandas_type_compatibility_test.py:90
  <https://ci-beam.apache.org/job/beam_PostCommit_XVR_Flink/ws/src/sdks/python/apache_beam/typehints/pandas_type_compatibility_test.py>:90: FutureWarning: pandas.Int64Index is deprecated and will be removed from pandas in a future version. Use pandas.Index with the appropriate dtype instead.
    pd.Int64Index(range(123, 223), name='an_index'),

apache_beam/typehints/pandas_type_compatibility_test.py:91
  <https://ci-beam.apache.org/job/beam_PostCommit_XVR_Flink/ws/src/sdks/python/apache_beam/typehints/pandas_type_compatibility_test.py>:91: FutureWarning: pandas.Int64Index is deprecated and will be removed from pandas in a future version. Use pandas.Index with the appropriate dtype instead.
    pd.Int64Index(range(475, 575), name='another_index'),

-- Docs: https://docs.pytest.org/en/stable/how-to/capture-warnings.html
- generated xml file: <https://ci-beam.apache.org/job/beam_PostCommit_XVR_Flink/ws/src/sdks/python/pytest_xlangSqlValidateRunner.xml> -
==== 9 passed, 5 skipped, 6774 deselected, 6 warnings in 219.46s (0:03:39) =====

> Task :runners:flink:1.15:job-server:flinkJobServerCleanup
Stopping job server pid: 2874120.

> Task :runners:flink:1.15:job-server:validatesCrossLanguageRunnerCleanup
Stopping expansion service pid: 2880018.
Stopping expansion service pid: 2880019.

FAILURE: Build failed with an exception.

* What went wrong:
Execution failed for task ':runners:flink:1.15:job-server:validatesCrossLanguageRunnerJavaUsingPython'.
> There were failing tests. See the report at: file://<https://ci-beam.apache.org/job/beam_PostCommit_XVR_Flink/ws/src/runners/flink/1.15/job-server/build/reports/tests/validatesCrossLanguageRunnerJavaUsingPython/index.html>

* Try:
> Run with --stacktrace option to get the stack trace.
> Run with --info or --debug option to get more log output.

* Get more help at https://help.gradle.org

Deprecated Gradle features were used in this build, making it incompatible with Gradle 8.0.

You can use '--warning-mode all' to show the individual deprecation warnings and determine if they come from your own scripts or plugins.

See https://docs.gradle.org/7.5.1/userguide/command_line_interface.html#sec:command_line_warnings

Execution optimizations have been disabled for 1 invalid unit(s) of work during this build to ensure correctness.
Please consult deprecation warnings for more details.

BUILD FAILED in 28m 2s
255 actionable tasks: 32 executed, 223 up-to-date

Publishing build scan...
https://gradle.com/s/ratd7omsz6c66

Build step 'Invoke Gradle script' changed build result to FAILURE
Build step 'Invoke Gradle script' marked build as failure

---------------------------------------------------------------------
To unsubscribe, e-mail: builds-unsubscribe@beam.apache.org
For additional commands, e-mail: builds-help@beam.apache.org


Build failed in Jenkins: beam_PostCommit_XVR_Flink #6224

Posted by Apache Jenkins Server <je...@builds.apache.org>.
See <https://ci-beam.apache.org/job/beam_PostCommit_XVR_Flink/6224/display/redirect?page=changes>

Changes:

[noreply] Migrate testing subpackages from interface{} to any (#24570)


------------------------------------------
[...truncated 2.60 MB...]
-------------------------------- live log call ---------------------------------
INFO     apache_beam.utils.subprocess_server:subprocess_server.py:239 Using pre-built snapshot at <https://ci-beam.apache.org/job/beam_PostCommit_XVR_Flink/ws/src/sdks/java/extensions/sql/expansion-service/build/libs/beam-sdks-java-extensions-sql-expansion-service-2.45.0-SNAPSHOT.jar>
INFO     root:external.py:847 Starting a JAR-based expansion service from JAR <https://ci-beam.apache.org/job/beam_PostCommit_XVR_Flink/ws/src/sdks/java/extensions/sql/expansion-service/build/libs/beam-sdks-java-extensions-sql-expansion-service-2.45.0-SNAPSHOT.jar> 
INFO     apache_beam.utils.subprocess_server:subprocess_server.py:116 Starting service with ['java' '-jar' '<https://ci-beam.apache.org/job/beam_PostCommit_XVR_Flink/ws/src/sdks/java/extensions/sql/expansion-service/build/libs/beam-sdks-java-extensions-sql-expansion-service-2.45.0-SNAPSHOT.jar'> '52849' '--filesToStage=<https://ci-beam.apache.org/job/beam_PostCommit_XVR_Flink/ws/src/sdks/java/extensions/sql/expansion-service/build/libs/beam-sdks-java-extensions-sql-expansion-service-2.45.0-SNAPSHOT.jar']>
INFO     apache_beam.utils.subprocess_server:subprocess_server.py:126 Starting expansion service at localhost:52849
INFO     apache_beam.utils.subprocess_server:subprocess_server.py:126 Dec 07, 2022 5:17:16 PM org.apache.beam.sdk.expansion.service.ExpansionService loadRegisteredTransforms
INFO     apache_beam.utils.subprocess_server:subprocess_server.py:126 INFO: Registering external transforms: [beam:external:java:sql:v1, beam:transform:org.apache.beam:pubsub_read:v1, beam:transform:org.apache.beam:pubsub_write:v1, beam:transform:org.apache.beam:pubsublite_write:v1, beam:transform:org.apache.beam:pubsublite_read:v1, beam:transform:org.apache.beam:spanner_insert:v1, beam:transform:org.apache.beam:spanner_update:v1, beam:transform:org.apache.beam:spanner_replace:v1, beam:transform:org.apache.beam:spanner_insert_or_update:v1, beam:transform:org.apache.beam:spanner_delete:v1, beam:transform:org.apache.beam:spanner_read:v1, beam:transform:org.apache.beam:kafka_read_with_metadata:v1, beam:transform:org.apache.beam:kafka_read_without_metadata:v1, beam:transform:org.apache.beam:kafka_write:v1, beam:external:java:generate_sequence:v1]
INFO     apache_beam.utils.subprocess_server:subprocess_server.py:126 
INFO     apache_beam.utils.subprocess_server:subprocess_server.py:126 Registered transforms:
INFO     apache_beam.utils.subprocess_server:subprocess_server.py:126 	beam:external:java:sql:v1: org.apache.beam.sdk.expansion.service.ExpansionService$ExternalTransformRegistrarLoader$1@38425407
INFO     apache_beam.utils.subprocess_server:subprocess_server.py:126 	beam:transform:org.apache.beam:pubsub_read:v1: org.apache.beam.sdk.expansion.service.ExpansionService$ExternalTransformRegistrarLoader$1@43bc63a3
INFO     apache_beam.utils.subprocess_server:subprocess_server.py:126 	beam:transform:org.apache.beam:pubsub_write:v1: org.apache.beam.sdk.expansion.service.ExpansionService$ExternalTransformRegistrarLoader$1@702657cc
INFO     apache_beam.utils.subprocess_server:subprocess_server.py:126 	beam:transform:org.apache.beam:pubsublite_write:v1: org.apache.beam.sdk.expansion.service.ExpansionService$ExternalTransformRegistrarLoader$1@6a6cb05c
INFO     apache_beam.utils.subprocess_server:subprocess_server.py:126 	beam:transform:org.apache.beam:pubsublite_read:v1: org.apache.beam.sdk.expansion.service.ExpansionService$ExternalTransformRegistrarLoader$1@40a4337a
INFO     apache_beam.utils.subprocess_server:subprocess_server.py:126 	beam:transform:org.apache.beam:spanner_insert:v1: org.apache.beam.sdk.expansion.service.ExpansionService$ExternalTransformRegistrarLoader$1@6025e1b6
INFO     apache_beam.utils.subprocess_server:subprocess_server.py:126 	beam:transform:org.apache.beam:spanner_update:v1: org.apache.beam.sdk.expansion.service.ExpansionService$ExternalTransformRegistrarLoader$1@22ff4249
INFO     apache_beam.utils.subprocess_server:subprocess_server.py:126 	beam:transform:org.apache.beam:spanner_replace:v1: org.apache.beam.sdk.expansion.service.ExpansionService$ExternalTransformRegistrarLoader$1@2d1ef81a
INFO     apache_beam.utils.subprocess_server:subprocess_server.py:126 	beam:transform:org.apache.beam:spanner_insert_or_update:v1: org.apache.beam.sdk.expansion.service.ExpansionService$ExternalTransformRegistrarLoader$1@4c402120
INFO     apache_beam.utils.subprocess_server:subprocess_server.py:126 	beam:transform:org.apache.beam:spanner_delete:v1: org.apache.beam.sdk.expansion.service.ExpansionService$ExternalTransformRegistrarLoader$1@327514f
INFO     apache_beam.utils.subprocess_server:subprocess_server.py:126 	beam:transform:org.apache.beam:spanner_read:v1: org.apache.beam.sdk.expansion.service.ExpansionService$ExternalTransformRegistrarLoader$1@5b12b668
INFO     apache_beam.utils.subprocess_server:subprocess_server.py:126 	beam:transform:org.apache.beam:kafka_read_with_metadata:v1: org.apache.beam.sdk.expansion.service.ExpansionService$ExternalTransformRegistrarLoader$1@1165b38
INFO     apache_beam.utils.subprocess_server:subprocess_server.py:126 	beam:transform:org.apache.beam:kafka_read_without_metadata:v1: org.apache.beam.sdk.expansion.service.ExpansionService$ExternalTransformRegistrarLoader$1@4c12331b
INFO     apache_beam.utils.subprocess_server:subprocess_server.py:126 	beam:transform:org.apache.beam:kafka_write:v1: org.apache.beam.sdk.expansion.service.ExpansionService$ExternalTransformRegistrarLoader$1@7586beff
INFO     apache_beam.utils.subprocess_server:subprocess_server.py:126 	beam:external:java:generate_sequence:v1: org.apache.beam.sdk.expansion.service.ExpansionService$ExternalTransformRegistrarLoader$1@3b69e7d1
INFO     apache_beam.utils.subprocess_server:subprocess_server.py:126 
INFO     apache_beam.utils.subprocess_server:subprocess_server.py:126 Registered SchemaTransformProviders:
INFO     apache_beam.utils.subprocess_server:subprocess_server.py:126 	beam:schematransform:org.apache.beam:kafka_read:v1
INFO     apache_beam.utils.subprocess_server:subprocess_server.py:126 	beam:schematransform:org.apache.beam:spanner_write:v1
INFO     apache_beam.utils.subprocess_server:subprocess_server.py:126 	beam:transform:org.apache.beam:bigquery_storage_read:v1
INFO     apache_beam.utils.subprocess_server:subprocess_server.py:126 Dec 07, 2022 5:17:17 PM org.apache.beam.sdk.expansion.service.ExpansionService expand
INFO     apache_beam.utils.subprocess_server:subprocess_server.py:126 INFO: Expanding 'SqlTransform(beam:external:java:sql:v1)' with URN 'beam:external:java:sql:v1'
INFO     apache_beam.utils.subprocess_server:subprocess_server.py:126 Dec 07, 2022 5:17:17 PM org.apache.beam.sdk.expansion.service.ExpansionService$ExternalTransformRegistrarLoader payloadToConfig
INFO     apache_beam.utils.subprocess_server:subprocess_server.py:126 WARNING: Configuration class 'org.apache.beam.sdk.extensions.sql.expansion.ExternalSqlTransformRegistrar$Configuration' has no schema registered. Attempting to construct with setter approach.
INFO     apache_beam.utils.subprocess_server:subprocess_server.py:126 Dec 07, 2022 5:17:17 PM org.apache.beam.sdk.expansion.service.ExpansionService$ExternalTransformRegistrarLoader payloadToConfig
INFO     apache_beam.utils.subprocess_server:subprocess_server.py:126 WARNING: Configuration class 'org.apache.beam.sdk.extensions.sql.expansion.ExternalSqlTransformRegistrar$Configuration' has no schema registered. Attempting to construct with setter approach.
INFO     apache_beam.utils.subprocess_server:subprocess_server.py:126 Dec 07, 2022 5:17:19 PM org.apache.beam.sdk.extensions.sql.impl.CalciteQueryPlanner convertToBeamRel
INFO     apache_beam.utils.subprocess_server:subprocess_server.py:126 INFO: SQL:
INFO     apache_beam.utils.subprocess_server:subprocess_server.py:126 SELECT `simple`.`id` AS `id`, `enrich`.`metadata` AS `metadata`
INFO     apache_beam.utils.subprocess_server:subprocess_server.py:126 FROM `beam`.`simple` AS `simple`
INFO     apache_beam.utils.subprocess_server:subprocess_server.py:126 INNER JOIN `beam`.`enrich` AS `enrich` ON `simple`.`id` = `enrich`.`id`
INFO     apache_beam.utils.subprocess_server:subprocess_server.py:126 Dec 07, 2022 5:17:19 PM org.apache.beam.sdk.extensions.sql.impl.CalciteQueryPlanner convertToBeamRel
INFO     apache_beam.utils.subprocess_server:subprocess_server.py:126 INFO: SQLPlan>
INFO     apache_beam.utils.subprocess_server:subprocess_server.py:126 LogicalProject(id=[$0], metadata=[$4])
INFO     apache_beam.utils.subprocess_server:subprocess_server.py:126   LogicalJoin(condition=[=($0, $3)], joinType=[inner])
INFO     apache_beam.utils.subprocess_server:subprocess_server.py:126     BeamIOSourceRel(table=[[beam, simple]])
INFO     apache_beam.utils.subprocess_server:subprocess_server.py:126     BeamIOSourceRel(table=[[beam, enrich]])
INFO     apache_beam.utils.subprocess_server:subprocess_server.py:126 
INFO     apache_beam.utils.subprocess_server:subprocess_server.py:126 Dec 07, 2022 5:17:20 PM org.apache.beam.sdk.extensions.sql.impl.CalciteQueryPlanner convertToBeamRel
INFO     apache_beam.utils.subprocess_server:subprocess_server.py:126 INFO: BEAMPlan>
INFO     apache_beam.utils.subprocess_server:subprocess_server.py:126 BeamCalcRel(expr#0..4=[{inputs}], id=[$t0], metadata=[$t4])
INFO     apache_beam.utils.subprocess_server:subprocess_server.py:126   BeamCoGBKJoinRel(condition=[=($0, $3)], joinType=[inner])
INFO     apache_beam.utils.subprocess_server:subprocess_server.py:126     BeamIOSourceRel(table=[[beam, simple]])
INFO     apache_beam.utils.subprocess_server:subprocess_server.py:126     BeamIOSourceRel(table=[[beam, enrich]])
INFO     apache_beam.utils.subprocess_server:subprocess_server.py:126 
INFO     root:environments.py:376 Default Python SDK image for environment is apache/beam_python3.10_sdk:2.45.0.dev
INFO     root:environments.py:299 No image given, using default Python SDK image
INFO     root:environments.py:376 Default Python SDK image for environment is apache/beam_python3.10_sdk:2.45.0.dev
INFO     root:environments.py:302 Python SDK container image set to "apache/beam_python3.10_sdk:2.45.0.dev" for Docker environment
INFO     apache_beam.runners.portability.fn_api_runner.translations:translations.py:710 ==================== <function pack_combiners at 0x7fe5181365f0> ====================
INFO     apache_beam.runners.portability.fn_api_runner.translations:translations.py:710 ==================== <function lift_combiners at 0x7fe518136680> ====================
INFO     apache_beam.runners.portability.fn_api_runner.translations:translations.py:710 ==================== <function sort_stages at 0x7fe518136dd0> ====================
INFO     apache_beam.runners.portability.portable_runner:portable_runner.py:581 Job state changed to STOPPED
INFO     apache_beam.runners.portability.portable_runner:portable_runner.py:581 Job state changed to STARTING
INFO     apache_beam.runners.portability.portable_runner:portable_runner.py:581 Job state changed to RUNNING
INFO     apache_beam.runners.portability.portable_runner:portable_runner.py:581 Job state changed to DONE
PASSED                                                                   [ 77%]
apache_beam/transforms/sql_test.py::SqlTransformTest::test_windowing_before_sql 
-------------------------------- live log call ---------------------------------
INFO     apache_beam.utils.subprocess_server:subprocess_server.py:239 Using pre-built snapshot at <https://ci-beam.apache.org/job/beam_PostCommit_XVR_Flink/ws/src/sdks/java/extensions/sql/expansion-service/build/libs/beam-sdks-java-extensions-sql-expansion-service-2.45.0-SNAPSHOT.jar>
INFO     root:external.py:847 Starting a JAR-based expansion service from JAR <https://ci-beam.apache.org/job/beam_PostCommit_XVR_Flink/ws/src/sdks/java/extensions/sql/expansion-service/build/libs/beam-sdks-java-extensions-sql-expansion-service-2.45.0-SNAPSHOT.jar> 
INFO     apache_beam.utils.subprocess_server:subprocess_server.py:116 Starting service with ['java' '-jar' '<https://ci-beam.apache.org/job/beam_PostCommit_XVR_Flink/ws/src/sdks/java/extensions/sql/expansion-service/build/libs/beam-sdks-java-extensions-sql-expansion-service-2.45.0-SNAPSHOT.jar'> '46099' '--filesToStage=<https://ci-beam.apache.org/job/beam_PostCommit_XVR_Flink/ws/src/sdks/java/extensions/sql/expansion-service/build/libs/beam-sdks-java-extensions-sql-expansion-service-2.45.0-SNAPSHOT.jar']>
INFO     apache_beam.utils.subprocess_server:subprocess_server.py:126 Starting expansion service at localhost:46099
INFO     apache_beam.utils.subprocess_server:subprocess_server.py:126 Dec 07, 2022 5:17:40 PM org.apache.beam.sdk.expansion.service.ExpansionService loadRegisteredTransforms
INFO     apache_beam.utils.subprocess_server:subprocess_server.py:126 INFO: Registering external transforms: [beam:external:java:sql:v1, beam:transform:org.apache.beam:pubsub_read:v1, beam:transform:org.apache.beam:pubsub_write:v1, beam:transform:org.apache.beam:pubsublite_write:v1, beam:transform:org.apache.beam:pubsublite_read:v1, beam:transform:org.apache.beam:spanner_insert:v1, beam:transform:org.apache.beam:spanner_update:v1, beam:transform:org.apache.beam:spanner_replace:v1, beam:transform:org.apache.beam:spanner_insert_or_update:v1, beam:transform:org.apache.beam:spanner_delete:v1, beam:transform:org.apache.beam:spanner_read:v1, beam:transform:org.apache.beam:kafka_read_with_metadata:v1, beam:transform:org.apache.beam:kafka_read_without_metadata:v1, beam:transform:org.apache.beam:kafka_write:v1, beam:external:java:generate_sequence:v1]
INFO     apache_beam.utils.subprocess_server:subprocess_server.py:126 
INFO     apache_beam.utils.subprocess_server:subprocess_server.py:126 Registered transforms:
INFO     apache_beam.utils.subprocess_server:subprocess_server.py:126 	beam:external:java:sql:v1: org.apache.beam.sdk.expansion.service.ExpansionService$ExternalTransformRegistrarLoader$1@38425407
INFO     apache_beam.utils.subprocess_server:subprocess_server.py:126 	beam:transform:org.apache.beam:pubsub_read:v1: org.apache.beam.sdk.expansion.service.ExpansionService$ExternalTransformRegistrarLoader$1@43bc63a3
INFO     apache_beam.utils.subprocess_server:subprocess_server.py:126 	beam:transform:org.apache.beam:pubsub_write:v1: org.apache.beam.sdk.expansion.service.ExpansionService$ExternalTransformRegistrarLoader$1@702657cc
INFO     apache_beam.utils.subprocess_server:subprocess_server.py:126 	beam:transform:org.apache.beam:pubsublite_write:v1: org.apache.beam.sdk.expansion.service.ExpansionService$ExternalTransformRegistrarLoader$1@6a6cb05c
INFO     apache_beam.utils.subprocess_server:subprocess_server.py:126 	beam:transform:org.apache.beam:pubsublite_read:v1: org.apache.beam.sdk.expansion.service.ExpansionService$ExternalTransformRegistrarLoader$1@40a4337a
INFO     apache_beam.utils.subprocess_server:subprocess_server.py:126 	beam:transform:org.apache.beam:spanner_insert:v1: org.apache.beam.sdk.expansion.service.ExpansionService$ExternalTransformRegistrarLoader$1@6025e1b6
INFO     apache_beam.utils.subprocess_server:subprocess_server.py:126 	beam:transform:org.apache.beam:spanner_update:v1: org.apache.beam.sdk.expansion.service.ExpansionService$ExternalTransformRegistrarLoader$1@22ff4249
INFO     apache_beam.utils.subprocess_server:subprocess_server.py:126 	beam:transform:org.apache.beam:spanner_replace:v1: org.apache.beam.sdk.expansion.service.ExpansionService$ExternalTransformRegistrarLoader$1@2d1ef81a
INFO     apache_beam.utils.subprocess_server:subprocess_server.py:126 	beam:transform:org.apache.beam:spanner_insert_or_update:v1: org.apache.beam.sdk.expansion.service.ExpansionService$ExternalTransformRegistrarLoader$1@4c402120
INFO     apache_beam.utils.subprocess_server:subprocess_server.py:126 	beam:transform:org.apache.beam:spanner_delete:v1: org.apache.beam.sdk.expansion.service.ExpansionService$ExternalTransformRegistrarLoader$1@327514f
INFO     apache_beam.utils.subprocess_server:subprocess_server.py:126 	beam:transform:org.apache.beam:spanner_read:v1: org.apache.beam.sdk.expansion.service.ExpansionService$ExternalTransformRegistrarLoader$1@5b12b668
INFO     apache_beam.utils.subprocess_server:subprocess_server.py:126 	beam:transform:org.apache.beam:kafka_read_with_metadata:v1: org.apache.beam.sdk.expansion.service.ExpansionService$ExternalTransformRegistrarLoader$1@1165b38
INFO     apache_beam.utils.subprocess_server:subprocess_server.py:126 	beam:transform:org.apache.beam:kafka_read_without_metadata:v1: org.apache.beam.sdk.expansion.service.ExpansionService$ExternalTransformRegistrarLoader$1@4c12331b
INFO     apache_beam.utils.subprocess_server:subprocess_server.py:126 	beam:transform:org.apache.beam:kafka_write:v1: org.apache.beam.sdk.expansion.service.ExpansionService$ExternalTransformRegistrarLoader$1@7586beff
INFO     apache_beam.utils.subprocess_server:subprocess_server.py:126 	beam:external:java:generate_sequence:v1: org.apache.beam.sdk.expansion.service.ExpansionService$ExternalTransformRegistrarLoader$1@3b69e7d1
INFO     apache_beam.utils.subprocess_server:subprocess_server.py:126 
INFO     apache_beam.utils.subprocess_server:subprocess_server.py:126 Registered SchemaTransformProviders:
INFO     apache_beam.utils.subprocess_server:subprocess_server.py:126 	beam:schematransform:org.apache.beam:kafka_read:v1
INFO     apache_beam.utils.subprocess_server:subprocess_server.py:126 	beam:schematransform:org.apache.beam:spanner_write:v1
INFO     apache_beam.utils.subprocess_server:subprocess_server.py:126 	beam:transform:org.apache.beam:bigquery_storage_read:v1
INFO     apache_beam.utils.subprocess_server:subprocess_server.py:126 Dec 07, 2022 5:17:42 PM org.apache.beam.sdk.expansion.service.ExpansionService expand
INFO     apache_beam.utils.subprocess_server:subprocess_server.py:126 INFO: Expanding 'SqlTransform(beam:external:java:sql:v1)' with URN 'beam:external:java:sql:v1'
INFO     apache_beam.utils.subprocess_server:subprocess_server.py:126 Dec 07, 2022 5:17:42 PM org.apache.beam.sdk.expansion.service.ExpansionService$ExternalTransformRegistrarLoader payloadToConfig
INFO     apache_beam.utils.subprocess_server:subprocess_server.py:126 WARNING: Configuration class 'org.apache.beam.sdk.extensions.sql.expansion.ExternalSqlTransformRegistrar$Configuration' has no schema registered. Attempting to construct with setter approach.
INFO     apache_beam.utils.subprocess_server:subprocess_server.py:126 Dec 07, 2022 5:17:42 PM org.apache.beam.sdk.expansion.service.ExpansionService$ExternalTransformRegistrarLoader payloadToConfig
INFO     apache_beam.utils.subprocess_server:subprocess_server.py:126 WARNING: Configuration class 'org.apache.beam.sdk.extensions.sql.expansion.ExternalSqlTransformRegistrar$Configuration' has no schema registered. Attempting to construct with setter approach.
INFO     apache_beam.utils.subprocess_server:subprocess_server.py:126 Dec 07, 2022 5:17:44 PM org.apache.beam.sdk.extensions.sql.impl.CalciteQueryPlanner convertToBeamRel
INFO     apache_beam.utils.subprocess_server:subprocess_server.py:126 INFO: SQL:
INFO     apache_beam.utils.subprocess_server:subprocess_server.py:126 SELECT COUNT(*) AS `count`
INFO     apache_beam.utils.subprocess_server:subprocess_server.py:126 FROM `beam`.`PCOLLECTION` AS `PCOLLECTION`
INFO     apache_beam.utils.subprocess_server:subprocess_server.py:126 Dec 07, 2022 5:17:44 PM org.apache.beam.sdk.extensions.sql.impl.CalciteQueryPlanner convertToBeamRel
INFO     apache_beam.utils.subprocess_server:subprocess_server.py:126 INFO: SQLPlan>
INFO     apache_beam.utils.subprocess_server:subprocess_server.py:126 LogicalAggregate(group=[{}], count=[COUNT()])
INFO     apache_beam.utils.subprocess_server:subprocess_server.py:126   BeamIOSourceRel(table=[[beam, PCOLLECTION]])
INFO     apache_beam.utils.subprocess_server:subprocess_server.py:126 
INFO     apache_beam.utils.subprocess_server:subprocess_server.py:126 Dec 07, 2022 5:17:45 PM org.apache.beam.sdk.extensions.sql.impl.CalciteQueryPlanner convertToBeamRel
INFO     apache_beam.utils.subprocess_server:subprocess_server.py:126 INFO: BEAMPlan>
INFO     apache_beam.utils.subprocess_server:subprocess_server.py:126 BeamAggregationRel(group=[{}], count=[COUNT()])
INFO     apache_beam.utils.subprocess_server:subprocess_server.py:126   BeamIOSourceRel(table=[[beam, PCOLLECTION]])
INFO     apache_beam.utils.subprocess_server:subprocess_server.py:126 
INFO     root:environments.py:376 Default Python SDK image for environment is apache/beam_python3.10_sdk:2.45.0.dev
INFO     root:environments.py:299 No image given, using default Python SDK image
INFO     root:environments.py:376 Default Python SDK image for environment is apache/beam_python3.10_sdk:2.45.0.dev
INFO     root:environments.py:302 Python SDK container image set to "apache/beam_python3.10_sdk:2.45.0.dev" for Docker environment
INFO     apache_beam.runners.portability.fn_api_runner.translations:translations.py:710 ==================== <function pack_combiners at 0x7fe5181365f0> ====================
INFO     apache_beam.runners.portability.fn_api_runner.translations:translations.py:710 ==================== <function lift_combiners at 0x7fe518136680> ====================
INFO     apache_beam.runners.portability.fn_api_runner.translations:translations.py:710 ==================== <function sort_stages at 0x7fe518136dd0> ====================
INFO     apache_beam.runners.portability.portable_runner:portable_runner.py:581 Job state changed to STOPPED
INFO     apache_beam.runners.portability.portable_runner:portable_runner.py:581 Job state changed to STARTING
INFO     apache_beam.runners.portability.portable_runner:portable_runner.py:581 Job state changed to RUNNING
INFO     apache_beam.runners.portability.portable_runner:portable_runner.py:581 Job state changed to DONE
PASSED                                                                   [ 88%]
apache_beam/transforms/sql_test.py::SqlTransformTest::test_zetasql_generate_data 
-------------------------------- live log call ---------------------------------
INFO     apache_beam.utils.subprocess_server:subprocess_server.py:239 Using pre-built snapshot at <https://ci-beam.apache.org/job/beam_PostCommit_XVR_Flink/ws/src/sdks/java/extensions/sql/expansion-service/build/libs/beam-sdks-java-extensions-sql-expansion-service-2.45.0-SNAPSHOT.jar>
INFO     root:external.py:847 Starting a JAR-based expansion service from JAR <https://ci-beam.apache.org/job/beam_PostCommit_XVR_Flink/ws/src/sdks/java/extensions/sql/expansion-service/build/libs/beam-sdks-java-extensions-sql-expansion-service-2.45.0-SNAPSHOT.jar> 
INFO     apache_beam.utils.subprocess_server:subprocess_server.py:116 Starting service with ['java' '-jar' '<https://ci-beam.apache.org/job/beam_PostCommit_XVR_Flink/ws/src/sdks/java/extensions/sql/expansion-service/build/libs/beam-sdks-java-extensions-sql-expansion-service-2.45.0-SNAPSHOT.jar'> '40675' '--filesToStage=<https://ci-beam.apache.org/job/beam_PostCommit_XVR_Flink/ws/src/sdks/java/extensions/sql/expansion-service/build/libs/beam-sdks-java-extensions-sql-expansion-service-2.45.0-SNAPSHOT.jar']>
INFO     apache_beam.utils.subprocess_server:subprocess_server.py:126 Starting expansion service at localhost:40675
INFO     apache_beam.utils.subprocess_server:subprocess_server.py:126 Dec 07, 2022 5:18:04 PM org.apache.beam.sdk.expansion.service.ExpansionService loadRegisteredTransforms
INFO     apache_beam.utils.subprocess_server:subprocess_server.py:126 INFO: Registering external transforms: [beam:external:java:sql:v1, beam:transform:org.apache.beam:pubsub_read:v1, beam:transform:org.apache.beam:pubsub_write:v1, beam:transform:org.apache.beam:pubsublite_write:v1, beam:transform:org.apache.beam:pubsublite_read:v1, beam:transform:org.apache.beam:spanner_insert:v1, beam:transform:org.apache.beam:spanner_update:v1, beam:transform:org.apache.beam:spanner_replace:v1, beam:transform:org.apache.beam:spanner_insert_or_update:v1, beam:transform:org.apache.beam:spanner_delete:v1, beam:transform:org.apache.beam:spanner_read:v1, beam:transform:org.apache.beam:kafka_read_with_metadata:v1, beam:transform:org.apache.beam:kafka_read_without_metadata:v1, beam:transform:org.apache.beam:kafka_write:v1, beam:external:java:generate_sequence:v1]
INFO     apache_beam.utils.subprocess_server:subprocess_server.py:126 
INFO     apache_beam.utils.subprocess_server:subprocess_server.py:126 Registered transforms:
INFO     apache_beam.utils.subprocess_server:subprocess_server.py:126 	beam:external:java:sql:v1: org.apache.beam.sdk.expansion.service.ExpansionService$ExternalTransformRegistrarLoader$1@38425407
INFO     apache_beam.utils.subprocess_server:subprocess_server.py:126 	beam:transform:org.apache.beam:pubsub_read:v1: org.apache.beam.sdk.expansion.service.ExpansionService$ExternalTransformRegistrarLoader$1@43bc63a3
INFO     apache_beam.utils.subprocess_server:subprocess_server.py:126 	beam:transform:org.apache.beam:pubsub_write:v1: org.apache.beam.sdk.expansion.service.ExpansionService$ExternalTransformRegistrarLoader$1@702657cc
INFO     apache_beam.utils.subprocess_server:subprocess_server.py:126 	beam:transform:org.apache.beam:pubsublite_write:v1: org.apache.beam.sdk.expansion.service.ExpansionService$ExternalTransformRegistrarLoader$1@6a6cb05c
INFO     apache_beam.utils.subprocess_server:subprocess_server.py:126 	beam:transform:org.apache.beam:pubsublite_read:v1: org.apache.beam.sdk.expansion.service.ExpansionService$ExternalTransformRegistrarLoader$1@40a4337a
INFO     apache_beam.utils.subprocess_server:subprocess_server.py:126 	beam:transform:org.apache.beam:spanner_insert:v1: org.apache.beam.sdk.expansion.service.ExpansionService$ExternalTransformRegistrarLoader$1@6025e1b6
INFO     apache_beam.utils.subprocess_server:subprocess_server.py:126 	beam:transform:org.apache.beam:spanner_update:v1: org.apache.beam.sdk.expansion.service.ExpansionService$ExternalTransformRegistrarLoader$1@22ff4249
INFO     apache_beam.utils.subprocess_server:subprocess_server.py:126 	beam:transform:org.apache.beam:spanner_replace:v1: org.apache.beam.sdk.expansion.service.ExpansionService$ExternalTransformRegistrarLoader$1@2d1ef81a
INFO     apache_beam.utils.subprocess_server:subprocess_server.py:126 	beam:transform:org.apache.beam:spanner_insert_or_update:v1: org.apache.beam.sdk.expansion.service.ExpansionService$ExternalTransformRegistrarLoader$1@4c402120
INFO     apache_beam.utils.subprocess_server:subprocess_server.py:126 	beam:transform:org.apache.beam:spanner_delete:v1: org.apache.beam.sdk.expansion.service.ExpansionService$ExternalTransformRegistrarLoader$1@327514f
INFO     apache_beam.utils.subprocess_server:subprocess_server.py:126 	beam:transform:org.apache.beam:spanner_read:v1: org.apache.beam.sdk.expansion.service.ExpansionService$ExternalTransformRegistrarLoader$1@5b12b668
INFO     apache_beam.utils.subprocess_server:subprocess_server.py:126 	beam:transform:org.apache.beam:kafka_read_with_metadata:v1: org.apache.beam.sdk.expansion.service.ExpansionService$ExternalTransformRegistrarLoader$1@1165b38
INFO     apache_beam.utils.subprocess_server:subprocess_server.py:126 	beam:transform:org.apache.beam:kafka_read_without_metadata:v1: org.apache.beam.sdk.expansion.service.ExpansionService$ExternalTransformRegistrarLoader$1@4c12331b
INFO     apache_beam.utils.subprocess_server:subprocess_server.py:126 	beam:transform:org.apache.beam:kafka_write:v1: org.apache.beam.sdk.expansion.service.ExpansionService$ExternalTransformRegistrarLoader$1@7586beff
INFO     apache_beam.utils.subprocess_server:subprocess_server.py:126 	beam:external:java:generate_sequence:v1: org.apache.beam.sdk.expansion.service.ExpansionService$ExternalTransformRegistrarLoader$1@3b69e7d1
INFO     apache_beam.utils.subprocess_server:subprocess_server.py:126 
INFO     apache_beam.utils.subprocess_server:subprocess_server.py:126 Registered SchemaTransformProviders:
INFO     apache_beam.utils.subprocess_server:subprocess_server.py:126 	beam:schematransform:org.apache.beam:kafka_read:v1
INFO     apache_beam.utils.subprocess_server:subprocess_server.py:126 	beam:schematransform:org.apache.beam:spanner_write:v1
INFO     apache_beam.utils.subprocess_server:subprocess_server.py:126 	beam:transform:org.apache.beam:bigquery_storage_read:v1
INFO     apache_beam.utils.subprocess_server:subprocess_server.py:126 Dec 07, 2022 5:18:05 PM org.apache.beam.sdk.expansion.service.ExpansionService expand
INFO     apache_beam.utils.subprocess_server:subprocess_server.py:126 INFO: Expanding 'SqlTransform(beam:external:java:sql:v1)' with URN 'beam:external:java:sql:v1'
INFO     apache_beam.utils.subprocess_server:subprocess_server.py:126 Dec 07, 2022 5:18:05 PM org.apache.beam.sdk.expansion.service.ExpansionService$ExternalTransformRegistrarLoader payloadToConfig
INFO     apache_beam.utils.subprocess_server:subprocess_server.py:126 WARNING: Configuration class 'org.apache.beam.sdk.extensions.sql.expansion.ExternalSqlTransformRegistrar$Configuration' has no schema registered. Attempting to construct with setter approach.
INFO     apache_beam.utils.subprocess_server:subprocess_server.py:126 Dec 07, 2022 5:18:06 PM org.apache.beam.sdk.expansion.service.ExpansionService$ExternalTransformRegistrarLoader payloadToConfig
INFO     apache_beam.utils.subprocess_server:subprocess_server.py:126 WARNING: Configuration class 'org.apache.beam.sdk.extensions.sql.expansion.ExternalSqlTransformRegistrar$Configuration' has no schema registered. Attempting to construct with setter approach.
INFO     apache_beam.utils.subprocess_server:subprocess_server.py:126 Dec 07, 2022 5:18:08 PM com.google.zetasql.io.grpc.NameResolverRegistry getDefaultRegistry
INFO     apache_beam.utils.subprocess_server:subprocess_server.py:126 WARNING: No NameResolverProviders found via ServiceLoader, including for DNS. This is probably due to a broken build. If using ProGuard, check your configuration
INFO     apache_beam.utils.subprocess_server:subprocess_server.py:126 Dec 07, 2022 5:18:10 PM org.apache.beam.sdk.extensions.sql.zetasql.ZetaSQLQueryPlanner convertToBeamRelInternal
INFO     apache_beam.utils.subprocess_server:subprocess_server.py:126 INFO: BEAMPlan>
INFO     apache_beam.utils.subprocess_server:subprocess_server.py:126 BeamZetaSqlCalcRel(expr#0=[{inputs}], expr#1=[1:BIGINT], expr#2=['foo':VARCHAR], expr#3=[3.1400000000000001243E0:DOUBLE], int=[$t1], str=[$t2], flt=[$t3])
INFO     apache_beam.utils.subprocess_server:subprocess_server.py:126   BeamValuesRel(tuples=[[{ 0 }]])
INFO     apache_beam.utils.subprocess_server:subprocess_server.py:126 
INFO     root:environments.py:376 Default Python SDK image for environment is apache/beam_python3.10_sdk:2.45.0.dev
INFO     root:environments.py:299 No image given, using default Python SDK image
INFO     root:environments.py:376 Default Python SDK image for environment is apache/beam_python3.10_sdk:2.45.0.dev
INFO     root:environments.py:302 Python SDK container image set to "apache/beam_python3.10_sdk:2.45.0.dev" for Docker environment
INFO     apache_beam.runners.portability.fn_api_runner.translations:translations.py:710 ==================== <function pack_combiners at 0x7fe5181365f0> ====================
INFO     apache_beam.runners.portability.fn_api_runner.translations:translations.py:710 ==================== <function lift_combiners at 0x7fe518136680> ====================
INFO     apache_beam.runners.portability.fn_api_runner.translations:translations.py:710 ==================== <function sort_stages at 0x7fe518136dd0> ====================
INFO     apache_beam.runners.portability.portable_runner:portable_runner.py:581 Job state changed to STOPPED
INFO     apache_beam.runners.portability.portable_runner:portable_runner.py:581 Job state changed to STARTING
INFO     apache_beam.runners.portability.portable_runner:portable_runner.py:581 Job state changed to RUNNING
INFO     apache_beam.runners.portability.portable_runner:portable_runner.py:581 Job state changed to DONE
PASSED                                                                   [100%]

=============================== warnings summary ===============================
../../build/gradleenv/1922375555/lib/python3.10/site-packages/hdfs/config.py:15
  <https://ci-beam.apache.org/job/beam_PostCommit_XVR_Flink/ws/src/build/gradleenv/1922375555/lib/python3.10/site-packages/hdfs/config.py>:15: DeprecationWarning: the imp module is deprecated in favour of importlib and slated for removal in Python 3.12; see the module's documentation for alternative uses
    from imp import load_source

../../build/gradleenv/1922375555/lib/python3.10/site-packages/google/api_core/operations_v1/abstract_operations_client.py:17
  <https://ci-beam.apache.org/job/beam_PostCommit_XVR_Flink/ws/src/build/gradleenv/1922375555/lib/python3.10/site-packages/google/api_core/operations_v1/abstract_operations_client.py>:17: DeprecationWarning: The distutils package is deprecated and slated for removal in Python 3.12. Use setuptools or check PEP 632 for potential alternatives
    from distutils import util

../../build/gradleenv/1922375555/lib/python3.10/site-packages/tenacity/_asyncio.py:42
  <https://ci-beam.apache.org/job/beam_PostCommit_XVR_Flink/ws/src/build/gradleenv/1922375555/lib/python3.10/site-packages/tenacity/_asyncio.py>:42: DeprecationWarning: "@coroutine" decorator is deprecated since Python 3.8, use "async def" instead
    def call(self, fn, *args, **kwargs):

apache_beam/typehints/pandas_type_compatibility_test.py:67
  <https://ci-beam.apache.org/job/beam_PostCommit_XVR_Flink/ws/src/sdks/python/apache_beam/typehints/pandas_type_compatibility_test.py>:67: FutureWarning: pandas.Int64Index is deprecated and will be removed from pandas in a future version. Use pandas.Index with the appropriate dtype instead.
    }).set_index(pd.Int64Index(range(123, 223), name='an_index')),

apache_beam/typehints/pandas_type_compatibility_test.py:90
  <https://ci-beam.apache.org/job/beam_PostCommit_XVR_Flink/ws/src/sdks/python/apache_beam/typehints/pandas_type_compatibility_test.py>:90: FutureWarning: pandas.Int64Index is deprecated and will be removed from pandas in a future version. Use pandas.Index with the appropriate dtype instead.
    pd.Int64Index(range(123, 223), name='an_index'),

apache_beam/typehints/pandas_type_compatibility_test.py:91
  <https://ci-beam.apache.org/job/beam_PostCommit_XVR_Flink/ws/src/sdks/python/apache_beam/typehints/pandas_type_compatibility_test.py>:91: FutureWarning: pandas.Int64Index is deprecated and will be removed from pandas in a future version. Use pandas.Index with the appropriate dtype instead.
    pd.Int64Index(range(475, 575), name='another_index'),

-- Docs: https://docs.pytest.org/en/stable/how-to/capture-warnings.html
- generated xml file: <https://ci-beam.apache.org/job/beam_PostCommit_XVR_Flink/ws/src/sdks/python/pytest_xlangSqlValidateRunner.xml> -
==== 9 passed, 5 skipped, 6774 deselected, 6 warnings in 223.24s (0:03:43) =====

> Task :runners:flink:1.15:job-server:flinkJobServerCleanup
Stopping job server pid: 4071650.

> Task :runners:flink:1.15:job-server:validatesCrossLanguageRunnerCleanup
Stopping expansion service pid: 4077345.
Stopping expansion service pid: 4077346.

FAILURE: Build failed with an exception.

* What went wrong:
Execution failed for task ':runners:flink:1.15:job-server:validatesCrossLanguageRunnerJavaUsingPython'.
> There were failing tests. See the report at: file://<https://ci-beam.apache.org/job/beam_PostCommit_XVR_Flink/ws/src/runners/flink/1.15/job-server/build/reports/tests/validatesCrossLanguageRunnerJavaUsingPython/index.html>

* Try:
> Run with --stacktrace option to get the stack trace.
> Run with --info or --debug option to get more log output.

* Get more help at https://help.gradle.org

Deprecated Gradle features were used in this build, making it incompatible with Gradle 8.0.

You can use '--warning-mode all' to show the individual deprecation warnings and determine if they come from your own scripts or plugins.

See https://docs.gradle.org/7.5.1/userguide/command_line_interface.html#sec:command_line_warnings

Execution optimizations have been disabled for 1 invalid unit(s) of work during this build to ensure correctness.
Please consult deprecation warnings for more details.

BUILD FAILED in 29m 54s
255 actionable tasks: 32 executed, 223 up-to-date

Publishing build scan...
https://gradle.com/s/5iotykh6qalsc

Build step 'Invoke Gradle script' changed build result to FAILURE
Build step 'Invoke Gradle script' marked build as failure

---------------------------------------------------------------------
To unsubscribe, e-mail: builds-unsubscribe@beam.apache.org
For additional commands, e-mail: builds-help@beam.apache.org


Build failed in Jenkins: beam_PostCommit_XVR_Flink #6223

Posted by Apache Jenkins Server <je...@builds.apache.org>.
See <https://ci-beam.apache.org/job/beam_PostCommit_XVR_Flink/6223/display/redirect>

Changes:


------------------------------------------
[...truncated 2.74 MB...]
-------------------------------- live log call ---------------------------------
INFO     apache_beam.utils.subprocess_server:subprocess_server.py:239 Using pre-built snapshot at <https://ci-beam.apache.org/job/beam_PostCommit_XVR_Flink/ws/src/sdks/java/extensions/sql/expansion-service/build/libs/beam-sdks-java-extensions-sql-expansion-service-2.45.0-SNAPSHOT.jar>
INFO     root:external.py:847 Starting a JAR-based expansion service from JAR <https://ci-beam.apache.org/job/beam_PostCommit_XVR_Flink/ws/src/sdks/java/extensions/sql/expansion-service/build/libs/beam-sdks-java-extensions-sql-expansion-service-2.45.0-SNAPSHOT.jar> 
INFO     apache_beam.utils.subprocess_server:subprocess_server.py:116 Starting service with ['java' '-jar' '<https://ci-beam.apache.org/job/beam_PostCommit_XVR_Flink/ws/src/sdks/java/extensions/sql/expansion-service/build/libs/beam-sdks-java-extensions-sql-expansion-service-2.45.0-SNAPSHOT.jar'> '38947' '--filesToStage=<https://ci-beam.apache.org/job/beam_PostCommit_XVR_Flink/ws/src/sdks/java/extensions/sql/expansion-service/build/libs/beam-sdks-java-extensions-sql-expansion-service-2.45.0-SNAPSHOT.jar']>
INFO     apache_beam.utils.subprocess_server:subprocess_server.py:126 Starting expansion service at localhost:38947
INFO     apache_beam.utils.subprocess_server:subprocess_server.py:126 Dec 07, 2022 11:17:41 AM org.apache.beam.sdk.expansion.service.ExpansionService loadRegisteredTransforms
INFO     apache_beam.utils.subprocess_server:subprocess_server.py:126 INFO: Registering external transforms: [beam:external:java:sql:v1, beam:transform:org.apache.beam:pubsub_read:v1, beam:transform:org.apache.beam:pubsub_write:v1, beam:transform:org.apache.beam:pubsublite_write:v1, beam:transform:org.apache.beam:pubsublite_read:v1, beam:transform:org.apache.beam:spanner_insert:v1, beam:transform:org.apache.beam:spanner_update:v1, beam:transform:org.apache.beam:spanner_replace:v1, beam:transform:org.apache.beam:spanner_insert_or_update:v1, beam:transform:org.apache.beam:spanner_delete:v1, beam:transform:org.apache.beam:spanner_read:v1, beam:transform:org.apache.beam:kafka_read_with_metadata:v1, beam:transform:org.apache.beam:kafka_read_without_metadata:v1, beam:transform:org.apache.beam:kafka_write:v1, beam:external:java:generate_sequence:v1]
INFO     apache_beam.utils.subprocess_server:subprocess_server.py:126 
INFO     apache_beam.utils.subprocess_server:subprocess_server.py:126 Registered transforms:
INFO     apache_beam.utils.subprocess_server:subprocess_server.py:126 	beam:external:java:sql:v1: org.apache.beam.sdk.expansion.service.ExpansionService$ExternalTransformRegistrarLoader$1@38425407
INFO     apache_beam.utils.subprocess_server:subprocess_server.py:126 	beam:transform:org.apache.beam:pubsub_read:v1: org.apache.beam.sdk.expansion.service.ExpansionService$ExternalTransformRegistrarLoader$1@43bc63a3
INFO     apache_beam.utils.subprocess_server:subprocess_server.py:126 	beam:transform:org.apache.beam:pubsub_write:v1: org.apache.beam.sdk.expansion.service.ExpansionService$ExternalTransformRegistrarLoader$1@702657cc
INFO     apache_beam.utils.subprocess_server:subprocess_server.py:126 	beam:transform:org.apache.beam:pubsublite_write:v1: org.apache.beam.sdk.expansion.service.ExpansionService$ExternalTransformRegistrarLoader$1@6a6cb05c
INFO     apache_beam.utils.subprocess_server:subprocess_server.py:126 	beam:transform:org.apache.beam:pubsublite_read:v1: org.apache.beam.sdk.expansion.service.ExpansionService$ExternalTransformRegistrarLoader$1@40a4337a
INFO     apache_beam.utils.subprocess_server:subprocess_server.py:126 	beam:transform:org.apache.beam:spanner_insert:v1: org.apache.beam.sdk.expansion.service.ExpansionService$ExternalTransformRegistrarLoader$1@6025e1b6
INFO     apache_beam.utils.subprocess_server:subprocess_server.py:126 	beam:transform:org.apache.beam:spanner_update:v1: org.apache.beam.sdk.expansion.service.ExpansionService$ExternalTransformRegistrarLoader$1@22ff4249
INFO     apache_beam.utils.subprocess_server:subprocess_server.py:126 	beam:transform:org.apache.beam:spanner_replace:v1: org.apache.beam.sdk.expansion.service.ExpansionService$ExternalTransformRegistrarLoader$1@2d1ef81a
INFO     apache_beam.utils.subprocess_server:subprocess_server.py:126 	beam:transform:org.apache.beam:spanner_insert_or_update:v1: org.apache.beam.sdk.expansion.service.ExpansionService$ExternalTransformRegistrarLoader$1@4c402120
INFO     apache_beam.utils.subprocess_server:subprocess_server.py:126 	beam:transform:org.apache.beam:spanner_delete:v1: org.apache.beam.sdk.expansion.service.ExpansionService$ExternalTransformRegistrarLoader$1@327514f
INFO     apache_beam.utils.subprocess_server:subprocess_server.py:126 	beam:transform:org.apache.beam:spanner_read:v1: org.apache.beam.sdk.expansion.service.ExpansionService$ExternalTransformRegistrarLoader$1@5b12b668
INFO     apache_beam.utils.subprocess_server:subprocess_server.py:126 	beam:transform:org.apache.beam:kafka_read_with_metadata:v1: org.apache.beam.sdk.expansion.service.ExpansionService$ExternalTransformRegistrarLoader$1@1165b38
INFO     apache_beam.utils.subprocess_server:subprocess_server.py:126 	beam:transform:org.apache.beam:kafka_read_without_metadata:v1: org.apache.beam.sdk.expansion.service.ExpansionService$ExternalTransformRegistrarLoader$1@4c12331b
INFO     apache_beam.utils.subprocess_server:subprocess_server.py:126 	beam:transform:org.apache.beam:kafka_write:v1: org.apache.beam.sdk.expansion.service.ExpansionService$ExternalTransformRegistrarLoader$1@7586beff
INFO     apache_beam.utils.subprocess_server:subprocess_server.py:126 	beam:external:java:generate_sequence:v1: org.apache.beam.sdk.expansion.service.ExpansionService$ExternalTransformRegistrarLoader$1@3b69e7d1
INFO     apache_beam.utils.subprocess_server:subprocess_server.py:126 
INFO     apache_beam.utils.subprocess_server:subprocess_server.py:126 Registered SchemaTransformProviders:
INFO     apache_beam.utils.subprocess_server:subprocess_server.py:126 	beam:schematransform:org.apache.beam:kafka_read:v1
INFO     apache_beam.utils.subprocess_server:subprocess_server.py:126 	beam:schematransform:org.apache.beam:spanner_write:v1
INFO     apache_beam.utils.subprocess_server:subprocess_server.py:126 	beam:transform:org.apache.beam:bigquery_storage_read:v1
INFO     apache_beam.utils.subprocess_server:subprocess_server.py:126 Dec 07, 2022 11:17:42 AM org.apache.beam.sdk.expansion.service.ExpansionService expand
INFO     apache_beam.utils.subprocess_server:subprocess_server.py:126 INFO: Expanding 'SqlTransform(beam:external:java:sql:v1)' with URN 'beam:external:java:sql:v1'
INFO     apache_beam.utils.subprocess_server:subprocess_server.py:126 Dec 07, 2022 11:17:43 AM org.apache.beam.sdk.expansion.service.ExpansionService$ExternalTransformRegistrarLoader payloadToConfig
INFO     apache_beam.utils.subprocess_server:subprocess_server.py:126 WARNING: Configuration class 'org.apache.beam.sdk.extensions.sql.expansion.ExternalSqlTransformRegistrar$Configuration' has no schema registered. Attempting to construct with setter approach.
INFO     apache_beam.utils.subprocess_server:subprocess_server.py:126 Dec 07, 2022 11:17:43 AM org.apache.beam.sdk.expansion.service.ExpansionService$ExternalTransformRegistrarLoader payloadToConfig
INFO     apache_beam.utils.subprocess_server:subprocess_server.py:126 WARNING: Configuration class 'org.apache.beam.sdk.extensions.sql.expansion.ExternalSqlTransformRegistrar$Configuration' has no schema registered. Attempting to construct with setter approach.
INFO     apache_beam.utils.subprocess_server:subprocess_server.py:126 Dec 07, 2022 11:17:44 AM org.apache.beam.sdk.extensions.sql.impl.CalciteQueryPlanner convertToBeamRel
INFO     apache_beam.utils.subprocess_server:subprocess_server.py:126 INFO: SQL:
INFO     apache_beam.utils.subprocess_server:subprocess_server.py:126 SELECT `simple`.`id` AS `id`, `enrich`.`metadata` AS `metadata`
INFO     apache_beam.utils.subprocess_server:subprocess_server.py:126 FROM `beam`.`simple` AS `simple`
INFO     apache_beam.utils.subprocess_server:subprocess_server.py:126 INNER JOIN `beam`.`enrich` AS `enrich` ON `simple`.`id` = `enrich`.`id`
INFO     apache_beam.utils.subprocess_server:subprocess_server.py:126 Dec 07, 2022 11:17:45 AM org.apache.beam.sdk.extensions.sql.impl.CalciteQueryPlanner convertToBeamRel
INFO     apache_beam.utils.subprocess_server:subprocess_server.py:126 INFO: SQLPlan>
INFO     apache_beam.utils.subprocess_server:subprocess_server.py:126 LogicalProject(id=[$0], metadata=[$4])
INFO     apache_beam.utils.subprocess_server:subprocess_server.py:126   LogicalJoin(condition=[=($0, $3)], joinType=[inner])
INFO     apache_beam.utils.subprocess_server:subprocess_server.py:126     BeamIOSourceRel(table=[[beam, simple]])
INFO     apache_beam.utils.subprocess_server:subprocess_server.py:126     BeamIOSourceRel(table=[[beam, enrich]])
INFO     apache_beam.utils.subprocess_server:subprocess_server.py:126 
INFO     apache_beam.utils.subprocess_server:subprocess_server.py:126 Dec 07, 2022 11:17:45 AM org.apache.beam.sdk.extensions.sql.impl.CalciteQueryPlanner convertToBeamRel
INFO     apache_beam.utils.subprocess_server:subprocess_server.py:126 INFO: BEAMPlan>
INFO     apache_beam.utils.subprocess_server:subprocess_server.py:126 BeamCalcRel(expr#0..4=[{inputs}], id=[$t0], metadata=[$t4])
INFO     apache_beam.utils.subprocess_server:subprocess_server.py:126   BeamCoGBKJoinRel(condition=[=($0, $3)], joinType=[inner])
INFO     apache_beam.utils.subprocess_server:subprocess_server.py:126     BeamIOSourceRel(table=[[beam, simple]])
INFO     apache_beam.utils.subprocess_server:subprocess_server.py:126     BeamIOSourceRel(table=[[beam, enrich]])
INFO     apache_beam.utils.subprocess_server:subprocess_server.py:126 
INFO     root:environments.py:376 Default Python SDK image for environment is apache/beam_python3.10_sdk:2.45.0.dev
INFO     root:environments.py:299 No image given, using default Python SDK image
INFO     root:environments.py:376 Default Python SDK image for environment is apache/beam_python3.10_sdk:2.45.0.dev
INFO     root:environments.py:302 Python SDK container image set to "apache/beam_python3.10_sdk:2.45.0.dev" for Docker environment
INFO     apache_beam.runners.portability.fn_api_runner.translations:translations.py:710 ==================== <function pack_combiners at 0x7f487502e5f0> ====================
INFO     apache_beam.runners.portability.fn_api_runner.translations:translations.py:710 ==================== <function lift_combiners at 0x7f487502e680> ====================
INFO     apache_beam.runners.portability.fn_api_runner.translations:translations.py:710 ==================== <function sort_stages at 0x7f487502edd0> ====================
INFO     apache_beam.runners.portability.portable_runner:portable_runner.py:581 Job state changed to STOPPED
INFO     apache_beam.runners.portability.portable_runner:portable_runner.py:581 Job state changed to STARTING
INFO     apache_beam.runners.portability.portable_runner:portable_runner.py:581 Job state changed to RUNNING
INFO     apache_beam.runners.portability.portable_runner:portable_runner.py:581 Job state changed to DONE
PASSED                                                                   [ 77%]
apache_beam/transforms/sql_test.py::SqlTransformTest::test_windowing_before_sql 
-------------------------------- live log call ---------------------------------
INFO     apache_beam.utils.subprocess_server:subprocess_server.py:239 Using pre-built snapshot at <https://ci-beam.apache.org/job/beam_PostCommit_XVR_Flink/ws/src/sdks/java/extensions/sql/expansion-service/build/libs/beam-sdks-java-extensions-sql-expansion-service-2.45.0-SNAPSHOT.jar>
INFO     root:external.py:847 Starting a JAR-based expansion service from JAR <https://ci-beam.apache.org/job/beam_PostCommit_XVR_Flink/ws/src/sdks/java/extensions/sql/expansion-service/build/libs/beam-sdks-java-extensions-sql-expansion-service-2.45.0-SNAPSHOT.jar> 
INFO     apache_beam.utils.subprocess_server:subprocess_server.py:116 Starting service with ['java' '-jar' '<https://ci-beam.apache.org/job/beam_PostCommit_XVR_Flink/ws/src/sdks/java/extensions/sql/expansion-service/build/libs/beam-sdks-java-extensions-sql-expansion-service-2.45.0-SNAPSHOT.jar'> '34141' '--filesToStage=<https://ci-beam.apache.org/job/beam_PostCommit_XVR_Flink/ws/src/sdks/java/extensions/sql/expansion-service/build/libs/beam-sdks-java-extensions-sql-expansion-service-2.45.0-SNAPSHOT.jar']>
INFO     apache_beam.utils.subprocess_server:subprocess_server.py:126 Starting expansion service at localhost:34141
INFO     apache_beam.utils.subprocess_server:subprocess_server.py:126 Dec 07, 2022 11:18:05 AM org.apache.beam.sdk.expansion.service.ExpansionService loadRegisteredTransforms
INFO     apache_beam.utils.subprocess_server:subprocess_server.py:126 INFO: Registering external transforms: [beam:external:java:sql:v1, beam:transform:org.apache.beam:pubsub_read:v1, beam:transform:org.apache.beam:pubsub_write:v1, beam:transform:org.apache.beam:pubsublite_write:v1, beam:transform:org.apache.beam:pubsublite_read:v1, beam:transform:org.apache.beam:spanner_insert:v1, beam:transform:org.apache.beam:spanner_update:v1, beam:transform:org.apache.beam:spanner_replace:v1, beam:transform:org.apache.beam:spanner_insert_or_update:v1, beam:transform:org.apache.beam:spanner_delete:v1, beam:transform:org.apache.beam:spanner_read:v1, beam:transform:org.apache.beam:kafka_read_with_metadata:v1, beam:transform:org.apache.beam:kafka_read_without_metadata:v1, beam:transform:org.apache.beam:kafka_write:v1, beam:external:java:generate_sequence:v1]
INFO     apache_beam.utils.subprocess_server:subprocess_server.py:126 
INFO     apache_beam.utils.subprocess_server:subprocess_server.py:126 Registered transforms:
INFO     apache_beam.utils.subprocess_server:subprocess_server.py:126 	beam:external:java:sql:v1: org.apache.beam.sdk.expansion.service.ExpansionService$ExternalTransformRegistrarLoader$1@38425407
INFO     apache_beam.utils.subprocess_server:subprocess_server.py:126 	beam:transform:org.apache.beam:pubsub_read:v1: org.apache.beam.sdk.expansion.service.ExpansionService$ExternalTransformRegistrarLoader$1@43bc63a3
INFO     apache_beam.utils.subprocess_server:subprocess_server.py:126 	beam:transform:org.apache.beam:pubsub_write:v1: org.apache.beam.sdk.expansion.service.ExpansionService$ExternalTransformRegistrarLoader$1@702657cc
INFO     apache_beam.utils.subprocess_server:subprocess_server.py:126 	beam:transform:org.apache.beam:pubsublite_write:v1: org.apache.beam.sdk.expansion.service.ExpansionService$ExternalTransformRegistrarLoader$1@6a6cb05c
INFO     apache_beam.utils.subprocess_server:subprocess_server.py:126 	beam:transform:org.apache.beam:pubsublite_read:v1: org.apache.beam.sdk.expansion.service.ExpansionService$ExternalTransformRegistrarLoader$1@40a4337a
INFO     apache_beam.utils.subprocess_server:subprocess_server.py:126 	beam:transform:org.apache.beam:spanner_insert:v1: org.apache.beam.sdk.expansion.service.ExpansionService$ExternalTransformRegistrarLoader$1@6025e1b6
INFO     apache_beam.utils.subprocess_server:subprocess_server.py:126 	beam:transform:org.apache.beam:spanner_update:v1: org.apache.beam.sdk.expansion.service.ExpansionService$ExternalTransformRegistrarLoader$1@22ff4249
INFO     apache_beam.utils.subprocess_server:subprocess_server.py:126 	beam:transform:org.apache.beam:spanner_replace:v1: org.apache.beam.sdk.expansion.service.ExpansionService$ExternalTransformRegistrarLoader$1@2d1ef81a
INFO     apache_beam.utils.subprocess_server:subprocess_server.py:126 	beam:transform:org.apache.beam:spanner_insert_or_update:v1: org.apache.beam.sdk.expansion.service.ExpansionService$ExternalTransformRegistrarLoader$1@4c402120
INFO     apache_beam.utils.subprocess_server:subprocess_server.py:126 	beam:transform:org.apache.beam:spanner_delete:v1: org.apache.beam.sdk.expansion.service.ExpansionService$ExternalTransformRegistrarLoader$1@327514f
INFO     apache_beam.utils.subprocess_server:subprocess_server.py:126 	beam:transform:org.apache.beam:spanner_read:v1: org.apache.beam.sdk.expansion.service.ExpansionService$ExternalTransformRegistrarLoader$1@5b12b668
INFO     apache_beam.utils.subprocess_server:subprocess_server.py:126 	beam:transform:org.apache.beam:kafka_read_with_metadata:v1: org.apache.beam.sdk.expansion.service.ExpansionService$ExternalTransformRegistrarLoader$1@1165b38
INFO     apache_beam.utils.subprocess_server:subprocess_server.py:126 	beam:transform:org.apache.beam:kafka_read_without_metadata:v1: org.apache.beam.sdk.expansion.service.ExpansionService$ExternalTransformRegistrarLoader$1@4c12331b
INFO     apache_beam.utils.subprocess_server:subprocess_server.py:126 	beam:transform:org.apache.beam:kafka_write:v1: org.apache.beam.sdk.expansion.service.ExpansionService$ExternalTransformRegistrarLoader$1@7586beff
INFO     apache_beam.utils.subprocess_server:subprocess_server.py:126 	beam:external:java:generate_sequence:v1: org.apache.beam.sdk.expansion.service.ExpansionService$ExternalTransformRegistrarLoader$1@3b69e7d1
INFO     apache_beam.utils.subprocess_server:subprocess_server.py:126 
INFO     apache_beam.utils.subprocess_server:subprocess_server.py:126 Registered SchemaTransformProviders:
INFO     apache_beam.utils.subprocess_server:subprocess_server.py:126 	beam:schematransform:org.apache.beam:kafka_read:v1
INFO     apache_beam.utils.subprocess_server:subprocess_server.py:126 	beam:schematransform:org.apache.beam:spanner_write:v1
INFO     apache_beam.utils.subprocess_server:subprocess_server.py:126 	beam:transform:org.apache.beam:bigquery_storage_read:v1
INFO     apache_beam.utils.subprocess_server:subprocess_server.py:126 Dec 07, 2022 11:18:07 AM org.apache.beam.sdk.expansion.service.ExpansionService expand
INFO     apache_beam.utils.subprocess_server:subprocess_server.py:126 INFO: Expanding 'SqlTransform(beam:external:java:sql:v1)' with URN 'beam:external:java:sql:v1'
INFO     apache_beam.utils.subprocess_server:subprocess_server.py:126 Dec 07, 2022 11:18:07 AM org.apache.beam.sdk.expansion.service.ExpansionService$ExternalTransformRegistrarLoader payloadToConfig
INFO     apache_beam.utils.subprocess_server:subprocess_server.py:126 WARNING: Configuration class 'org.apache.beam.sdk.extensions.sql.expansion.ExternalSqlTransformRegistrar$Configuration' has no schema registered. Attempting to construct with setter approach.
INFO     apache_beam.utils.subprocess_server:subprocess_server.py:126 Dec 07, 2022 11:18:07 AM org.apache.beam.sdk.expansion.service.ExpansionService$ExternalTransformRegistrarLoader payloadToConfig
INFO     apache_beam.utils.subprocess_server:subprocess_server.py:126 WARNING: Configuration class 'org.apache.beam.sdk.extensions.sql.expansion.ExternalSqlTransformRegistrar$Configuration' has no schema registered. Attempting to construct with setter approach.
INFO     apache_beam.utils.subprocess_server:subprocess_server.py:126 Dec 07, 2022 11:18:09 AM org.apache.beam.sdk.extensions.sql.impl.CalciteQueryPlanner convertToBeamRel
INFO     apache_beam.utils.subprocess_server:subprocess_server.py:126 INFO: SQL:
INFO     apache_beam.utils.subprocess_server:subprocess_server.py:126 SELECT COUNT(*) AS `count`
INFO     apache_beam.utils.subprocess_server:subprocess_server.py:126 FROM `beam`.`PCOLLECTION` AS `PCOLLECTION`
INFO     apache_beam.utils.subprocess_server:subprocess_server.py:126 Dec 07, 2022 11:18:09 AM org.apache.beam.sdk.extensions.sql.impl.CalciteQueryPlanner convertToBeamRel
INFO     apache_beam.utils.subprocess_server:subprocess_server.py:126 INFO: SQLPlan>
INFO     apache_beam.utils.subprocess_server:subprocess_server.py:126 LogicalAggregate(group=[{}], count=[COUNT()])
INFO     apache_beam.utils.subprocess_server:subprocess_server.py:126   BeamIOSourceRel(table=[[beam, PCOLLECTION]])
INFO     apache_beam.utils.subprocess_server:subprocess_server.py:126 
INFO     apache_beam.utils.subprocess_server:subprocess_server.py:126 Dec 07, 2022 11:18:09 AM org.apache.beam.sdk.extensions.sql.impl.CalciteQueryPlanner convertToBeamRel
INFO     apache_beam.utils.subprocess_server:subprocess_server.py:126 INFO: BEAMPlan>
INFO     apache_beam.utils.subprocess_server:subprocess_server.py:126 BeamAggregationRel(group=[{}], count=[COUNT()])
INFO     apache_beam.utils.subprocess_server:subprocess_server.py:126   BeamIOSourceRel(table=[[beam, PCOLLECTION]])
INFO     apache_beam.utils.subprocess_server:subprocess_server.py:126 
INFO     root:environments.py:376 Default Python SDK image for environment is apache/beam_python3.10_sdk:2.45.0.dev
INFO     root:environments.py:299 No image given, using default Python SDK image
INFO     root:environments.py:376 Default Python SDK image for environment is apache/beam_python3.10_sdk:2.45.0.dev
INFO     root:environments.py:302 Python SDK container image set to "apache/beam_python3.10_sdk:2.45.0.dev" for Docker environment
INFO     apache_beam.runners.portability.fn_api_runner.translations:translations.py:710 ==================== <function pack_combiners at 0x7f487502e5f0> ====================
INFO     apache_beam.runners.portability.fn_api_runner.translations:translations.py:710 ==================== <function lift_combiners at 0x7f487502e680> ====================
INFO     apache_beam.runners.portability.fn_api_runner.translations:translations.py:710 ==================== <function sort_stages at 0x7f487502edd0> ====================
INFO     apache_beam.runners.portability.portable_runner:portable_runner.py:581 Job state changed to STOPPED
INFO     apache_beam.runners.portability.portable_runner:portable_runner.py:581 Job state changed to STARTING
INFO     apache_beam.runners.portability.portable_runner:portable_runner.py:581 Job state changed to RUNNING
INFO     apache_beam.runners.portability.portable_runner:portable_runner.py:581 Job state changed to DONE
PASSED                                                                   [ 88%]
apache_beam/transforms/sql_test.py::SqlTransformTest::test_zetasql_generate_data 
-------------------------------- live log call ---------------------------------
INFO     apache_beam.utils.subprocess_server:subprocess_server.py:239 Using pre-built snapshot at <https://ci-beam.apache.org/job/beam_PostCommit_XVR_Flink/ws/src/sdks/java/extensions/sql/expansion-service/build/libs/beam-sdks-java-extensions-sql-expansion-service-2.45.0-SNAPSHOT.jar>
INFO     root:external.py:847 Starting a JAR-based expansion service from JAR <https://ci-beam.apache.org/job/beam_PostCommit_XVR_Flink/ws/src/sdks/java/extensions/sql/expansion-service/build/libs/beam-sdks-java-extensions-sql-expansion-service-2.45.0-SNAPSHOT.jar> 
INFO     apache_beam.utils.subprocess_server:subprocess_server.py:116 Starting service with ['java' '-jar' '<https://ci-beam.apache.org/job/beam_PostCommit_XVR_Flink/ws/src/sdks/java/extensions/sql/expansion-service/build/libs/beam-sdks-java-extensions-sql-expansion-service-2.45.0-SNAPSHOT.jar'> '52447' '--filesToStage=<https://ci-beam.apache.org/job/beam_PostCommit_XVR_Flink/ws/src/sdks/java/extensions/sql/expansion-service/build/libs/beam-sdks-java-extensions-sql-expansion-service-2.45.0-SNAPSHOT.jar']>
INFO     apache_beam.utils.subprocess_server:subprocess_server.py:126 Starting expansion service at localhost:52447
INFO     apache_beam.utils.subprocess_server:subprocess_server.py:126 Dec 07, 2022 11:18:28 AM org.apache.beam.sdk.expansion.service.ExpansionService loadRegisteredTransforms
INFO     apache_beam.utils.subprocess_server:subprocess_server.py:126 INFO: Registering external transforms: [beam:external:java:sql:v1, beam:transform:org.apache.beam:pubsub_read:v1, beam:transform:org.apache.beam:pubsub_write:v1, beam:transform:org.apache.beam:pubsublite_write:v1, beam:transform:org.apache.beam:pubsublite_read:v1, beam:transform:org.apache.beam:spanner_insert:v1, beam:transform:org.apache.beam:spanner_update:v1, beam:transform:org.apache.beam:spanner_replace:v1, beam:transform:org.apache.beam:spanner_insert_or_update:v1, beam:transform:org.apache.beam:spanner_delete:v1, beam:transform:org.apache.beam:spanner_read:v1, beam:transform:org.apache.beam:kafka_read_with_metadata:v1, beam:transform:org.apache.beam:kafka_read_without_metadata:v1, beam:transform:org.apache.beam:kafka_write:v1, beam:external:java:generate_sequence:v1]
INFO     apache_beam.utils.subprocess_server:subprocess_server.py:126 
INFO     apache_beam.utils.subprocess_server:subprocess_server.py:126 Registered transforms:
INFO     apache_beam.utils.subprocess_server:subprocess_server.py:126 	beam:external:java:sql:v1: org.apache.beam.sdk.expansion.service.ExpansionService$ExternalTransformRegistrarLoader$1@38425407
INFO     apache_beam.utils.subprocess_server:subprocess_server.py:126 	beam:transform:org.apache.beam:pubsub_read:v1: org.apache.beam.sdk.expansion.service.ExpansionService$ExternalTransformRegistrarLoader$1@43bc63a3
INFO     apache_beam.utils.subprocess_server:subprocess_server.py:126 	beam:transform:org.apache.beam:pubsub_write:v1: org.apache.beam.sdk.expansion.service.ExpansionService$ExternalTransformRegistrarLoader$1@702657cc
INFO     apache_beam.utils.subprocess_server:subprocess_server.py:126 	beam:transform:org.apache.beam:pubsublite_write:v1: org.apache.beam.sdk.expansion.service.ExpansionService$ExternalTransformRegistrarLoader$1@6a6cb05c
INFO     apache_beam.utils.subprocess_server:subprocess_server.py:126 	beam:transform:org.apache.beam:pubsublite_read:v1: org.apache.beam.sdk.expansion.service.ExpansionService$ExternalTransformRegistrarLoader$1@40a4337a
INFO     apache_beam.utils.subprocess_server:subprocess_server.py:126 	beam:transform:org.apache.beam:spanner_insert:v1: org.apache.beam.sdk.expansion.service.ExpansionService$ExternalTransformRegistrarLoader$1@6025e1b6
INFO     apache_beam.utils.subprocess_server:subprocess_server.py:126 	beam:transform:org.apache.beam:spanner_update:v1: org.apache.beam.sdk.expansion.service.ExpansionService$ExternalTransformRegistrarLoader$1@22ff4249
INFO     apache_beam.utils.subprocess_server:subprocess_server.py:126 	beam:transform:org.apache.beam:spanner_replace:v1: org.apache.beam.sdk.expansion.service.ExpansionService$ExternalTransformRegistrarLoader$1@2d1ef81a
INFO     apache_beam.utils.subprocess_server:subprocess_server.py:126 	beam:transform:org.apache.beam:spanner_insert_or_update:v1: org.apache.beam.sdk.expansion.service.ExpansionService$ExternalTransformRegistrarLoader$1@4c402120
INFO     apache_beam.utils.subprocess_server:subprocess_server.py:126 	beam:transform:org.apache.beam:spanner_delete:v1: org.apache.beam.sdk.expansion.service.ExpansionService$ExternalTransformRegistrarLoader$1@327514f
INFO     apache_beam.utils.subprocess_server:subprocess_server.py:126 	beam:transform:org.apache.beam:spanner_read:v1: org.apache.beam.sdk.expansion.service.ExpansionService$ExternalTransformRegistrarLoader$1@5b12b668
INFO     apache_beam.utils.subprocess_server:subprocess_server.py:126 	beam:transform:org.apache.beam:kafka_read_with_metadata:v1: org.apache.beam.sdk.expansion.service.ExpansionService$ExternalTransformRegistrarLoader$1@1165b38
INFO     apache_beam.utils.subprocess_server:subprocess_server.py:126 	beam:transform:org.apache.beam:kafka_read_without_metadata:v1: org.apache.beam.sdk.expansion.service.ExpansionService$ExternalTransformRegistrarLoader$1@4c12331b
INFO     apache_beam.utils.subprocess_server:subprocess_server.py:126 	beam:transform:org.apache.beam:kafka_write:v1: org.apache.beam.sdk.expansion.service.ExpansionService$ExternalTransformRegistrarLoader$1@7586beff
INFO     apache_beam.utils.subprocess_server:subprocess_server.py:126 	beam:external:java:generate_sequence:v1: org.apache.beam.sdk.expansion.service.ExpansionService$ExternalTransformRegistrarLoader$1@3b69e7d1
INFO     apache_beam.utils.subprocess_server:subprocess_server.py:126 
INFO     apache_beam.utils.subprocess_server:subprocess_server.py:126 Registered SchemaTransformProviders:
INFO     apache_beam.utils.subprocess_server:subprocess_server.py:126 	beam:schematransform:org.apache.beam:kafka_read:v1
INFO     apache_beam.utils.subprocess_server:subprocess_server.py:126 	beam:schematransform:org.apache.beam:spanner_write:v1
INFO     apache_beam.utils.subprocess_server:subprocess_server.py:126 	beam:transform:org.apache.beam:bigquery_storage_read:v1
INFO     apache_beam.utils.subprocess_server:subprocess_server.py:126 Dec 07, 2022 11:18:29 AM org.apache.beam.sdk.expansion.service.ExpansionService expand
INFO     apache_beam.utils.subprocess_server:subprocess_server.py:126 INFO: Expanding 'SqlTransform(beam:external:java:sql:v1)' with URN 'beam:external:java:sql:v1'
INFO     apache_beam.utils.subprocess_server:subprocess_server.py:126 Dec 07, 2022 11:18:29 AM org.apache.beam.sdk.expansion.service.ExpansionService$ExternalTransformRegistrarLoader payloadToConfig
INFO     apache_beam.utils.subprocess_server:subprocess_server.py:126 WARNING: Configuration class 'org.apache.beam.sdk.extensions.sql.expansion.ExternalSqlTransformRegistrar$Configuration' has no schema registered. Attempting to construct with setter approach.
INFO     apache_beam.utils.subprocess_server:subprocess_server.py:126 Dec 07, 2022 11:18:29 AM org.apache.beam.sdk.expansion.service.ExpansionService$ExternalTransformRegistrarLoader payloadToConfig
INFO     apache_beam.utils.subprocess_server:subprocess_server.py:126 WARNING: Configuration class 'org.apache.beam.sdk.extensions.sql.expansion.ExternalSqlTransformRegistrar$Configuration' has no schema registered. Attempting to construct with setter approach.
INFO     apache_beam.utils.subprocess_server:subprocess_server.py:126 Dec 07, 2022 11:18:31 AM com.google.zetasql.io.grpc.NameResolverRegistry getDefaultRegistry
INFO     apache_beam.utils.subprocess_server:subprocess_server.py:126 WARNING: No NameResolverProviders found via ServiceLoader, including for DNS. This is probably due to a broken build. If using ProGuard, check your configuration
INFO     apache_beam.utils.subprocess_server:subprocess_server.py:126 Dec 07, 2022 11:18:33 AM org.apache.beam.sdk.extensions.sql.zetasql.ZetaSQLQueryPlanner convertToBeamRelInternal
INFO     apache_beam.utils.subprocess_server:subprocess_server.py:126 INFO: BEAMPlan>
INFO     apache_beam.utils.subprocess_server:subprocess_server.py:126 BeamZetaSqlCalcRel(expr#0=[{inputs}], expr#1=[1:BIGINT], expr#2=['foo':VARCHAR], expr#3=[3.1400000000000001243E0:DOUBLE], int=[$t1], str=[$t2], flt=[$t3])
INFO     apache_beam.utils.subprocess_server:subprocess_server.py:126   BeamValuesRel(tuples=[[{ 0 }]])
INFO     apache_beam.utils.subprocess_server:subprocess_server.py:126 
INFO     root:environments.py:376 Default Python SDK image for environment is apache/beam_python3.10_sdk:2.45.0.dev
INFO     root:environments.py:299 No image given, using default Python SDK image
INFO     root:environments.py:376 Default Python SDK image for environment is apache/beam_python3.10_sdk:2.45.0.dev
INFO     root:environments.py:302 Python SDK container image set to "apache/beam_python3.10_sdk:2.45.0.dev" for Docker environment
INFO     apache_beam.runners.portability.fn_api_runner.translations:translations.py:710 ==================== <function pack_combiners at 0x7f487502e5f0> ====================
INFO     apache_beam.runners.portability.fn_api_runner.translations:translations.py:710 ==================== <function lift_combiners at 0x7f487502e680> ====================
INFO     apache_beam.runners.portability.fn_api_runner.translations:translations.py:710 ==================== <function sort_stages at 0x7f487502edd0> ====================
INFO     apache_beam.runners.portability.portable_runner:portable_runner.py:581 Job state changed to STOPPED
INFO     apache_beam.runners.portability.portable_runner:portable_runner.py:581 Job state changed to STARTING
INFO     apache_beam.runners.portability.portable_runner:portable_runner.py:581 Job state changed to RUNNING
INFO     apache_beam.runners.portability.portable_runner:portable_runner.py:581 Job state changed to DONE
PASSED                                                                   [100%]

=============================== warnings summary ===============================
../../build/gradleenv/1922375555/lib/python3.10/site-packages/hdfs/config.py:15
  <https://ci-beam.apache.org/job/beam_PostCommit_XVR_Flink/ws/src/build/gradleenv/1922375555/lib/python3.10/site-packages/hdfs/config.py>:15: DeprecationWarning: the imp module is deprecated in favour of importlib and slated for removal in Python 3.12; see the module's documentation for alternative uses
    from imp import load_source

../../build/gradleenv/1922375555/lib/python3.10/site-packages/google/api_core/operations_v1/abstract_operations_client.py:17
  <https://ci-beam.apache.org/job/beam_PostCommit_XVR_Flink/ws/src/build/gradleenv/1922375555/lib/python3.10/site-packages/google/api_core/operations_v1/abstract_operations_client.py>:17: DeprecationWarning: The distutils package is deprecated and slated for removal in Python 3.12. Use setuptools or check PEP 632 for potential alternatives
    from distutils import util

../../build/gradleenv/1922375555/lib/python3.10/site-packages/tenacity/_asyncio.py:42
  <https://ci-beam.apache.org/job/beam_PostCommit_XVR_Flink/ws/src/build/gradleenv/1922375555/lib/python3.10/site-packages/tenacity/_asyncio.py>:42: DeprecationWarning: "@coroutine" decorator is deprecated since Python 3.8, use "async def" instead
    def call(self, fn, *args, **kwargs):

apache_beam/typehints/pandas_type_compatibility_test.py:67
  <https://ci-beam.apache.org/job/beam_PostCommit_XVR_Flink/ws/src/sdks/python/apache_beam/typehints/pandas_type_compatibility_test.py>:67: FutureWarning: pandas.Int64Index is deprecated and will be removed from pandas in a future version. Use pandas.Index with the appropriate dtype instead.
    }).set_index(pd.Int64Index(range(123, 223), name='an_index')),

apache_beam/typehints/pandas_type_compatibility_test.py:90
  <https://ci-beam.apache.org/job/beam_PostCommit_XVR_Flink/ws/src/sdks/python/apache_beam/typehints/pandas_type_compatibility_test.py>:90: FutureWarning: pandas.Int64Index is deprecated and will be removed from pandas in a future version. Use pandas.Index with the appropriate dtype instead.
    pd.Int64Index(range(123, 223), name='an_index'),

apache_beam/typehints/pandas_type_compatibility_test.py:91
  <https://ci-beam.apache.org/job/beam_PostCommit_XVR_Flink/ws/src/sdks/python/apache_beam/typehints/pandas_type_compatibility_test.py>:91: FutureWarning: pandas.Int64Index is deprecated and will be removed from pandas in a future version. Use pandas.Index with the appropriate dtype instead.
    pd.Int64Index(range(475, 575), name='another_index'),

-- Docs: https://docs.pytest.org/en/stable/how-to/capture-warnings.html
- generated xml file: <https://ci-beam.apache.org/job/beam_PostCommit_XVR_Flink/ws/src/sdks/python/pytest_xlangSqlValidateRunner.xml> -
==== 9 passed, 5 skipped, 6774 deselected, 6 warnings in 216.74s (0:03:36) =====

> Task :runners:flink:1.15:job-server:flinkJobServerCleanup
Stopping job server pid: 3761810.

> Task :runners:flink:1.15:job-server:validatesCrossLanguageRunnerCleanup
Stopping expansion service pid: 3782254.
Stopping expansion service pid: 3782255.

FAILURE: Build failed with an exception.

* What went wrong:
Execution failed for task ':runners:flink:1.15:job-server:validatesCrossLanguageRunnerJavaUsingPython'.
> There were failing tests. See the report at: file://<https://ci-beam.apache.org/job/beam_PostCommit_XVR_Flink/ws/src/runners/flink/1.15/job-server/build/reports/tests/validatesCrossLanguageRunnerJavaUsingPython/index.html>

* Try:
> Run with --stacktrace option to get the stack trace.
> Run with --info or --debug option to get more log output.

* Get more help at https://help.gradle.org

Deprecated Gradle features were used in this build, making it incompatible with Gradle 8.0.

You can use '--warning-mode all' to show the individual deprecation warnings and determine if they come from your own scripts or plugins.

See https://docs.gradle.org/7.5.1/userguide/command_line_interface.html#sec:command_line_warnings

Execution optimizations have been disabled for 1 invalid unit(s) of work during this build to ensure correctness.
Please consult deprecation warnings for more details.

BUILD FAILED in 28m 51s
255 actionable tasks: 32 executed, 223 up-to-date

Publishing build scan...
https://gradle.com/s/vilxqgkwbh2n4

Build step 'Invoke Gradle script' changed build result to FAILURE
Build step 'Invoke Gradle script' marked build as failure

---------------------------------------------------------------------
To unsubscribe, e-mail: builds-unsubscribe@beam.apache.org
For additional commands, e-mail: builds-help@beam.apache.org


Build failed in Jenkins: beam_PostCommit_XVR_Flink #6222

Posted by Apache Jenkins Server <je...@builds.apache.org>.
See <https://ci-beam.apache.org/job/beam_PostCommit_XVR_Flink/6222/display/redirect?page=changes>

Changes:

[Kenneth Knowles] Support multiple gradle tasks in one precommit job

[Kenneth Knowles] Split up some IOs from Java PreCommit


------------------------------------------
[...truncated 2.15 MB...]
-------------------------------- live log call ---------------------------------
INFO     apache_beam.utils.subprocess_server:subprocess_server.py:239 Using pre-built snapshot at <https://ci-beam.apache.org/job/beam_PostCommit_XVR_Flink/ws/src/sdks/java/extensions/sql/expansion-service/build/libs/beam-sdks-java-extensions-sql-expansion-service-2.45.0-SNAPSHOT.jar>
INFO     root:external.py:847 Starting a JAR-based expansion service from JAR <https://ci-beam.apache.org/job/beam_PostCommit_XVR_Flink/ws/src/sdks/java/extensions/sql/expansion-service/build/libs/beam-sdks-java-extensions-sql-expansion-service-2.45.0-SNAPSHOT.jar> 
INFO     apache_beam.utils.subprocess_server:subprocess_server.py:116 Starting service with ['java' '-jar' '<https://ci-beam.apache.org/job/beam_PostCommit_XVR_Flink/ws/src/sdks/java/extensions/sql/expansion-service/build/libs/beam-sdks-java-extensions-sql-expansion-service-2.45.0-SNAPSHOT.jar'> '48769' '--filesToStage=<https://ci-beam.apache.org/job/beam_PostCommit_XVR_Flink/ws/src/sdks/java/extensions/sql/expansion-service/build/libs/beam-sdks-java-extensions-sql-expansion-service-2.45.0-SNAPSHOT.jar']>
INFO     apache_beam.utils.subprocess_server:subprocess_server.py:126 Starting expansion service at localhost:48769
INFO     apache_beam.utils.subprocess_server:subprocess_server.py:126 Dec 07, 2022 5:31:09 AM org.apache.beam.sdk.expansion.service.ExpansionService loadRegisteredTransforms
INFO     apache_beam.utils.subprocess_server:subprocess_server.py:126 INFO: Registering external transforms: [beam:external:java:sql:v1, beam:transform:org.apache.beam:pubsub_read:v1, beam:transform:org.apache.beam:pubsub_write:v1, beam:transform:org.apache.beam:pubsublite_write:v1, beam:transform:org.apache.beam:pubsublite_read:v1, beam:transform:org.apache.beam:spanner_insert:v1, beam:transform:org.apache.beam:spanner_update:v1, beam:transform:org.apache.beam:spanner_replace:v1, beam:transform:org.apache.beam:spanner_insert_or_update:v1, beam:transform:org.apache.beam:spanner_delete:v1, beam:transform:org.apache.beam:spanner_read:v1, beam:transform:org.apache.beam:kafka_read_with_metadata:v1, beam:transform:org.apache.beam:kafka_read_without_metadata:v1, beam:transform:org.apache.beam:kafka_write:v1, beam:external:java:generate_sequence:v1]
INFO     apache_beam.utils.subprocess_server:subprocess_server.py:126 
INFO     apache_beam.utils.subprocess_server:subprocess_server.py:126 Registered transforms:
INFO     apache_beam.utils.subprocess_server:subprocess_server.py:126 	beam:external:java:sql:v1: org.apache.beam.sdk.expansion.service.ExpansionService$ExternalTransformRegistrarLoader$1@38425407
INFO     apache_beam.utils.subprocess_server:subprocess_server.py:126 	beam:transform:org.apache.beam:pubsub_read:v1: org.apache.beam.sdk.expansion.service.ExpansionService$ExternalTransformRegistrarLoader$1@43bc63a3
INFO     apache_beam.utils.subprocess_server:subprocess_server.py:126 	beam:transform:org.apache.beam:pubsub_write:v1: org.apache.beam.sdk.expansion.service.ExpansionService$ExternalTransformRegistrarLoader$1@702657cc
INFO     apache_beam.utils.subprocess_server:subprocess_server.py:126 	beam:transform:org.apache.beam:pubsublite_write:v1: org.apache.beam.sdk.expansion.service.ExpansionService$ExternalTransformRegistrarLoader$1@6a6cb05c
INFO     apache_beam.utils.subprocess_server:subprocess_server.py:126 	beam:transform:org.apache.beam:pubsublite_read:v1: org.apache.beam.sdk.expansion.service.ExpansionService$ExternalTransformRegistrarLoader$1@40a4337a
INFO     apache_beam.utils.subprocess_server:subprocess_server.py:126 	beam:transform:org.apache.beam:spanner_insert:v1: org.apache.beam.sdk.expansion.service.ExpansionService$ExternalTransformRegistrarLoader$1@6025e1b6
INFO     apache_beam.utils.subprocess_server:subprocess_server.py:126 	beam:transform:org.apache.beam:spanner_update:v1: org.apache.beam.sdk.expansion.service.ExpansionService$ExternalTransformRegistrarLoader$1@22ff4249
INFO     apache_beam.utils.subprocess_server:subprocess_server.py:126 	beam:transform:org.apache.beam:spanner_replace:v1: org.apache.beam.sdk.expansion.service.ExpansionService$ExternalTransformRegistrarLoader$1@2d1ef81a
INFO     apache_beam.utils.subprocess_server:subprocess_server.py:126 	beam:transform:org.apache.beam:spanner_insert_or_update:v1: org.apache.beam.sdk.expansion.service.ExpansionService$ExternalTransformRegistrarLoader$1@4c402120
INFO     apache_beam.utils.subprocess_server:subprocess_server.py:126 	beam:transform:org.apache.beam:spanner_delete:v1: org.apache.beam.sdk.expansion.service.ExpansionService$ExternalTransformRegistrarLoader$1@327514f
INFO     apache_beam.utils.subprocess_server:subprocess_server.py:126 	beam:transform:org.apache.beam:spanner_read:v1: org.apache.beam.sdk.expansion.service.ExpansionService$ExternalTransformRegistrarLoader$1@5b12b668
INFO     apache_beam.utils.subprocess_server:subprocess_server.py:126 	beam:transform:org.apache.beam:kafka_read_with_metadata:v1: org.apache.beam.sdk.expansion.service.ExpansionService$ExternalTransformRegistrarLoader$1@1165b38
INFO     apache_beam.utils.subprocess_server:subprocess_server.py:126 	beam:transform:org.apache.beam:kafka_read_without_metadata:v1: org.apache.beam.sdk.expansion.service.ExpansionService$ExternalTransformRegistrarLoader$1@4c12331b
INFO     apache_beam.utils.subprocess_server:subprocess_server.py:126 	beam:transform:org.apache.beam:kafka_write:v1: org.apache.beam.sdk.expansion.service.ExpansionService$ExternalTransformRegistrarLoader$1@7586beff
INFO     apache_beam.utils.subprocess_server:subprocess_server.py:126 	beam:external:java:generate_sequence:v1: org.apache.beam.sdk.expansion.service.ExpansionService$ExternalTransformRegistrarLoader$1@3b69e7d1
INFO     apache_beam.utils.subprocess_server:subprocess_server.py:126 
INFO     apache_beam.utils.subprocess_server:subprocess_server.py:126 Registered SchemaTransformProviders:
INFO     apache_beam.utils.subprocess_server:subprocess_server.py:126 	beam:schematransform:org.apache.beam:kafka_read:v1
INFO     apache_beam.utils.subprocess_server:subprocess_server.py:126 	beam:schematransform:org.apache.beam:spanner_write:v1
INFO     apache_beam.utils.subprocess_server:subprocess_server.py:126 	beam:transform:org.apache.beam:bigquery_storage_read:v1
INFO     apache_beam.utils.subprocess_server:subprocess_server.py:126 Dec 07, 2022 5:31:10 AM org.apache.beam.sdk.expansion.service.ExpansionService expand
INFO     apache_beam.utils.subprocess_server:subprocess_server.py:126 INFO: Expanding 'SqlTransform(beam:external:java:sql:v1)' with URN 'beam:external:java:sql:v1'
INFO     apache_beam.utils.subprocess_server:subprocess_server.py:126 Dec 07, 2022 5:31:10 AM org.apache.beam.sdk.expansion.service.ExpansionService$ExternalTransformRegistrarLoader payloadToConfig
INFO     apache_beam.utils.subprocess_server:subprocess_server.py:126 WARNING: Configuration class 'org.apache.beam.sdk.extensions.sql.expansion.ExternalSqlTransformRegistrar$Configuration' has no schema registered. Attempting to construct with setter approach.
INFO     apache_beam.utils.subprocess_server:subprocess_server.py:126 Dec 07, 2022 5:31:11 AM org.apache.beam.sdk.expansion.service.ExpansionService$ExternalTransformRegistrarLoader payloadToConfig
INFO     apache_beam.utils.subprocess_server:subprocess_server.py:126 WARNING: Configuration class 'org.apache.beam.sdk.extensions.sql.expansion.ExternalSqlTransformRegistrar$Configuration' has no schema registered. Attempting to construct with setter approach.
INFO     apache_beam.utils.subprocess_server:subprocess_server.py:126 Dec 07, 2022 5:31:12 AM org.apache.beam.sdk.extensions.sql.impl.CalciteQueryPlanner convertToBeamRel
INFO     apache_beam.utils.subprocess_server:subprocess_server.py:126 INFO: SQL:
INFO     apache_beam.utils.subprocess_server:subprocess_server.py:126 SELECT `simple`.`id` AS `id`, `enrich`.`metadata` AS `metadata`
INFO     apache_beam.utils.subprocess_server:subprocess_server.py:126 FROM `beam`.`simple` AS `simple`
INFO     apache_beam.utils.subprocess_server:subprocess_server.py:126 INNER JOIN `beam`.`enrich` AS `enrich` ON `simple`.`id` = `enrich`.`id`
INFO     apache_beam.utils.subprocess_server:subprocess_server.py:126 Dec 07, 2022 5:31:13 AM org.apache.beam.sdk.extensions.sql.impl.CalciteQueryPlanner convertToBeamRel
INFO     apache_beam.utils.subprocess_server:subprocess_server.py:126 INFO: SQLPlan>
INFO     apache_beam.utils.subprocess_server:subprocess_server.py:126 LogicalProject(id=[$0], metadata=[$4])
INFO     apache_beam.utils.subprocess_server:subprocess_server.py:126   LogicalJoin(condition=[=($0, $3)], joinType=[inner])
INFO     apache_beam.utils.subprocess_server:subprocess_server.py:126     BeamIOSourceRel(table=[[beam, simple]])
INFO     apache_beam.utils.subprocess_server:subprocess_server.py:126     BeamIOSourceRel(table=[[beam, enrich]])
INFO     apache_beam.utils.subprocess_server:subprocess_server.py:126 
INFO     apache_beam.utils.subprocess_server:subprocess_server.py:126 Dec 07, 2022 5:31:13 AM org.apache.beam.sdk.extensions.sql.impl.CalciteQueryPlanner convertToBeamRel
INFO     apache_beam.utils.subprocess_server:subprocess_server.py:126 INFO: BEAMPlan>
INFO     apache_beam.utils.subprocess_server:subprocess_server.py:126 BeamCalcRel(expr#0..4=[{inputs}], id=[$t0], metadata=[$t4])
INFO     apache_beam.utils.subprocess_server:subprocess_server.py:126   BeamCoGBKJoinRel(condition=[=($0, $3)], joinType=[inner])
INFO     apache_beam.utils.subprocess_server:subprocess_server.py:126     BeamIOSourceRel(table=[[beam, simple]])
INFO     apache_beam.utils.subprocess_server:subprocess_server.py:126     BeamIOSourceRel(table=[[beam, enrich]])
INFO     apache_beam.utils.subprocess_server:subprocess_server.py:126 
INFO     root:environments.py:376 Default Python SDK image for environment is apache/beam_python3.10_sdk:2.45.0.dev
INFO     root:environments.py:299 No image given, using default Python SDK image
INFO     root:environments.py:376 Default Python SDK image for environment is apache/beam_python3.10_sdk:2.45.0.dev
INFO     root:environments.py:302 Python SDK container image set to "apache/beam_python3.10_sdk:2.45.0.dev" for Docker environment
INFO     apache_beam.runners.portability.fn_api_runner.translations:translations.py:710 ==================== <function pack_combiners at 0x7fca39b8a5f0> ====================
INFO     apache_beam.runners.portability.fn_api_runner.translations:translations.py:710 ==================== <function lift_combiners at 0x7fca39b8a680> ====================
INFO     apache_beam.runners.portability.fn_api_runner.translations:translations.py:710 ==================== <function sort_stages at 0x7fca39b8add0> ====================
INFO     apache_beam.runners.portability.portable_runner:portable_runner.py:581 Job state changed to STOPPED
INFO     apache_beam.runners.portability.portable_runner:portable_runner.py:581 Job state changed to STARTING
INFO     apache_beam.runners.portability.portable_runner:portable_runner.py:581 Job state changed to RUNNING
INFO     apache_beam.runners.portability.portable_runner:portable_runner.py:581 Job state changed to DONE
PASSED                                                                   [ 77%]
apache_beam/transforms/sql_test.py::SqlTransformTest::test_windowing_before_sql 
-------------------------------- live log call ---------------------------------
INFO     apache_beam.utils.subprocess_server:subprocess_server.py:239 Using pre-built snapshot at <https://ci-beam.apache.org/job/beam_PostCommit_XVR_Flink/ws/src/sdks/java/extensions/sql/expansion-service/build/libs/beam-sdks-java-extensions-sql-expansion-service-2.45.0-SNAPSHOT.jar>
INFO     root:external.py:847 Starting a JAR-based expansion service from JAR <https://ci-beam.apache.org/job/beam_PostCommit_XVR_Flink/ws/src/sdks/java/extensions/sql/expansion-service/build/libs/beam-sdks-java-extensions-sql-expansion-service-2.45.0-SNAPSHOT.jar> 
INFO     apache_beam.utils.subprocess_server:subprocess_server.py:116 Starting service with ['java' '-jar' '<https://ci-beam.apache.org/job/beam_PostCommit_XVR_Flink/ws/src/sdks/java/extensions/sql/expansion-service/build/libs/beam-sdks-java-extensions-sql-expansion-service-2.45.0-SNAPSHOT.jar'> '55797' '--filesToStage=<https://ci-beam.apache.org/job/beam_PostCommit_XVR_Flink/ws/src/sdks/java/extensions/sql/expansion-service/build/libs/beam-sdks-java-extensions-sql-expansion-service-2.45.0-SNAPSHOT.jar']>
INFO     apache_beam.utils.subprocess_server:subprocess_server.py:126 Starting expansion service at localhost:55797
INFO     apache_beam.utils.subprocess_server:subprocess_server.py:126 Dec 07, 2022 5:31:34 AM org.apache.beam.sdk.expansion.service.ExpansionService loadRegisteredTransforms
INFO     apache_beam.utils.subprocess_server:subprocess_server.py:126 INFO: Registering external transforms: [beam:external:java:sql:v1, beam:transform:org.apache.beam:pubsub_read:v1, beam:transform:org.apache.beam:pubsub_write:v1, beam:transform:org.apache.beam:pubsublite_write:v1, beam:transform:org.apache.beam:pubsublite_read:v1, beam:transform:org.apache.beam:spanner_insert:v1, beam:transform:org.apache.beam:spanner_update:v1, beam:transform:org.apache.beam:spanner_replace:v1, beam:transform:org.apache.beam:spanner_insert_or_update:v1, beam:transform:org.apache.beam:spanner_delete:v1, beam:transform:org.apache.beam:spanner_read:v1, beam:transform:org.apache.beam:kafka_read_with_metadata:v1, beam:transform:org.apache.beam:kafka_read_without_metadata:v1, beam:transform:org.apache.beam:kafka_write:v1, beam:external:java:generate_sequence:v1]
INFO     apache_beam.utils.subprocess_server:subprocess_server.py:126 
INFO     apache_beam.utils.subprocess_server:subprocess_server.py:126 Registered transforms:
INFO     apache_beam.utils.subprocess_server:subprocess_server.py:126 	beam:external:java:sql:v1: org.apache.beam.sdk.expansion.service.ExpansionService$ExternalTransformRegistrarLoader$1@38425407
INFO     apache_beam.utils.subprocess_server:subprocess_server.py:126 	beam:transform:org.apache.beam:pubsub_read:v1: org.apache.beam.sdk.expansion.service.ExpansionService$ExternalTransformRegistrarLoader$1@43bc63a3
INFO     apache_beam.utils.subprocess_server:subprocess_server.py:126 	beam:transform:org.apache.beam:pubsub_write:v1: org.apache.beam.sdk.expansion.service.ExpansionService$ExternalTransformRegistrarLoader$1@702657cc
INFO     apache_beam.utils.subprocess_server:subprocess_server.py:126 	beam:transform:org.apache.beam:pubsublite_write:v1: org.apache.beam.sdk.expansion.service.ExpansionService$ExternalTransformRegistrarLoader$1@6a6cb05c
INFO     apache_beam.utils.subprocess_server:subprocess_server.py:126 	beam:transform:org.apache.beam:pubsublite_read:v1: org.apache.beam.sdk.expansion.service.ExpansionService$ExternalTransformRegistrarLoader$1@40a4337a
INFO     apache_beam.utils.subprocess_server:subprocess_server.py:126 	beam:transform:org.apache.beam:spanner_insert:v1: org.apache.beam.sdk.expansion.service.ExpansionService$ExternalTransformRegistrarLoader$1@6025e1b6
INFO     apache_beam.utils.subprocess_server:subprocess_server.py:126 	beam:transform:org.apache.beam:spanner_update:v1: org.apache.beam.sdk.expansion.service.ExpansionService$ExternalTransformRegistrarLoader$1@22ff4249
INFO     apache_beam.utils.subprocess_server:subprocess_server.py:126 	beam:transform:org.apache.beam:spanner_replace:v1: org.apache.beam.sdk.expansion.service.ExpansionService$ExternalTransformRegistrarLoader$1@2d1ef81a
INFO     apache_beam.utils.subprocess_server:subprocess_server.py:126 	beam:transform:org.apache.beam:spanner_insert_or_update:v1: org.apache.beam.sdk.expansion.service.ExpansionService$ExternalTransformRegistrarLoader$1@4c402120
INFO     apache_beam.utils.subprocess_server:subprocess_server.py:126 	beam:transform:org.apache.beam:spanner_delete:v1: org.apache.beam.sdk.expansion.service.ExpansionService$ExternalTransformRegistrarLoader$1@327514f
INFO     apache_beam.utils.subprocess_server:subprocess_server.py:126 	beam:transform:org.apache.beam:spanner_read:v1: org.apache.beam.sdk.expansion.service.ExpansionService$ExternalTransformRegistrarLoader$1@5b12b668
INFO     apache_beam.utils.subprocess_server:subprocess_server.py:126 	beam:transform:org.apache.beam:kafka_read_with_metadata:v1: org.apache.beam.sdk.expansion.service.ExpansionService$ExternalTransformRegistrarLoader$1@1165b38
INFO     apache_beam.utils.subprocess_server:subprocess_server.py:126 	beam:transform:org.apache.beam:kafka_read_without_metadata:v1: org.apache.beam.sdk.expansion.service.ExpansionService$ExternalTransformRegistrarLoader$1@4c12331b
INFO     apache_beam.utils.subprocess_server:subprocess_server.py:126 	beam:transform:org.apache.beam:kafka_write:v1: org.apache.beam.sdk.expansion.service.ExpansionService$ExternalTransformRegistrarLoader$1@7586beff
INFO     apache_beam.utils.subprocess_server:subprocess_server.py:126 	beam:external:java:generate_sequence:v1: org.apache.beam.sdk.expansion.service.ExpansionService$ExternalTransformRegistrarLoader$1@3b69e7d1
INFO     apache_beam.utils.subprocess_server:subprocess_server.py:126 
INFO     apache_beam.utils.subprocess_server:subprocess_server.py:126 Registered SchemaTransformProviders:
INFO     apache_beam.utils.subprocess_server:subprocess_server.py:126 	beam:schematransform:org.apache.beam:kafka_read:v1
INFO     apache_beam.utils.subprocess_server:subprocess_server.py:126 	beam:schematransform:org.apache.beam:spanner_write:v1
INFO     apache_beam.utils.subprocess_server:subprocess_server.py:126 	beam:transform:org.apache.beam:bigquery_storage_read:v1
INFO     apache_beam.utils.subprocess_server:subprocess_server.py:126 Dec 07, 2022 5:31:35 AM org.apache.beam.sdk.expansion.service.ExpansionService expand
INFO     apache_beam.utils.subprocess_server:subprocess_server.py:126 INFO: Expanding 'SqlTransform(beam:external:java:sql:v1)' with URN 'beam:external:java:sql:v1'
INFO     apache_beam.utils.subprocess_server:subprocess_server.py:126 Dec 07, 2022 5:31:35 AM org.apache.beam.sdk.expansion.service.ExpansionService$ExternalTransformRegistrarLoader payloadToConfig
INFO     apache_beam.utils.subprocess_server:subprocess_server.py:126 WARNING: Configuration class 'org.apache.beam.sdk.extensions.sql.expansion.ExternalSqlTransformRegistrar$Configuration' has no schema registered. Attempting to construct with setter approach.
INFO     apache_beam.utils.subprocess_server:subprocess_server.py:126 Dec 07, 2022 5:31:36 AM org.apache.beam.sdk.expansion.service.ExpansionService$ExternalTransformRegistrarLoader payloadToConfig
INFO     apache_beam.utils.subprocess_server:subprocess_server.py:126 WARNING: Configuration class 'org.apache.beam.sdk.extensions.sql.expansion.ExternalSqlTransformRegistrar$Configuration' has no schema registered. Attempting to construct with setter approach.
INFO     apache_beam.utils.subprocess_server:subprocess_server.py:126 Dec 07, 2022 5:31:37 AM org.apache.beam.sdk.extensions.sql.impl.CalciteQueryPlanner convertToBeamRel
INFO     apache_beam.utils.subprocess_server:subprocess_server.py:126 INFO: SQL:
INFO     apache_beam.utils.subprocess_server:subprocess_server.py:126 SELECT COUNT(*) AS `count`
INFO     apache_beam.utils.subprocess_server:subprocess_server.py:126 FROM `beam`.`PCOLLECTION` AS `PCOLLECTION`
INFO     apache_beam.utils.subprocess_server:subprocess_server.py:126 Dec 07, 2022 5:31:38 AM org.apache.beam.sdk.extensions.sql.impl.CalciteQueryPlanner convertToBeamRel
INFO     apache_beam.utils.subprocess_server:subprocess_server.py:126 INFO: SQLPlan>
INFO     apache_beam.utils.subprocess_server:subprocess_server.py:126 LogicalAggregate(group=[{}], count=[COUNT()])
INFO     apache_beam.utils.subprocess_server:subprocess_server.py:126   BeamIOSourceRel(table=[[beam, PCOLLECTION]])
INFO     apache_beam.utils.subprocess_server:subprocess_server.py:126 
INFO     apache_beam.utils.subprocess_server:subprocess_server.py:126 Dec 07, 2022 5:31:38 AM org.apache.beam.sdk.extensions.sql.impl.CalciteQueryPlanner convertToBeamRel
INFO     apache_beam.utils.subprocess_server:subprocess_server.py:126 INFO: BEAMPlan>
INFO     apache_beam.utils.subprocess_server:subprocess_server.py:126 BeamAggregationRel(group=[{}], count=[COUNT()])
INFO     apache_beam.utils.subprocess_server:subprocess_server.py:126   BeamIOSourceRel(table=[[beam, PCOLLECTION]])
INFO     apache_beam.utils.subprocess_server:subprocess_server.py:126 
INFO     root:environments.py:376 Default Python SDK image for environment is apache/beam_python3.10_sdk:2.45.0.dev
INFO     root:environments.py:299 No image given, using default Python SDK image
INFO     root:environments.py:376 Default Python SDK image for environment is apache/beam_python3.10_sdk:2.45.0.dev
INFO     root:environments.py:302 Python SDK container image set to "apache/beam_python3.10_sdk:2.45.0.dev" for Docker environment
INFO     apache_beam.runners.portability.fn_api_runner.translations:translations.py:710 ==================== <function pack_combiners at 0x7fca39b8a5f0> ====================
INFO     apache_beam.runners.portability.fn_api_runner.translations:translations.py:710 ==================== <function lift_combiners at 0x7fca39b8a680> ====================
INFO     apache_beam.runners.portability.fn_api_runner.translations:translations.py:710 ==================== <function sort_stages at 0x7fca39b8add0> ====================
INFO     apache_beam.runners.portability.portable_runner:portable_runner.py:581 Job state changed to STOPPED
INFO     apache_beam.runners.portability.portable_runner:portable_runner.py:581 Job state changed to STARTING
INFO     apache_beam.runners.portability.portable_runner:portable_runner.py:581 Job state changed to RUNNING
INFO     apache_beam.runners.portability.portable_runner:portable_runner.py:581 Job state changed to DONE
PASSED                                                                   [ 88%]
apache_beam/transforms/sql_test.py::SqlTransformTest::test_zetasql_generate_data 
-------------------------------- live log call ---------------------------------
INFO     apache_beam.utils.subprocess_server:subprocess_server.py:239 Using pre-built snapshot at <https://ci-beam.apache.org/job/beam_PostCommit_XVR_Flink/ws/src/sdks/java/extensions/sql/expansion-service/build/libs/beam-sdks-java-extensions-sql-expansion-service-2.45.0-SNAPSHOT.jar>
INFO     root:external.py:847 Starting a JAR-based expansion service from JAR <https://ci-beam.apache.org/job/beam_PostCommit_XVR_Flink/ws/src/sdks/java/extensions/sql/expansion-service/build/libs/beam-sdks-java-extensions-sql-expansion-service-2.45.0-SNAPSHOT.jar> 
INFO     apache_beam.utils.subprocess_server:subprocess_server.py:116 Starting service with ['java' '-jar' '<https://ci-beam.apache.org/job/beam_PostCommit_XVR_Flink/ws/src/sdks/java/extensions/sql/expansion-service/build/libs/beam-sdks-java-extensions-sql-expansion-service-2.45.0-SNAPSHOT.jar'> '33251' '--filesToStage=<https://ci-beam.apache.org/job/beam_PostCommit_XVR_Flink/ws/src/sdks/java/extensions/sql/expansion-service/build/libs/beam-sdks-java-extensions-sql-expansion-service-2.45.0-SNAPSHOT.jar']>
INFO     apache_beam.utils.subprocess_server:subprocess_server.py:126 Starting expansion service at localhost:33251
INFO     apache_beam.utils.subprocess_server:subprocess_server.py:126 Dec 07, 2022 5:31:59 AM org.apache.beam.sdk.expansion.service.ExpansionService loadRegisteredTransforms
INFO     apache_beam.utils.subprocess_server:subprocess_server.py:126 INFO: Registering external transforms: [beam:external:java:sql:v1, beam:transform:org.apache.beam:pubsub_read:v1, beam:transform:org.apache.beam:pubsub_write:v1, beam:transform:org.apache.beam:pubsublite_write:v1, beam:transform:org.apache.beam:pubsublite_read:v1, beam:transform:org.apache.beam:spanner_insert:v1, beam:transform:org.apache.beam:spanner_update:v1, beam:transform:org.apache.beam:spanner_replace:v1, beam:transform:org.apache.beam:spanner_insert_or_update:v1, beam:transform:org.apache.beam:spanner_delete:v1, beam:transform:org.apache.beam:spanner_read:v1, beam:transform:org.apache.beam:kafka_read_with_metadata:v1, beam:transform:org.apache.beam:kafka_read_without_metadata:v1, beam:transform:org.apache.beam:kafka_write:v1, beam:external:java:generate_sequence:v1]
INFO     apache_beam.utils.subprocess_server:subprocess_server.py:126 
INFO     apache_beam.utils.subprocess_server:subprocess_server.py:126 Registered transforms:
INFO     apache_beam.utils.subprocess_server:subprocess_server.py:126 	beam:external:java:sql:v1: org.apache.beam.sdk.expansion.service.ExpansionService$ExternalTransformRegistrarLoader$1@38425407
INFO     apache_beam.utils.subprocess_server:subprocess_server.py:126 	beam:transform:org.apache.beam:pubsub_read:v1: org.apache.beam.sdk.expansion.service.ExpansionService$ExternalTransformRegistrarLoader$1@43bc63a3
INFO     apache_beam.utils.subprocess_server:subprocess_server.py:126 	beam:transform:org.apache.beam:pubsub_write:v1: org.apache.beam.sdk.expansion.service.ExpansionService$ExternalTransformRegistrarLoader$1@702657cc
INFO     apache_beam.utils.subprocess_server:subprocess_server.py:126 	beam:transform:org.apache.beam:pubsublite_write:v1: org.apache.beam.sdk.expansion.service.ExpansionService$ExternalTransformRegistrarLoader$1@6a6cb05c
INFO     apache_beam.utils.subprocess_server:subprocess_server.py:126 	beam:transform:org.apache.beam:pubsublite_read:v1: org.apache.beam.sdk.expansion.service.ExpansionService$ExternalTransformRegistrarLoader$1@40a4337a
INFO     apache_beam.utils.subprocess_server:subprocess_server.py:126 	beam:transform:org.apache.beam:spanner_insert:v1: org.apache.beam.sdk.expansion.service.ExpansionService$ExternalTransformRegistrarLoader$1@6025e1b6
INFO     apache_beam.utils.subprocess_server:subprocess_server.py:126 	beam:transform:org.apache.beam:spanner_update:v1: org.apache.beam.sdk.expansion.service.ExpansionService$ExternalTransformRegistrarLoader$1@22ff4249
INFO     apache_beam.utils.subprocess_server:subprocess_server.py:126 	beam:transform:org.apache.beam:spanner_replace:v1: org.apache.beam.sdk.expansion.service.ExpansionService$ExternalTransformRegistrarLoader$1@2d1ef81a
INFO     apache_beam.utils.subprocess_server:subprocess_server.py:126 	beam:transform:org.apache.beam:spanner_insert_or_update:v1: org.apache.beam.sdk.expansion.service.ExpansionService$ExternalTransformRegistrarLoader$1@4c402120
INFO     apache_beam.utils.subprocess_server:subprocess_server.py:126 	beam:transform:org.apache.beam:spanner_delete:v1: org.apache.beam.sdk.expansion.service.ExpansionService$ExternalTransformRegistrarLoader$1@327514f
INFO     apache_beam.utils.subprocess_server:subprocess_server.py:126 	beam:transform:org.apache.beam:spanner_read:v1: org.apache.beam.sdk.expansion.service.ExpansionService$ExternalTransformRegistrarLoader$1@5b12b668
INFO     apache_beam.utils.subprocess_server:subprocess_server.py:126 	beam:transform:org.apache.beam:kafka_read_with_metadata:v1: org.apache.beam.sdk.expansion.service.ExpansionService$ExternalTransformRegistrarLoader$1@1165b38
INFO     apache_beam.utils.subprocess_server:subprocess_server.py:126 	beam:transform:org.apache.beam:kafka_read_without_metadata:v1: org.apache.beam.sdk.expansion.service.ExpansionService$ExternalTransformRegistrarLoader$1@4c12331b
INFO     apache_beam.utils.subprocess_server:subprocess_server.py:126 	beam:transform:org.apache.beam:kafka_write:v1: org.apache.beam.sdk.expansion.service.ExpansionService$ExternalTransformRegistrarLoader$1@7586beff
INFO     apache_beam.utils.subprocess_server:subprocess_server.py:126 	beam:external:java:generate_sequence:v1: org.apache.beam.sdk.expansion.service.ExpansionService$ExternalTransformRegistrarLoader$1@3b69e7d1
INFO     apache_beam.utils.subprocess_server:subprocess_server.py:126 
INFO     apache_beam.utils.subprocess_server:subprocess_server.py:126 Registered SchemaTransformProviders:
INFO     apache_beam.utils.subprocess_server:subprocess_server.py:126 	beam:schematransform:org.apache.beam:kafka_read:v1
INFO     apache_beam.utils.subprocess_server:subprocess_server.py:126 	beam:schematransform:org.apache.beam:spanner_write:v1
INFO     apache_beam.utils.subprocess_server:subprocess_server.py:126 	beam:transform:org.apache.beam:bigquery_storage_read:v1
INFO     apache_beam.utils.subprocess_server:subprocess_server.py:126 Dec 07, 2022 5:32:00 AM org.apache.beam.sdk.expansion.service.ExpansionService expand
INFO     apache_beam.utils.subprocess_server:subprocess_server.py:126 INFO: Expanding 'SqlTransform(beam:external:java:sql:v1)' with URN 'beam:external:java:sql:v1'
INFO     apache_beam.utils.subprocess_server:subprocess_server.py:126 Dec 07, 2022 5:32:00 AM org.apache.beam.sdk.expansion.service.ExpansionService$ExternalTransformRegistrarLoader payloadToConfig
INFO     apache_beam.utils.subprocess_server:subprocess_server.py:126 WARNING: Configuration class 'org.apache.beam.sdk.extensions.sql.expansion.ExternalSqlTransformRegistrar$Configuration' has no schema registered. Attempting to construct with setter approach.
INFO     apache_beam.utils.subprocess_server:subprocess_server.py:126 Dec 07, 2022 5:32:00 AM org.apache.beam.sdk.expansion.service.ExpansionService$ExternalTransformRegistrarLoader payloadToConfig
INFO     apache_beam.utils.subprocess_server:subprocess_server.py:126 WARNING: Configuration class 'org.apache.beam.sdk.extensions.sql.expansion.ExternalSqlTransformRegistrar$Configuration' has no schema registered. Attempting to construct with setter approach.
INFO     apache_beam.utils.subprocess_server:subprocess_server.py:126 Dec 07, 2022 5:32:03 AM com.google.zetasql.io.grpc.NameResolverRegistry getDefaultRegistry
INFO     apache_beam.utils.subprocess_server:subprocess_server.py:126 WARNING: No NameResolverProviders found via ServiceLoader, including for DNS. This is probably due to a broken build. If using ProGuard, check your configuration
INFO     apache_beam.utils.subprocess_server:subprocess_server.py:126 Dec 07, 2022 5:32:04 AM org.apache.beam.sdk.extensions.sql.zetasql.ZetaSQLQueryPlanner convertToBeamRelInternal
INFO     apache_beam.utils.subprocess_server:subprocess_server.py:126 INFO: BEAMPlan>
INFO     apache_beam.utils.subprocess_server:subprocess_server.py:126 BeamZetaSqlCalcRel(expr#0=[{inputs}], expr#1=[1:BIGINT], expr#2=['foo':VARCHAR], expr#3=[3.1400000000000001243E0:DOUBLE], int=[$t1], str=[$t2], flt=[$t3])
INFO     apache_beam.utils.subprocess_server:subprocess_server.py:126   BeamValuesRel(tuples=[[{ 0 }]])
INFO     apache_beam.utils.subprocess_server:subprocess_server.py:126 
INFO     root:environments.py:376 Default Python SDK image for environment is apache/beam_python3.10_sdk:2.45.0.dev
INFO     root:environments.py:299 No image given, using default Python SDK image
INFO     root:environments.py:376 Default Python SDK image for environment is apache/beam_python3.10_sdk:2.45.0.dev
INFO     root:environments.py:302 Python SDK container image set to "apache/beam_python3.10_sdk:2.45.0.dev" for Docker environment
INFO     apache_beam.runners.portability.fn_api_runner.translations:translations.py:710 ==================== <function pack_combiners at 0x7fca39b8a5f0> ====================
INFO     apache_beam.runners.portability.fn_api_runner.translations:translations.py:710 ==================== <function lift_combiners at 0x7fca39b8a680> ====================
INFO     apache_beam.runners.portability.fn_api_runner.translations:translations.py:710 ==================== <function sort_stages at 0x7fca39b8add0> ====================
INFO     apache_beam.runners.portability.portable_runner:portable_runner.py:581 Job state changed to STOPPED
INFO     apache_beam.runners.portability.portable_runner:portable_runner.py:581 Job state changed to STARTING
INFO     apache_beam.runners.portability.portable_runner:portable_runner.py:581 Job state changed to RUNNING
INFO     apache_beam.runners.portability.portable_runner:portable_runner.py:581 Job state changed to DONE
PASSED                                                                   [100%]

=============================== warnings summary ===============================
../../build/gradleenv/1922375555/lib/python3.10/site-packages/hdfs/config.py:15
  <https://ci-beam.apache.org/job/beam_PostCommit_XVR_Flink/ws/src/build/gradleenv/1922375555/lib/python3.10/site-packages/hdfs/config.py>:15: DeprecationWarning: the imp module is deprecated in favour of importlib and slated for removal in Python 3.12; see the module's documentation for alternative uses
    from imp import load_source

../../build/gradleenv/1922375555/lib/python3.10/site-packages/google/api_core/operations_v1/abstract_operations_client.py:17
  <https://ci-beam.apache.org/job/beam_PostCommit_XVR_Flink/ws/src/build/gradleenv/1922375555/lib/python3.10/site-packages/google/api_core/operations_v1/abstract_operations_client.py>:17: DeprecationWarning: The distutils package is deprecated and slated for removal in Python 3.12. Use setuptools or check PEP 632 for potential alternatives
    from distutils import util

../../build/gradleenv/1922375555/lib/python3.10/site-packages/tenacity/_asyncio.py:42
  <https://ci-beam.apache.org/job/beam_PostCommit_XVR_Flink/ws/src/build/gradleenv/1922375555/lib/python3.10/site-packages/tenacity/_asyncio.py>:42: DeprecationWarning: "@coroutine" decorator is deprecated since Python 3.8, use "async def" instead
    def call(self, fn, *args, **kwargs):

apache_beam/typehints/pandas_type_compatibility_test.py:67
  <https://ci-beam.apache.org/job/beam_PostCommit_XVR_Flink/ws/src/sdks/python/apache_beam/typehints/pandas_type_compatibility_test.py>:67: FutureWarning: pandas.Int64Index is deprecated and will be removed from pandas in a future version. Use pandas.Index with the appropriate dtype instead.
    }).set_index(pd.Int64Index(range(123, 223), name='an_index')),

apache_beam/typehints/pandas_type_compatibility_test.py:90
  <https://ci-beam.apache.org/job/beam_PostCommit_XVR_Flink/ws/src/sdks/python/apache_beam/typehints/pandas_type_compatibility_test.py>:90: FutureWarning: pandas.Int64Index is deprecated and will be removed from pandas in a future version. Use pandas.Index with the appropriate dtype instead.
    pd.Int64Index(range(123, 223), name='an_index'),

apache_beam/typehints/pandas_type_compatibility_test.py:91
  <https://ci-beam.apache.org/job/beam_PostCommit_XVR_Flink/ws/src/sdks/python/apache_beam/typehints/pandas_type_compatibility_test.py>:91: FutureWarning: pandas.Int64Index is deprecated and will be removed from pandas in a future version. Use pandas.Index with the appropriate dtype instead.
    pd.Int64Index(range(475, 575), name='another_index'),

-- Docs: https://docs.pytest.org/en/stable/how-to/capture-warnings.html
- generated xml file: <https://ci-beam.apache.org/job/beam_PostCommit_XVR_Flink/ws/src/sdks/python/pytest_xlangSqlValidateRunner.xml> -
==== 9 passed, 5 skipped, 6774 deselected, 6 warnings in 236.90s (0:03:56) =====

> Task :runners:flink:1.15:job-server:flinkJobServerCleanup
Stopping job server pid: 3955910.

> Task :runners:flink:1.15:job-server:validatesCrossLanguageRunnerCleanup
Stopping expansion service pid: 3968040.
Stopping expansion service pid: 3968041.

FAILURE: Build failed with an exception.

* What went wrong:
Execution failed for task ':runners:flink:1.15:job-server:validatesCrossLanguageRunnerJavaUsingPython'.
> There were failing tests. See the report at: file://<https://ci-beam.apache.org/job/beam_PostCommit_XVR_Flink/ws/src/runners/flink/1.15/job-server/build/reports/tests/validatesCrossLanguageRunnerJavaUsingPython/index.html>

* Try:
> Run with --stacktrace option to get the stack trace.
> Run with --info or --debug option to get more log output.

* Get more help at https://help.gradle.org

Deprecated Gradle features were used in this build, making it incompatible with Gradle 8.0.

You can use '--warning-mode all' to show the individual deprecation warnings and determine if they come from your own scripts or plugins.

See https://docs.gradle.org/7.5.1/userguide/command_line_interface.html#sec:command_line_warnings

Execution optimizations have been disabled for 1 invalid unit(s) of work during this build to ensure correctness.
Please consult deprecation warnings for more details.

BUILD FAILED in 32m 7s
255 actionable tasks: 32 executed, 223 up-to-date

Publishing build scan...
https://gradle.com/s/iojh7grkxrw3q

Build step 'Invoke Gradle script' changed build result to FAILURE
Build step 'Invoke Gradle script' marked build as failure

---------------------------------------------------------------------
To unsubscribe, e-mail: builds-unsubscribe@beam.apache.org
For additional commands, e-mail: builds-help@beam.apache.org


Build failed in Jenkins: beam_PostCommit_XVR_Flink #6221

Posted by Apache Jenkins Server <je...@builds.apache.org>.
See <https://ci-beam.apache.org/job/beam_PostCommit_XVR_Flink/6221/display/redirect?page=changes>

Changes:

[noreply] Precommit python version update (#24526)

[noreply] [CdapIO] Add CdapIO and SparkReceiverIO documentation in website

[relax] fix null pointer exception caused by clearing member variable

[noreply] Adding support for Pubsub Lite Writes in SchemaTransforms (#24359)

[noreply] Disallow using the JRH with Python streaming pipelines (#24513)

[noreply] Add RunInference example for TensorFlow Hub pre-trained model (#24529)

[noreply] update(PULL Request template) remove Choose reviewer (#24540)

[noreply] Revert "Bump actions/setup-java from 3.6.0 to 3.7.0 (#24484)" (#24551)

[noreply] Interface{}->any for more subfolders (#24553)


------------------------------------------
[...truncated 668.66 KB...]
      >
    >
  >
  coders: <
    key: "OgbPEqFjkUVarIntCoder"
    value: <
      spec: <
        urn: "beam:coders:javasdk:0.1"
        payload: "\202SNAPPY\000\000\000\000\001\000\000\000\001\000\000\000\210\330\001\350\254\355\000\005sr\000&org.apache.beam.sdk.coders.VarIntCoder\300K2\332\251KVh\002\000\000xrr5\000\024Atomic\0055 \307\354\265\314\205tPF\002\0055\000*jj\000$Structured\0059\034s\277\022\016\325\3246\021\t9\000 j9\000\005/0C\335\325\211\256\274~\370\002\000\000xp"
      >
    >
  >
  coders: <
    key: "OgbPEqFjkUVoidCoder"
    value: <
      spec: <
        urn: "beam:coders:javasdk:0.1"
        payload: "\202SNAPPY\000\000\000\000\001\000\000\000\001\000\000\000\210\326\001\350\254\355\000\005sr\000$org.apache.beam.sdk.coders.VoidCoder\271\277U\233\350\r\257U\002\000\000xr\000&j3\000\024Atomic\0055 \307\354\265\314\205tPF\002\0055\000*j5\000$Structured\0059\034s\277\022\016\325\3246\021\t9\000 j9\000\005/0C\335\325\211\256\274~\370\002\000\000xp"
      >
    >
  >
  coders: <
    key: "c0"
    value: <
      spec: <
        urn: "beam:coder:bytes:v1"
      >
    >
  >
  coders: <
    key: "c1"
    value: <
      spec: <
        urn: "beam:coder:global_window:v1"
      >
    >
  >
  coders: <
    key: "c2"
    value: <
      spec: <
        urn: "beam:coder:row:v1"
        payload: "\n\r\n\007role_id\032\002\020\003\022$abc5e222-ab8f-4f6f-800a-a58bb0f45675"
      >
    >
  >
  environments: <
    key: "OgbPEqFjkUbeam:env:docker:v1"
    value: <
      urn: "beam:env:docker:v1"
      payload: "\n apache/beam_java8_sdk:2.45.0.dev"
      capabilities: "beam:coder:bytes:v1"
      capabilities: "beam:coder:bool:v1"
      capabilities: "beam:coder:varint:v1"
      capabilities: "beam:coder:string_utf8:v1"
      capabilities: "beam:coder:iterable:v1"
      capabilities: "beam:coder:timer:v1"
      capabilities: "beam:coder:kv:v1"
      capabilities: "beam:coder:length_prefix:v1"
      capabilities: "beam:coder:global_window:v1"
      capabilities: "beam:coder:interval_window:v1"
      capabilities: "beam:coder:custom_window:v1"
      capabilities: "beam:coder:windowed_value:v1"
      capabilities: "beam:coder:double:v1"
      capabilities: "beam:coder:row:v1"
      capabilities: "beam:coder:param_windowed_value:v1"
      capabilities: "beam:coder:state_backed_iterable:v1"
      capabilities: "beam:coder:sharded_key:v1"
      capabilities: "beam:coder:nullable:v1"
      capabilities: "beam:protocol:multi_core_bundle_processing:v1"
      capabilities: "beam:protocol:progress_reporting:v1"
      capabilities: "beam:protocol:harness_monitoring_infos:v1"
      capabilities: "beam:protocol:control_request_elements_embedding:v1"
      capabilities: "beam:protocol:state_caching:v1"
      capabilities: "beam:version:sdk_base:apache/beam_java8_sdk:2.45.0.dev"
      capabilities: "beam:transform:sdf_truncate_sized_restrictions:v1"
      capabilities: "beam:transform:to_string:v1"
      dependencies: <
        type_urn: "beam:artifact:type:file:v1"
        type_payload: "\nL/tmp/artifacts/icedtea-sound-5xFkOD7aUmX8Jiw7lPqhn75zkNGCyUOfOuqi2rClWKM.jar\022@e71164383eda5265fc262c3b94faa19fbe7390d182c9439f3aeaa2dab0a558a3"
        role_urn: "beam:artifact:role:staging_to:v1"
        role_payload: "\n=icedtea-sound-5xFkOD7aUmX8Jiw7lPqhn75zkNGCyUOfOuqi2rClWKM.jar"
      >
      dependencies: <
        type_urn: "beam:artifact:type:file:v1"
        type_payload: "\nF/tmp/artifacts/jaccess-Rlp7GfuSFOBCBGdO8af2XxrTz5LqaQqwSMAXumdbHN0.jar\022@465a7b19fb9214e04204674ef1a7f65f1ad3cf92ea690ab048c017ba675b1cdd"
        role_urn: "beam:artifact:role:staging_to:v1"
        role_payload: "\n7jaccess-Rlp7GfuSFOBCBGdO8af2XxrTz5LqaQqwSMAXumdbHN0.jar"
      >
      dependencies: <
        type_urn: "beam:artifact:type:file:v1"
        type_payload: "\nI/tmp/artifacts/localedata-Nuzln2shadVmT-PppqaNc7GHBbUyMUb9pXsJTjRiAzs.jar\022@36ece59f6b2169d5664fe3e9a6a68d73b18705b5323146fda57b094e3462033b"
        role_urn: "beam:artifact:role:staging_to:v1"
        role_payload: "\n:localedata-Nuzln2shadVmT-PppqaNc7GHBbUyMUb9pXsJTjRiAzs.jar"
      >
      dependencies: <
        type_urn: "beam:artifact:type:file:v1"
        type_payload: "\nF/tmp/artifacts/nashorn-1iQRhJvU2nRCSB4ucg6f4b69TGiwE1yq0_LGG2MU5N0.jar\022@d62411849bd4da7442481e2e720e9fe1bebd4c68b0135caad3f2c61b6314e4dd"
        role_urn: "beam:artifact:role:staging_to:v1"
        role_payload: "\n7nashorn-1iQRhJvU2nRCSB4ucg6f4b69TGiwE1yq0_LGG2MU5N0.jar"
      >
      dependencies: <
        type_urn: "beam:artifact:type:file:v1"
        type_payload: "\nG/tmp/artifacts/cldrdata-MTK3mMuUzlWYlYkweGQNzI7dFpuLG0_8F8oxT0khQDc.jar\022@3132b798cb94ce559895893078640dcc8edd169b8b1b4ffc17ca314f49214037"
        role_urn: "beam:artifact:role:staging_to:v1"
        role_payload: "\n8cldrdata-MTK3mMuUzlWYlYkweGQNzI7dFpuLG0_8F8oxT0khQDc.jar"
      >
      dependencies: <
        type_urn: "beam:artifact:type:file:v1"
        type_payload: "\nD/tmp/artifacts/dnsns-YTF3f6B-OG4FmXLRf2ckHBi4VJnspBZTyIQCz-6Spwk.jar\022@6131777fa07e386e059972d17f67241c18b85499eca41653c88402cfee92a709"
        role_urn: "beam:artifact:role:staging_to:v1"
        role_payload: "\n5dnsns-YTF3f6B-OG4FmXLRf2ckHBi4VJnspBZTyIQCz-6Spwk.jar"
      >
      dependencies: <
        type_urn: "beam:artifact:type:file:v1"
        type_payload: "\n\203\001/tmp/artifacts/beam-sdks-java-extensions-schemaio-expansion-service-2.45.0-SNAPSHOT-jj3xcGclUBC_9F66tDFYzeEEWSmr6NsV0I8alMFpluk.jar\022@8e3df17067255010bff45ebab43158cde1045929abe8db15d08f1a94c16996e9"
        role_urn: "beam:artifact:role:staging_to:v1"
        role_payload: "\ntbeam-sdks-java-extensions-schemaio-expansion-service-2.45.0-SNAPSHOT-jj3xcGclUBC_9F66tDFYzeEEWSmr6NsV0I8alMFpluk.jar"
      >
    >
  >
  environments: <
    key: "go"
    value: <
      urn: "beam:env:docker:v1"
      payload: "\n\026apache/beam_go_sdk:dev"
      capabilities: "beam:protocol:progress_reporting:v1"
      capabilities: "beam:protocol:multi_core_bundle_processing:v1"
      capabilities: "beam:transform:sdf_truncate_sized_restrictions:v1"
      capabilities: "beam:protocol:worker_status:v1"
      capabilities: "beam:protocol:monitoring_info_short_ids:v1"
      capabilities: "beam:version:sdk_base:go"
      capabilities: "beam:coder:bytes:v1"
      capabilities: "beam:coder:bool:v1"
      capabilities: "beam:coder:varint:v1"
      capabilities: "beam:coder:double:v1"
      capabilities: "beam:coder:string_utf8:v1"
      capabilities: "beam:coder:length_prefix:v1"
      capabilities: "beam:coder:kv:v1"
      capabilities: "beam:coder:iterable:v1"
      capabilities: "beam:coder:state_backed_iterable:v1"
      capabilities: "beam:coder:windowed_value:v1"
      capabilities: "beam:coder:global_window:v1"
      capabilities: "beam:coder:interval_window:v1"
      capabilities: "beam:coder:row:v1"
      capabilities: "beam:coder:nullable:v1"
      dependencies: <
        type_urn: "beam:artifact:type:file:v1"
        role_urn: "beam:artifact:role:go_worker_binary:v1"
      >
    >
  >
>
root_transform_ids: "s1"
root_transform_ids: "e2"
root_transform_ids: "e3"
root_transform_ids: "s3"
requirements: "beam:requirement:pardo:splittable_dofn:v1"
2022/12/06 22:44:32 Cross-compiling <https://ci-beam.apache.org/job/beam_PostCommit_XVR_Flink/ws/src/sdks/go/test/integration/io/xlang/jdbc/jdbc_test.go> as /tmp/worker-4-1670366672381658592
2022/12/06 22:44:41 Prepared job with id: go-testjdbcio_postgresreadwrite-598_5fe331b7-5a99-4a0c-98a1-79636f7e4041 and staging token: go-testjdbcio_postgresreadwrite-598_5fe331b7-5a99-4a0c-98a1-79636f7e4041
2022/12/06 22:44:42 Staged binary artifact with token: 
2022/12/06 22:44:43 Submitted job: go0testjdbcio0postgresreadwrite0598-jenkins-1206224442-a548d09e_b73ca8b8-65e4-4caf-80fd-e780c500c235
2022/12/06 22:44:43 Job state: STOPPED
2022/12/06 22:44:43 Job state: STARTING
2022/12/06 22:44:43 Job state: RUNNING
2022/12/06 22:45:30 Job state: DONE
2022/12/06 22:45:30 Warning: 6 errors during metrics processing: [failed to deduce Step from MonitoringInfo: urn:"beam:metric:element_count:v1" type:"beam:metrics:sum_int64:v1" payload:"\x01" labels:{key:"PCOLLECTION" value:"OgbPEqFjkUExternal/JdbcIO.ReadRows/JdbcIO.Read/Create.Values/Read(CreateSource)/ParDo(OutputSingleSource)/ParMultiDo(OutputSingleSource).output/SplitAndSize0"} failed to deduce Step from MonitoringInfo: urn:"beam:metric:element_count:v1" type:"beam:metrics:sum_int64:v1" payload:"\x01" labels:{key:"PCOLLECTION" value:"OgbPEqFjkUExternal/JdbcIO.ReadRows/JdbcIO.Read/Create.Values/Read(CreateSource)/ParDo(OutputSingleSource)/ParMultiDo(OutputSingleSource).output/PairWithRestriction0"} failed to deduce Step from MonitoringInfo: urn:"beam:metric:sampled_byte_size:v1" type:"beam:metrics:distribution_int64:v1" payload:"\x01\xf6\x08\xf6\x08\xf6\x08" labels:{key:"PCOLLECTION" value:"OgbPEqFjkUExternal/JdbcIO.ReadRows/JdbcIO.Read/Create.Values/Read(CreateSource)/ParDo(OutputSingleSource)/ParMultiDo(OutputSingleSource).output/PairWithRestriction0"} failed to deduce Step from MonitoringInfo: urn:"beam:metric:sampled_byte_size:v1" type:"beam:metrics:distribution_int64:v1" payload:"\x01\xfe\x08\xfe\x08\xfe\x08" labels:{key:"PCOLLECTION" value:"OgbPEqFjkUExternal/JdbcIO.ReadRows/JdbcIO.Read/Create.Values/Read(CreateSource)/ParDo(OutputSingleSource)/ParMultiDo(OutputSingleSource).output/SplitAndSize0"} failed to deduce Step from MonitoringInfo: urn:"beam:metric:element_count:v1" type:"beam:metrics:sum_int64:v1" payload:"\x01" labels:{key:"PCOLLECTION" value:"OgbPEqFjkUExternal/JdbcIO.ReadRows/JdbcIO.Read/Create.Values/Read(CreateSource)/ParDo(OutputSingleSource)/ParMultiDo(OutputSingleSource).output/SplitAndSize0"} failed to deduce Step from MonitoringInfo: urn:"beam:metric:sampled_byte_size:v1" type:"beam:metrics:distribution_int64:v1" payload:"\x01\x83\t\x83\t\x83\t" labels:{key:"PCOLLECTION" value:"OgbPEqFjkUExternal/JdbcIO.ReadRows/JdbcIO.Read/Create.Values/Read(CreateSource)/ParDo(OutputSingleSource)/ParMultiDo(OutputSingleSource).output/SplitAndSize0"}]
2022/12/06 22:45:30 Warning: 6 errors during metrics processing: [failed to deduce Step from MonitoringInfo: urn:"beam:metric:element_count:v1" type:"beam:metrics:sum_int64:v1" payload:"\x01" labels:{key:"PCOLLECTION" value:"OgbPEqFjkUExternal/JdbcIO.ReadRows/JdbcIO.Read/Create.Values/Read(CreateSource)/ParDo(OutputSingleSource)/ParMultiDo(OutputSingleSource).output/SplitAndSize0"} failed to deduce Step from MonitoringInfo: urn:"beam:metric:element_count:v1" type:"beam:metrics:sum_int64:v1" payload:"\x01" labels:{key:"PCOLLECTION" value:"OgbPEqFjkUExternal/JdbcIO.ReadRows/JdbcIO.Read/Create.Values/Read(CreateSource)/ParDo(OutputSingleSource)/ParMultiDo(OutputSingleSource).output/PairWithRestriction0"} failed to deduce Step from MonitoringInfo: urn:"beam:metric:sampled_byte_size:v1" type:"beam:metrics:distribution_int64:v1" payload:"\x01\xf6\x08\xf6\x08\xf6\x08" labels:{key:"PCOLLECTION" value:"OgbPEqFjkUExternal/JdbcIO.ReadRows/JdbcIO.Read/Create.Values/Read(CreateSource)/ParDo(OutputSingleSource)/ParMultiDo(OutputSingleSource).output/PairWithRestriction0"} failed to deduce Step from MonitoringInfo: urn:"beam:metric:sampled_byte_size:v1" type:"beam:metrics:distribution_int64:v1" payload:"\x01\xfe\x08\xfe\x08\xfe\x08" labels:{key:"PCOLLECTION" value:"OgbPEqFjkUExternal/JdbcIO.ReadRows/JdbcIO.Read/Create.Values/Read(CreateSource)/ParDo(OutputSingleSource)/ParMultiDo(OutputSingleSource).output/SplitAndSize0"} failed to deduce Step from MonitoringInfo: urn:"beam:metric:element_count:v1" type:"beam:metrics:sum_int64:v1" payload:"\x01" labels:{key:"PCOLLECTION" value:"OgbPEqFjkUExternal/JdbcIO.ReadRows/JdbcIO.Read/Create.Values/Read(CreateSource)/ParDo(OutputSingleSource)/ParMultiDo(OutputSingleSource).output/SplitAndSize0"} failed to deduce Step from MonitoringInfo: urn:"beam:metric:sampled_byte_size:v1" type:"beam:metrics:distribution_int64:v1" payload:"\x01\x83\t\x83\t\x83\t" labels:{key:"PCOLLECTION" value:"OgbPEqFjkUExternal/JdbcIO.ReadRows/JdbcIO.Read/Create.Values/Read(CreateSource)/ParDo(OutputSingleSource)/ParMultiDo(OutputSingleSource).output/SplitAndSize0"}]
--- PASS: TestJDBCIO_PostgresReadWrite (107.95s)
PASS
ok  	github.com/apache/beam/sdks/v2/go/test/integration/io/xlang/jdbc	260.648s
=== RUN   TestKafkaIO_BasicReadWrite
--- FAIL: TestKafkaIO_BasicReadWrite (0.02s)
panic: 	tried cross-language for beam:transform:org.apache.beam:kafka_write:v1 against localhost:37617 and failed
	expanding external transform
	expanding transform with ExpansionRequest: components:{pcollections:{key:"n4"  value:{unique_name:"n4"  coder_id:"c1@ToWlmrBKzN"  is_bounded:BOUNDED  windowing_strategy_id:"w0@ToWlmrBKzN"}}  windowing_strategies:{key:"w0@ToWlmrBKzN"  value:{window_fn:{urn:"beam:window_fn:global_windows:v1"}  merge_status:NON_MERGING  window_coder_id:"c2@ToWlmrBKzN"  trigger:{default:{}}  accumulation_mode:DISCARDING  output_time:END_OF_WINDOW  closing_behavior:EMIT_IF_NONEMPTY  on_time_behavior:FIRE_IF_NONEMPTY  environment_id:"go"}}  coders:{key:"c0@ToWlmrBKzN"  value:{spec:{urn:"beam:coder:bytes:v1"}}}  coders:{key:"c1@ToWlmrBKzN"  value:{spec:{urn:"beam:coder:kv:v1"}  component_coder_ids:"c0@ToWlmrBKzN"  component_coder_ids:"c0@ToWlmrBKzN"}}  coders:{key:"c2@ToWlmrBKzN"  value:{spec:{urn:"beam:coder:global_window:v1"}}}}  transform:{unique_name:"External"  spec:{urn:"beam:transform:org.apache.beam:kafka_write:v1"  payload:"\n}\n\x1c\n\x0eProducerConfig\x1a\n*\x08\n\x02\x10\x07\x12\x02\x10\x07\n\x0b\n\x05Topic\x1a\x02\x10\x07\n\x13\n\rKeySerializer\x1a\x02\x10\x07\n\x15\n\x0fValueSerializer\x1a\x02\x10\x07\x12$d97fbd8d-dde2-46d8-babd-f5372b6ab5e6\x12\xda\x01\x04\x00\x00\x00\x00\x01\x11bootstrap.servers\x0flocalhost:35097=xlang_kafkaio_basic_test_ae50cd92-7713-463a-bddb-5b23e03bb74d9org.apache.kafka.common.serialization.ByteArraySerializer9org.apache.kafka.common.serialization.ByteArraySerializer"}  inputs:{key:"i0"  value:"n4"}  environment_id:"go"}  namespace:"ToWlmrBKzN"
expansion failed
	caused by:
rpc error: code = Unavailable desc = connection error: desc = "transport: Error while dialing dial tcp 127.0.0.1:37617: connect: connection refused" [recovered]
	panic: 	tried cross-language for beam:transform:org.apache.beam:kafka_write:v1 against localhost:37617 and failed
	expanding external transform
	expanding transform with ExpansionRequest: components:{pcollections:{key:"n4"  value:{unique_name:"n4"  coder_id:"c1@ToWlmrBKzN"  is_bounded:BOUNDED  windowing_strategy_id:"w0@ToWlmrBKzN"}}  windowing_strategies:{key:"w0@ToWlmrBKzN"  value:{window_fn:{urn:"beam:window_fn:global_windows:v1"}  merge_status:NON_MERGING  window_coder_id:"c2@ToWlmrBKzN"  trigger:{default:{}}  accumulation_mode:DISCARDING  output_time:END_OF_WINDOW  closing_behavior:EMIT_IF_NONEMPTY  on_time_behavior:FIRE_IF_NONEMPTY  environment_id:"go"}}  coders:{key:"c0@ToWlmrBKzN"  value:{spec:{urn:"beam:coder:bytes:v1"}}}  coders:{key:"c1@ToWlmrBKzN"  value:{spec:{urn:"beam:coder:kv:v1"}  component_coder_ids:"c0@ToWlmrBKzN"  component_coder_ids:"c0@ToWlmrBKzN"}}  coders:{key:"c2@ToWlmrBKzN"  value:{spec:{urn:"beam:coder:global_window:v1"}}}}  transform:{unique_name:"External"  spec:{urn:"beam:transform:org.apache.beam:kafka_write:v1"  payload:"\n}\n\x1c\n\x0eProducerConfig\x1a\n*\x08\n\x02\x10\x07\x12\x02\x10\x07\n\x0b\n\x05Topic\x1a\x02\x10\x07\n\x13\n\rKeySerializer\x1a\x02\x10\x07\n\x15\n\x0fValueSerializer\x1a\x02\x10\x07\x12$d97fbd8d-dde2-46d8-babd-f5372b6ab5e6\x12\xda\x01\x04\x00\x00\x00\x00\x01\x11bootstrap.servers\x0flocalhost:35097=xlang_kafkaio_basic_test_ae50cd92-7713-463a-bddb-5b23e03bb74d9org.apache.kafka.common.serialization.ByteArraySerializer9org.apache.kafka.common.serialization.ByteArraySerializer"}  inputs:{key:"i0"  value:"n4"}  environment_id:"go"}  namespace:"ToWlmrBKzN"
expansion failed
	caused by:
rpc error: code = Unavailable desc = connection error: desc = "transport: Error while dialing dial tcp 127.0.0.1:37617: connect: connection refused"

goroutine 34 [running]:
testing.tRunner.func1.2({0xdae4a0, 0xc000558800})
	/home/jenkins/sdk/go1.19.3/src/testing/testing.go:1396 +0x24e
testing.tRunner.func1()
	/home/jenkins/sdk/go1.19.3/src/testing/testing.go:1399 +0x39f
panic({0xdae4a0, 0xc000558800})
	/home/jenkins/sdk/go1.19.3/src/runtime/panic.go:884 +0x212
github.com/apache/beam/sdks/v2/go/pkg/beam.CrossLanguage({0xc0004010a0?, 0xc00041dc70?}, {0xeebd09, 0x2d}, {0xc0000d46e0?, 0xd02fe0?, 0xc0001b4520?}, {0xc00040f580, 0xf}, 0xc0001a9c60, ...)
	<https://ci-beam.apache.org/job/beam_PostCommit_XVR_Flink/ws/src/sdks/go/pkg/beam/xlang.go>:165 +0x136
github.com/apache/beam/sdks/v2/go/pkg/beam/io/xlang/kafkaio.Write({0xc000400e40?, 0xc00041dc70?}, {0xc00040f580, 0xf}, {0xc00040f540, 0xf}, {0xc00045ce80, 0x3d}, {0xc0001a9e60?}, {0x0, ...})
	<https://ci-beam.apache.org/job/beam_PostCommit_XVR_Flink/ws/src/sdks/go/pkg/beam/io/xlang/kafkaio/kafka.go>:279 +0x4cb
github.com/apache/beam/sdks/v2/go/test/integration/io/xlang/kafka.writeInts({0xc000400e20?, 0xc00041dc70?}, {0xc00040f580, 0xf}, {0xc00040f540, 0xf}, {0xc00045ce80, 0x3d}, {0xc000188000, 0x3e8, ...})
	<https://ci-beam.apache.org/job/beam_PostCommit_XVR_Flink/ws/src/sdks/go/test/integration/io/xlang/kafka/kafka.go>:48 +0x24d
github.com/apache/beam/sdks/v2/go/test/integration/io/xlang/kafka.WritePipeline({0xc00040f580, 0xf}, {0xc00040f540, 0xf}, {0xc00045ce80, 0x3d}, {0xc000188000, 0x3e8, 0x3e8})
	<https://ci-beam.apache.org/job/beam_PostCommit_XVR_Flink/ws/src/sdks/go/test/integration/io/xlang/kafka/kafka.go>:70 +0x157
github.com/apache/beam/sdks/v2/go/test/integration/io/xlang/kafka.TestKafkaIO_BasicReadWrite(0xc00042fa00)
	<https://ci-beam.apache.org/job/beam_PostCommit_XVR_Flink/ws/src/sdks/go/test/integration/io/xlang/kafka/kafka_test.go>:61 +0xed
testing.tRunner(0xc00042fa00, 0xf24650)
	/home/jenkins/sdk/go1.19.3/src/testing/testing.go:1446 +0x10b
created by testing.(*T).Run
	/home/jenkins/sdk/go1.19.3/src/testing/testing.go:1493 +0x35f
FAIL	github.com/apache/beam/sdks/v2/go/test/integration/io/xlang/kafka	6.124s
FAIL

> Task :runners:flink:1.15:job-server:validatesCrossLanguageRunnerGoUsingJava FAILED
> Task :runners:flink:1.15:job-server:validatesCrossLanguageRunnerJavaUsingPython
> Task :runners:flink:1.15:job-server:validatesCrossLanguageRunnerPythonUsingJava
> Task :runners:flink:1.15:job-server:validatesCrossLanguageRunnerPythonUsingSql
> Task :runners:flink:1.15:job-server:flinkJobServerCleanup
> Task :runners:flink:1.15:job-server:validatesCrossLanguageRunnerCleanup

FAILURE: Build failed with an exception.

* Where:
Build file '<https://ci-beam.apache.org/job/beam_PostCommit_XVR_Flink/ws/src/sdks/go/test/build.gradle'> line: 195

* What went wrong:
Execution failed for task ':runners:flink:1.15:job-server:validatesCrossLanguageRunnerGoUsingJava'.
> Process 'command 'sh'' finished with non-zero exit value 1

* Try:
> Run with --stacktrace option to get the stack trace.
> Run with --info or --debug option to get more log output.

* Get more help at https://help.gradle.org

Deprecated Gradle features were used in this build, making it incompatible with Gradle 8.0.

You can use '--warning-mode all' to show the individual deprecation warnings and determine if they come from your own scripts or plugins.

See https://docs.gradle.org/7.5.1/userguide/command_line_interface.html#sec:command_line_warnings

Execution optimizations have been disabled for 1 invalid unit(s) of work during this build to ensure correctness.
Please consult deprecation warnings for more details.

BUILD FAILED in 56m 17s
270 actionable tasks: 181 executed, 77 from cache, 12 up-to-date

Publishing build scan...
https://gradle.com/s/vdq4dk762zc3o

Build step 'Invoke Gradle script' changed build result to FAILURE
Build step 'Invoke Gradle script' marked build as failure

---------------------------------------------------------------------
To unsubscribe, e-mail: builds-unsubscribe@beam.apache.org
For additional commands, e-mail: builds-help@beam.apache.org