You are viewing a plain text version of this content. The canonical link for it is here.
Posted to dev@kafka.apache.org by Apache Jenkins Server <je...@builds.apache.org> on 2016/08/19 17:55:05 UTC

Build failed in Jenkins: kafka-trunk-jdk8 #824

See <https://builds.apache.org/job/kafka-trunk-jdk8/824/changes>

Changes:

[junrao] KAFKA-3163; Add time based index to Kafka.

------------------------------------------
[...truncated 3369 lines...]

kafka.network.SocketServerTest > testSessionPrincipal STARTED

kafka.network.SocketServerTest > testSessionPrincipal PASSED

kafka.network.SocketServerTest > testMaxConnectionsPerIpOverrides STARTED

kafka.network.SocketServerTest > testMaxConnectionsPerIpOverrides PASSED

kafka.network.SocketServerTest > testSocketsCloseOnShutdown STARTED

kafka.network.SocketServerTest > testSocketsCloseOnShutdown PASSED

kafka.network.SocketServerTest > testSslSocketServer STARTED

kafka.network.SocketServerTest > testSslSocketServer PASSED

kafka.network.SocketServerTest > tooBigRequestIsRejected STARTED

kafka.network.SocketServerTest > tooBigRequestIsRejected PASSED

kafka.integration.SaslSslTopicMetadataTest > testIsrAfterBrokerShutDownAndJoinsBack STARTED

kafka.integration.SaslSslTopicMetadataTest > testIsrAfterBrokerShutDownAndJoinsBack PASSED

kafka.integration.SaslSslTopicMetadataTest > testAutoCreateTopicWithCollision STARTED

kafka.integration.SaslSslTopicMetadataTest > testAutoCreateTopicWithCollision PASSED

kafka.integration.SaslSslTopicMetadataTest > testAliveBrokerListWithNoTopics STARTED

kafka.integration.SaslSslTopicMetadataTest > testAliveBrokerListWithNoTopics PASSED

kafka.integration.SaslSslTopicMetadataTest > testAutoCreateTopic STARTED

kafka.integration.SaslSslTopicMetadataTest > testAutoCreateTopic PASSED

kafka.integration.SaslSslTopicMetadataTest > testGetAllTopicMetadata STARTED

kafka.integration.SaslSslTopicMetadataTest > testGetAllTopicMetadata PASSED

kafka.integration.SaslSslTopicMetadataTest > testAliveBrokersListWithNoTopicsAfterNewBrokerStartup STARTED

kafka.integration.SaslSslTopicMetadataTest > testAliveBrokersListWithNoTopicsAfterNewBrokerStartup PASSED

kafka.integration.SaslSslTopicMetadataTest > testBasicTopicMetadata STARTED

kafka.integration.SaslSslTopicMetadataTest > testBasicTopicMetadata PASSED

kafka.integration.SaslSslTopicMetadataTest > testAliveBrokersListWithNoTopicsAfterABrokerShutdown STARTED

kafka.integration.SaslSslTopicMetadataTest > testAliveBrokersListWithNoTopicsAfterABrokerShutdown PASSED

kafka.integration.PrimitiveApiTest > testMultiProduce STARTED

kafka.integration.PrimitiveApiTest > testMultiProduce PASSED

kafka.integration.PrimitiveApiTest > testDefaultEncoderProducerAndFetch STARTED

kafka.integration.PrimitiveApiTest > testDefaultEncoderProducerAndFetch PASSED

kafka.integration.PrimitiveApiTest > testFetchRequestCanProperlySerialize STARTED

kafka.integration.PrimitiveApiTest > testFetchRequestCanProperlySerialize PASSED

kafka.integration.PrimitiveApiTest > testPipelinedProduceRequests STARTED

kafka.integration.PrimitiveApiTest > testPipelinedProduceRequests PASSED

kafka.integration.PrimitiveApiTest > testProduceAndMultiFetch STARTED

kafka.integration.PrimitiveApiTest > testProduceAndMultiFetch PASSED

kafka.integration.PrimitiveApiTest > testDefaultEncoderProducerAndFetchWithCompression STARTED

kafka.integration.PrimitiveApiTest > testDefaultEncoderProducerAndFetchWithCompression PASSED

kafka.integration.PrimitiveApiTest > testConsumerEmptyTopic STARTED

kafka.integration.PrimitiveApiTest > testConsumerEmptyTopic PASSED

kafka.integration.PrimitiveApiTest > testEmptyFetchRequest STARTED

kafka.integration.PrimitiveApiTest > testEmptyFetchRequest PASSED

kafka.integration.UncleanLeaderElectionTest > testUncleanLeaderElectionEnabled STARTED

kafka.integration.UncleanLeaderElectionTest > testUncleanLeaderElectionEnabled PASSED

kafka.integration.UncleanLeaderElectionTest > testCleanLeaderElectionDisabledByTopicOverride STARTED

kafka.integration.UncleanLeaderElectionTest > testCleanLeaderElectionDisabledByTopicOverride PASSED

kafka.integration.UncleanLeaderElectionTest > testUncleanLeaderElectionDisabled STARTED

kafka.integration.UncleanLeaderElectionTest > testUncleanLeaderElectionDisabled PASSED

kafka.integration.UncleanLeaderElectionTest > testUncleanLeaderElectionInvalidTopicOverride STARTED

kafka.integration.UncleanLeaderElectionTest > testUncleanLeaderElectionInvalidTopicOverride PASSED

kafka.integration.UncleanLeaderElectionTest > testUncleanLeaderElectionEnabledByTopicOverride STARTED

kafka.integration.UncleanLeaderElectionTest > testUncleanLeaderElectionEnabledByTopicOverride PASSED

kafka.integration.MinIsrConfigTest > testDefaultKafkaConfig STARTED

kafka.integration.MinIsrConfigTest > testDefaultKafkaConfig PASSED

kafka.integration.SaslPlaintextTopicMetadataTest > testIsrAfterBrokerShutDownAndJoinsBack STARTED

kafka.integration.SaslPlaintextTopicMetadataTest > testIsrAfterBrokerShutDownAndJoinsBack PASSED

kafka.integration.SaslPlaintextTopicMetadataTest > testAutoCreateTopicWithCollision STARTED

kafka.integration.SaslPlaintextTopicMetadataTest > testAutoCreateTopicWithCollision PASSED

kafka.integration.SaslPlaintextTopicMetadataTest > testAliveBrokerListWithNoTopics STARTED

kafka.integration.SaslPlaintextTopicMetadataTest > testAliveBrokerListWithNoTopics PASSED

kafka.integration.SaslPlaintextTopicMetadataTest > testAutoCreateTopic STARTED

kafka.integration.SaslPlaintextTopicMetadataTest > testAutoCreateTopic PASSED

kafka.integration.SaslPlaintextTopicMetadataTest > testGetAllTopicMetadata STARTED

kafka.integration.SaslPlaintextTopicMetadataTest > testGetAllTopicMetadata PASSED

kafka.integration.SaslPlaintextTopicMetadataTest > testAliveBrokersListWithNoTopicsAfterNewBrokerStartup STARTED

kafka.integration.SaslPlaintextTopicMetadataTest > testAliveBrokersListWithNoTopicsAfterNewBrokerStartup PASSED

kafka.integration.SaslPlaintextTopicMetadataTest > testBasicTopicMetadata STARTED

kafka.integration.SaslPlaintextTopicMetadataTest > testBasicTopicMetadata PASSED

kafka.integration.SaslPlaintextTopicMetadataTest > testAliveBrokersListWithNoTopicsAfterABrokerShutdown STARTED

kafka.integration.SaslPlaintextTopicMetadataTest > testAliveBrokersListWithNoTopicsAfterABrokerShutdown PASSED

kafka.integration.AutoOffsetResetTest > testResetToLatestWhenOffsetTooLow STARTED

kafka.integration.AutoOffsetResetTest > testResetToLatestWhenOffsetTooLow PASSED

kafka.integration.AutoOffsetResetTest > testResetToEarliestWhenOffsetTooLow STARTED

kafka.integration.AutoOffsetResetTest > testResetToEarliestWhenOffsetTooLow PASSED

kafka.integration.AutoOffsetResetTest > testResetToEarliestWhenOffsetTooHigh STARTED

kafka.integration.AutoOffsetResetTest > testResetToEarliestWhenOffsetTooHigh PASSED

kafka.integration.AutoOffsetResetTest > testResetToLatestWhenOffsetTooHigh STARTED

kafka.integration.AutoOffsetResetTest > testResetToLatestWhenOffsetTooHigh PASSED

kafka.integration.SslTopicMetadataTest > testIsrAfterBrokerShutDownAndJoinsBack STARTED

kafka.integration.SslTopicMetadataTest > testIsrAfterBrokerShutDownAndJoinsBack PASSED

kafka.integration.SslTopicMetadataTest > testAutoCreateTopicWithCollision STARTED

kafka.integration.SslTopicMetadataTest > testAutoCreateTopicWithCollision PASSED

kafka.integration.SslTopicMetadataTest > testAliveBrokerListWithNoTopics STARTED

kafka.integration.SslTopicMetadataTest > testAliveBrokerListWithNoTopics PASSED

kafka.integration.SslTopicMetadataTest > testAutoCreateTopic STARTED

kafka.integration.SslTopicMetadataTest > testAutoCreateTopic PASSED

kafka.integration.SslTopicMetadataTest > testGetAllTopicMetadata STARTED

kafka.integration.SslTopicMetadataTest > testGetAllTopicMetadata PASSED

kafka.integration.SslTopicMetadataTest > testAliveBrokersListWithNoTopicsAfterNewBrokerStartup STARTED

kafka.integration.SslTopicMetadataTest > testAliveBrokersListWithNoTopicsAfterNewBrokerStartup PASSED

kafka.integration.SslTopicMetadataTest > testBasicTopicMetadata STARTED

kafka.integration.SslTopicMetadataTest > testBasicTopicMetadata PASSED

kafka.integration.SslTopicMetadataTest > testAliveBrokersListWithNoTopicsAfterABrokerShutdown STARTED

kafka.integration.SslTopicMetadataTest > testAliveBrokersListWithNoTopicsAfterABrokerShutdown PASSED

kafka.integration.FetcherTest > testFetcher STARTED

kafka.integration.FetcherTest > testFetcher PASSED

kafka.integration.PlaintextTopicMetadataTest > testIsrAfterBrokerShutDownAndJoinsBack STARTED

kafka.integration.PlaintextTopicMetadataTest > testIsrAfterBrokerShutDownAndJoinsBack PASSED

kafka.integration.PlaintextTopicMetadataTest > testAutoCreateTopicWithCollision STARTED

kafka.integration.PlaintextTopicMetadataTest > testAutoCreateTopicWithCollision PASSED

kafka.integration.PlaintextTopicMetadataTest > testAliveBrokerListWithNoTopics STARTED

kafka.integration.PlaintextTopicMetadataTest > testAliveBrokerListWithNoTopics PASSED

kafka.integration.PlaintextTopicMetadataTest > testAutoCreateTopic STARTED

kafka.integration.PlaintextTopicMetadataTest > testAutoCreateTopic PASSED

kafka.integration.PlaintextTopicMetadataTest > testGetAllTopicMetadata STARTED

kafka.integration.PlaintextTopicMetadataTest > testGetAllTopicMetadata PASSED

kafka.integration.PlaintextTopicMetadataTest > testAliveBrokersListWithNoTopicsAfterNewBrokerStartup STARTED

kafka.integration.PlaintextTopicMetadataTest > testAliveBrokersListWithNoTopicsAfterNewBrokerStartup PASSED

kafka.integration.PlaintextTopicMetadataTest > testBasicTopicMetadata STARTED

kafka.integration.PlaintextTopicMetadataTest > testBasicTopicMetadata PASSED

kafka.integration.PlaintextTopicMetadataTest > testAliveBrokersListWithNoTopicsAfterABrokerShutdown STARTED

kafka.integration.PlaintextTopicMetadataTest > testAliveBrokersListWithNoTopicsAfterABrokerShutdown PASSED

integration.kafka.api.GroupCoordinatorIntegrationTest > testGroupCoordinatorPropagatesOfffsetsTopicCompressionCodec STARTED

integration.kafka.api.GroupCoordinatorIntegrationTest > testGroupCoordinatorPropagatesOfffsetsTopicCompressionCodec PASSED

811 tests completed, 1 failed
:kafka-trunk-jdk8:core:test FAILED
:test_core_2_10 FAILED

FAILURE: Build failed with an exception.

* What went wrong:
Execution failed for task ':core:test'.
> There were failing tests. See the report at: file://<https://builds.apache.org/job/kafka-trunk-jdk8/ws/core/build/reports/tests/index.html>

* Try:
Run with --stacktrace option to get the stack trace. Run with --info or --debug option to get more log output.

BUILD FAILED

Total time: 41 mins 43.241 secs
Build step 'Execute shell' marked build as failure
Recording test results
Setting GRADLE_2_4_RC_2_HOME=/home/jenkins/jenkins-slave/tools/hudson.plugins.gradle.GradleInstallation/Gradle_2.4-rc-2
Setting GRADLE_2_4_RC_2_HOME=/home/jenkins/jenkins-slave/tools/hudson.plugins.gradle.GradleInstallation/Gradle_2.4-rc-2

Jenkins build is back to normal : kafka-trunk-jdk8 #830

Posted by Apache Jenkins Server <je...@builds.apache.org>.
See <https://builds.apache.org/job/kafka-trunk-jdk8/830/changes>


Build failed in Jenkins: kafka-trunk-jdk8 #829

Posted by Apache Jenkins Server <je...@builds.apache.org>.
See <https://builds.apache.org/job/kafka-trunk-jdk8/829/changes>

Changes:

[junrao] KAFKA-3163; Minor follow up for (KIP-33)

[junrao] KAFKA-3894; log cleaner can partially clean a segment

------------------------------------------
[...truncated 1853 lines...]

kafka.api.PlaintextProducerSendTest > testAutoCreateTopic STARTED

kafka.api.PlaintextProducerSendTest > testAutoCreateTopic PASSED

kafka.api.PlaintextProducerSendTest > testSendWithInvalidCreateTime STARTED

kafka.api.PlaintextProducerSendTest > testSendWithInvalidCreateTime PASSED

kafka.api.PlaintextProducerSendTest > testSendCompressedMessageWithCreateTime STARTED

kafka.api.PlaintextProducerSendTest > testSendCompressedMessageWithCreateTime PASSED

kafka.api.PlaintextProducerSendTest > testCloseWithZeroTimeoutFromCallerThread STARTED

kafka.api.PlaintextProducerSendTest > testCloseWithZeroTimeoutFromCallerThread PASSED

kafka.api.PlaintextProducerSendTest > testCloseWithZeroTimeoutFromSenderThread STARTED

kafka.api.PlaintextProducerSendTest > testCloseWithZeroTimeoutFromSenderThread PASSED

kafka.api.PlaintextProducerSendTest > testSendNonCompressedMessageWithLogApendTime STARTED

kafka.api.PlaintextProducerSendTest > testSendNonCompressedMessageWithLogApendTime PASSED

kafka.api.PlaintextConsumerTest > testPartitionsForAutoCreate STARTED

kafka.api.PlaintextConsumerTest > testPartitionsForAutoCreate PASSED

kafka.api.PlaintextConsumerTest > testShrinkingTopicSubscriptions STARTED

kafka.api.PlaintextConsumerTest > testShrinkingTopicSubscriptions PASSED

kafka.api.PlaintextConsumerTest > testMaxPollIntervalMs STARTED

kafka.api.PlaintextConsumerTest > testMaxPollIntervalMs PASSED

kafka.api.PlaintextConsumerTest > testSubsequentPatternSubscription STARTED

kafka.api.PlaintextConsumerTest > testSubsequentPatternSubscription PASSED

kafka.api.PlaintextConsumerTest > testAsyncCommit STARTED

kafka.api.PlaintextConsumerTest > testAsyncCommit PASSED

kafka.api.PlaintextConsumerTest > testMultiConsumerSessionTimeoutOnStopPolling STARTED

kafka.api.PlaintextConsumerTest > testMultiConsumerSessionTimeoutOnStopPolling PASSED

kafka.api.PlaintextConsumerTest > testPartitionsForInvalidTopic STARTED

kafka.api.PlaintextConsumerTest > testPartitionsForInvalidTopic PASSED

kafka.api.PlaintextConsumerTest > testPauseStateNotPreservedByRebalance STARTED

kafka.api.PlaintextConsumerTest > testPauseStateNotPreservedByRebalance PASSED

kafka.api.PlaintextConsumerTest > testSeek STARTED

kafka.api.PlaintextConsumerTest > testSeek PASSED

kafka.api.PlaintextConsumerTest > testPositionAndCommit STARTED

kafka.api.PlaintextConsumerTest > testPositionAndCommit PASSED

kafka.api.PlaintextConsumerTest > testUnsubscribeTopic STARTED

kafka.api.PlaintextConsumerTest > testUnsubscribeTopic PASSED

kafka.api.PlaintextConsumerTest > testMultiConsumerSessionTimeoutOnClose STARTED

kafka.api.PlaintextConsumerTest > testMultiConsumerSessionTimeoutOnClose PASSED

kafka.api.PlaintextConsumerTest > testFetchRecordTooLarge STARTED

kafka.api.PlaintextConsumerTest > testFetchRecordTooLarge PASSED

kafka.api.PlaintextConsumerTest > testMultiConsumerDefaultAssignment STARTED

kafka.api.PlaintextConsumerTest > testMultiConsumerDefaultAssignment PASSED

kafka.api.PlaintextConsumerTest > testAutoCommitOnClose STARTED

kafka.api.PlaintextConsumerTest > testAutoCommitOnClose PASSED

kafka.api.PlaintextConsumerTest > testListTopics STARTED

kafka.api.PlaintextConsumerTest > testListTopics PASSED

kafka.api.PlaintextConsumerTest > testExpandingTopicSubscriptions STARTED

kafka.api.PlaintextConsumerTest > testExpandingTopicSubscriptions PASSED

kafka.api.PlaintextConsumerTest > testInterceptors STARTED

kafka.api.PlaintextConsumerTest > testInterceptors PASSED

kafka.api.PlaintextConsumerTest > testPatternUnsubscription STARTED

kafka.api.PlaintextConsumerTest > testPatternUnsubscription PASSED

kafka.api.PlaintextConsumerTest > testGroupConsumption STARTED

kafka.api.PlaintextConsumerTest > testGroupConsumption PASSED

kafka.api.PlaintextConsumerTest > testPartitionsFor STARTED

kafka.api.PlaintextConsumerTest > testPartitionsFor PASSED

kafka.api.PlaintextConsumerTest > testAutoCommitOnRebalance STARTED

kafka.api.PlaintextConsumerTest > testAutoCommitOnRebalance PASSED

kafka.api.PlaintextConsumerTest > testInterceptorsWithWrongKeyValue STARTED

kafka.api.PlaintextConsumerTest > testInterceptorsWithWrongKeyValue PASSED

kafka.api.PlaintextConsumerTest > testMultiConsumerRoundRobinAssignment STARTED

kafka.api.PlaintextConsumerTest > testMultiConsumerRoundRobinAssignment PASSED

kafka.api.PlaintextConsumerTest > testPartitionPauseAndResume STARTED

kafka.api.PlaintextConsumerTest > testPartitionPauseAndResume PASSED

kafka.api.PlaintextConsumerTest > testConsumeMessagesWithLogAppendTime STARTED

kafka.api.PlaintextConsumerTest > testConsumeMessagesWithLogAppendTime PASSED

kafka.api.PlaintextConsumerTest > testAutoCommitOnCloseAfterWakeup STARTED

kafka.api.PlaintextConsumerTest > testAutoCommitOnCloseAfterWakeup PASSED

kafka.api.PlaintextConsumerTest > testMaxPollRecords STARTED

kafka.api.PlaintextConsumerTest > testMaxPollRecords PASSED

kafka.api.PlaintextConsumerTest > testAutoOffsetReset STARTED

kafka.api.PlaintextConsumerTest > testAutoOffsetReset PASSED

kafka.api.PlaintextConsumerTest > testFetchInvalidOffset STARTED

kafka.api.PlaintextConsumerTest > testFetchInvalidOffset PASSED

kafka.api.PlaintextConsumerTest > testAutoCommitIntercept STARTED

kafka.api.PlaintextConsumerTest > testAutoCommitIntercept PASSED

kafka.api.PlaintextConsumerTest > testCommitSpecifiedOffsets STARTED

kafka.api.PlaintextConsumerTest > testCommitSpecifiedOffsets PASSED

kafka.api.PlaintextConsumerTest > testCommitMetadata STARTED

kafka.api.PlaintextConsumerTest > testCommitMetadata PASSED

kafka.api.PlaintextConsumerTest > testRoundRobinAssignment STARTED

kafka.api.PlaintextConsumerTest > testRoundRobinAssignment PASSED

kafka.api.PlaintextConsumerTest > testPatternSubscription STARTED

kafka.api.PlaintextConsumerTest > testPatternSubscription PASSED

kafka.api.PlaintextConsumerTest > testCoordinatorFailover STARTED

kafka.api.PlaintextConsumerTest > testCoordinatorFailover PASSED

kafka.api.PlaintextConsumerTest > testSimpleConsumption STARTED

kafka.api.PlaintextConsumerTest > testSimpleConsumption PASSED

kafka.api.ApiUtilsTest > testShortStringNonASCII STARTED

kafka.api.ApiUtilsTest > testShortStringNonASCII PASSED

kafka.api.ApiUtilsTest > testShortStringASCII STARTED

kafka.api.ApiUtilsTest > testShortStringASCII PASSED

kafka.api.ConsumerBounceTest > testSeekAndCommitWithBrokerFailures STARTED

kafka.api.ConsumerBounceTest > testSeekAndCommitWithBrokerFailures PASSED

kafka.api.ConsumerBounceTest > testConsumptionWithBrokerFailures STARTED
ERROR: Could not install GRADLE_2_4_RC_2_HOME
java.lang.NullPointerException
	at hudson.plugins.toolenv.ToolEnvBuildWrapper$1.buildEnvVars(ToolEnvBuildWrapper.java:46)
	at hudson.model.AbstractBuild.getEnvironment(AbstractBuild.java:931)
	at hudson.plugins.git.GitSCM.getParamExpandedRepos(GitSCM.java:404)
	at hudson.plugins.git.GitSCM.compareRemoteRevisionWithImpl(GitSCM.java:609)
	at hudson.plugins.git.GitSCM.compareRemoteRevisionWith(GitSCM.java:574)
	at hudson.scm.SCM.compareRemoteRevisionWith(SCM.java:381)
	at hudson.scm.SCM.poll(SCM.java:398)
	at hudson.model.AbstractProject._poll(AbstractProject.java:1446)
	at hudson.model.AbstractProject.poll(AbstractProject.java:1349)
	at hudson.triggers.SCMTrigger$Runner.runPolling(SCMTrigger.java:528)
	at hudson.triggers.SCMTrigger$Runner.run(SCMTrigger.java:557)
	at hudson.util.SequentialExecutionQueue$QueueEntry.run(SequentialExecutionQueue.java:119)
	at java.util.concurrent.Executors$RunnableAdapter.call(Executors.java:511)
	at java.util.concurrent.FutureTask.run(FutureTask.java:266)
	at java.util.concurrent.ThreadPoolExecutor.runWorker(ThreadPoolExecutor.java:1142)
	at java.util.concurrent.ThreadPoolExecutor$Worker.run(ThreadPoolExecutor.java:617)
	at java.lang.Thread.run(Thread.java:745)
ERROR: Could not install GRADLE_2_4_RC_2_HOME
java.lang.NullPointerException
	at hudson.plugins.toolenv.ToolEnvBuildWrapper$1.buildEnvVars(ToolEnvBuildWrapper.java:46)
	at hudson.model.AbstractBuild.getEnvironment(AbstractBuild.java:931)
	at hudson.plugins.git.GitSCM.getParamExpandedRepos(GitSCM.java:404)
	at hudson.plugins.git.GitSCM.compareRemoteRevisionWithImpl(GitSCM.java:609)
	at hudson.plugins.git.GitSCM.compareRemoteRevisionWith(GitSCM.java:574)
	at hudson.scm.SCM.compareRemoteRevisionWith(SCM.java:381)
	at hudson.scm.SCM.poll(SCM.java:398)
	at hudson.model.AbstractProject._poll(AbstractProject.java:1446)
	at hudson.model.AbstractProject.poll(AbstractProject.java:1349)
	at hudson.triggers.SCMTrigger$Runner.runPolling(SCMTrigger.java:528)
	at hudson.triggers.SCMTrigger$Runner.run(SCMTrigger.java:557)
	at hudson.util.SequentialExecutionQueue$QueueEntry.run(SequentialExecutionQueue.java:119)
	at java.util.concurrent.Executors$RunnableAdapter.call(Executors.java:511)
	at java.util.concurrent.FutureTask.run(FutureTask.java:266)
	at java.util.concurrent.ThreadPoolExecutor.runWorker(ThreadPoolExecutor.java:1142)
	at java.util.concurrent.ThreadPoolExecutor$Worker.run(ThreadPoolExecutor.java:617)
	at java.lang.Thread.run(Thread.java:745)
ERROR: Could not install GRADLE_2_4_RC_2_HOME
java.lang.NullPointerException
	at hudson.plugins.toolenv.ToolEnvBuildWrapper$1.buildEnvVars(ToolEnvBuildWrapper.java:46)
	at hudson.model.AbstractBuild.getEnvironment(AbstractBuild.java:931)
	at hudson.plugins.git.GitSCM.getParamExpandedRepos(GitSCM.java:404)
	at hudson.plugins.git.GitSCM.compareRemoteRevisionWithImpl(GitSCM.java:609)
	at hudson.plugins.git.GitSCM.compareRemoteRevisionWith(GitSCM.java:574)
	at hudson.scm.SCM.compareRemoteRevisionWith(SCM.java:381)
	at hudson.scm.SCM.poll(SCM.java:398)
	at hudson.model.AbstractProject._poll(AbstractProject.java:1446)
	at hudson.model.AbstractProject.poll(AbstractProject.java:1349)
	at hudson.triggers.SCMTrigger$Runner.runPolling(SCMTrigger.java:528)
	at hudson.triggers.SCMTrigger$Runner.run(SCMTrigger.java:557)
	at hudson.util.SequentialExecutionQueue$QueueEntry.run(SequentialExecutionQueue.java:119)
	at java.util.concurrent.Executors$RunnableAdapter.call(Executors.java:511)
	at java.util.concurrent.FutureTask.run(FutureTask.java:266)
	at java.util.concurrent.ThreadPoolExecutor.runWorker(ThreadPoolExecutor.java:1142)
	at java.util.concurrent.ThreadPoolExecutor$Worker.run(ThreadPoolExecutor.java:617)
	at java.lang.Thread.run(Thread.java:745)
Build timed out (after 180 minutes). Marking the build as failed.
Build was aborted
Recording test results
Setting GRADLE_2_4_RC_2_HOME=/home/jenkins/jenkins-slave/tools/hudson.plugins.gradle.GradleInstallation/Gradle_2.4-rc-2
ERROR: Step ?Publish JUnit test result report? failed: No test report files were found. Configuration error?
Setting GRADLE_2_4_RC_2_HOME=/home/jenkins/jenkins-slave/tools/hudson.plugins.gradle.GradleInstallation/Gradle_2.4-rc-2

Build failed in Jenkins: kafka-trunk-jdk8 #828

Posted by Apache Jenkins Server <je...@builds.apache.org>.
See <https://builds.apache.org/job/kafka-trunk-jdk8/828/changes>

Changes:

[wangguoz] KAFKA-3949: Fix race condition when metadata update arrives during

------------------------------------------
[...truncated 12070 lines...]
org.apache.kafka.streams.kstream.internals.KStreamImplTest > shouldCantHaveNullPredicate PASSED

org.apache.kafka.streams.kstream.internals.KStreamImplTest > shouldNotAllowNullActionOnForEach STARTED

org.apache.kafka.streams.kstream.internals.KStreamImplTest > shouldNotAllowNullActionOnForEach PASSED

org.apache.kafka.streams.kstream.internals.KStreamImplTest > shouldNotAllowNullValueMapperOnTableJoin STARTED

org.apache.kafka.streams.kstream.internals.KStreamImplTest > shouldNotAllowNullValueMapperOnTableJoin PASSED

org.apache.kafka.streams.kstream.internals.KStreamImplTest > shouldNotAllowNullPredicateOnFilterNot STARTED

org.apache.kafka.streams.kstream.internals.KStreamImplTest > shouldNotAllowNullPredicateOnFilterNot PASSED

org.apache.kafka.streams.kstream.internals.KStreamImplTest > shouldHaveAtLeastOnPredicateWhenBranching STARTED

org.apache.kafka.streams.kstream.internals.KStreamImplTest > shouldHaveAtLeastOnPredicateWhenBranching PASSED

org.apache.kafka.streams.kstream.internals.KStreamImplTest > shouldNotAllowNullFilePathOnWriteAsText STARTED

org.apache.kafka.streams.kstream.internals.KStreamImplTest > shouldNotAllowNullFilePathOnWriteAsText PASSED

org.apache.kafka.streams.kstream.internals.KeyValuePrinterProcessorTest > testPrintKeyValueWithProvidedSerde STARTED

org.apache.kafka.streams.kstream.internals.KeyValuePrinterProcessorTest > testPrintKeyValueWithProvidedSerde PASSED

org.apache.kafka.streams.kstream.internals.KeyValuePrinterProcessorTest > testPrintKeyValuesWithName STARTED

org.apache.kafka.streams.kstream.internals.KeyValuePrinterProcessorTest > testPrintKeyValuesWithName PASSED

org.apache.kafka.streams.kstream.internals.KeyValuePrinterProcessorTest > testPrintKeyValueDefaultSerde STARTED

org.apache.kafka.streams.kstream.internals.KeyValuePrinterProcessorTest > testPrintKeyValueDefaultSerde PASSED

org.apache.kafka.streams.kstream.internals.KStreamKTableLeftJoinTest > testJoin STARTED

org.apache.kafka.streams.kstream.internals.KStreamKTableLeftJoinTest > testJoin PASSED

org.apache.kafka.streams.kstream.internals.KTableKTableJoinTest > testJoin STARTED

org.apache.kafka.streams.kstream.internals.KTableKTableJoinTest > testJoin PASSED

org.apache.kafka.streams.kstream.internals.KTableKTableJoinTest > testNotSendingOldValues STARTED

org.apache.kafka.streams.kstream.internals.KTableKTableJoinTest > testNotSendingOldValues PASSED

org.apache.kafka.streams.kstream.internals.KTableKTableJoinTest > testSendingOldValues STARTED

org.apache.kafka.streams.kstream.internals.KTableKTableJoinTest > testSendingOldValues PASSED

org.apache.kafka.streams.kstream.internals.KTableFilterTest > testSendingOldValue STARTED

org.apache.kafka.streams.kstream.internals.KTableFilterTest > testSendingOldValue PASSED

org.apache.kafka.streams.kstream.internals.KTableFilterTest > testNotSendingOldValue STARTED

org.apache.kafka.streams.kstream.internals.KTableFilterTest > testNotSendingOldValue PASSED

org.apache.kafka.streams.kstream.internals.KTableFilterTest > testSkipNullOnMaterialization STARTED

org.apache.kafka.streams.kstream.internals.KTableFilterTest > testSkipNullOnMaterialization PASSED

org.apache.kafka.streams.kstream.internals.KTableFilterTest > testKTable STARTED

org.apache.kafka.streams.kstream.internals.KTableFilterTest > testKTable PASSED

org.apache.kafka.streams.kstream.internals.KTableFilterTest > testValueGetter STARTED

org.apache.kafka.streams.kstream.internals.KTableFilterTest > testValueGetter PASSED

org.apache.kafka.streams.kstream.internals.KStreamFlatMapTest > testFlatMap STARTED

org.apache.kafka.streams.kstream.internals.KStreamFlatMapTest > testFlatMap PASSED

org.apache.kafka.streams.kstream.internals.KTableAggregateTest > testAggBasic STARTED

org.apache.kafka.streams.kstream.internals.KTableAggregateTest > testAggBasic PASSED

org.apache.kafka.streams.kstream.internals.KTableAggregateTest > testCount STARTED

org.apache.kafka.streams.kstream.internals.KTableAggregateTest > testCount PASSED

org.apache.kafka.streams.kstream.internals.KTableAggregateTest > testAggRepartition STARTED

org.apache.kafka.streams.kstream.internals.KTableAggregateTest > testAggRepartition PASSED

org.apache.kafka.streams.kstream.internals.KTableAggregateTest > testRemoveOldBeforeAddNew STARTED

org.apache.kafka.streams.kstream.internals.KTableAggregateTest > testRemoveOldBeforeAddNew PASSED

org.apache.kafka.streams.kstream.internals.KStreamFlatMapValuesTest > testFlatMapValues STARTED

org.apache.kafka.streams.kstream.internals.KStreamFlatMapValuesTest > testFlatMapValues PASSED

org.apache.kafka.streams.kstream.internals.KGroupedTableImplTest > shouldNotAllowNullSubtractorOnAggregate STARTED

org.apache.kafka.streams.kstream.internals.KGroupedTableImplTest > shouldNotAllowNullSubtractorOnAggregate PASSED

org.apache.kafka.streams.kstream.internals.KGroupedTableImplTest > shouldNotAllowNullInitializerOnAggregate STARTED

org.apache.kafka.streams.kstream.internals.KGroupedTableImplTest > shouldNotAllowNullInitializerOnAggregate PASSED

org.apache.kafka.streams.kstream.internals.KGroupedTableImplTest > shouldNotAllowNullStoreNameOnAggregate STARTED

org.apache.kafka.streams.kstream.internals.KGroupedTableImplTest > shouldNotAllowNullStoreNameOnAggregate PASSED

org.apache.kafka.streams.kstream.internals.KGroupedTableImplTest > shouldNotAllowNullAdderOnReduce STARTED

org.apache.kafka.streams.kstream.internals.KGroupedTableImplTest > shouldNotAllowNullAdderOnReduce PASSED

org.apache.kafka.streams.kstream.internals.KGroupedTableImplTest > shouldNotAllowNullAdderOnAggregate STARTED

org.apache.kafka.streams.kstream.internals.KGroupedTableImplTest > shouldNotAllowNullAdderOnAggregate PASSED

org.apache.kafka.streams.kstream.internals.KGroupedTableImplTest > shouldNotAllowNullStoreNameOnReduce STARTED

org.apache.kafka.streams.kstream.internals.KGroupedTableImplTest > shouldNotAllowNullStoreNameOnReduce PASSED

org.apache.kafka.streams.kstream.internals.KGroupedTableImplTest > shouldNotAllowNullSubtractorOnReduce STARTED

org.apache.kafka.streams.kstream.internals.KGroupedTableImplTest > shouldNotAllowNullSubtractorOnReduce PASSED

org.apache.kafka.streams.kstream.internals.KTableForeachTest > testForeach STARTED

org.apache.kafka.streams.kstream.internals.KTableForeachTest > testForeach PASSED

org.apache.kafka.streams.kstream.UnlimitedWindowsTest > startTimeMustNotBeNegative STARTED

org.apache.kafka.streams.kstream.UnlimitedWindowsTest > startTimeMustNotBeNegative PASSED

org.apache.kafka.streams.kstream.UnlimitedWindowsTest > shouldIncludeRecordsThatHappenedOnWindowStart STARTED

org.apache.kafka.streams.kstream.UnlimitedWindowsTest > shouldIncludeRecordsThatHappenedOnWindowStart PASSED

org.apache.kafka.streams.kstream.UnlimitedWindowsTest > startTimeCanBeZero STARTED

org.apache.kafka.streams.kstream.UnlimitedWindowsTest > startTimeCanBeZero PASSED

org.apache.kafka.streams.kstream.UnlimitedWindowsTest > shouldIncludeRecordsThatHappenedAfterWindowStart STARTED

org.apache.kafka.streams.kstream.UnlimitedWindowsTest > shouldIncludeRecordsThatHappenedAfterWindowStart PASSED

org.apache.kafka.streams.kstream.UnlimitedWindowsTest > shouldExcludeRecordsThatHappenedBeforeWindowStart STARTED

org.apache.kafka.streams.kstream.UnlimitedWindowsTest > shouldExcludeRecordsThatHappenedBeforeWindowStart PASSED

org.apache.kafka.streams.kstream.TimeWindowsTest > shouldHaveSaneEqualsAndHashCode STARTED

org.apache.kafka.streams.kstream.TimeWindowsTest > shouldHaveSaneEqualsAndHashCode PASSED

org.apache.kafka.streams.kstream.TimeWindowsTest > windowSizeMustNotBeZero STARTED

org.apache.kafka.streams.kstream.TimeWindowsTest > windowSizeMustNotBeZero PASSED

org.apache.kafka.streams.kstream.TimeWindowsTest > advanceIntervalMustNotBeZero STARTED

org.apache.kafka.streams.kstream.TimeWindowsTest > advanceIntervalMustNotBeZero PASSED

org.apache.kafka.streams.kstream.TimeWindowsTest > windowSizeMustNotBeNegative STARTED

org.apache.kafka.streams.kstream.TimeWindowsTest > windowSizeMustNotBeNegative PASSED

org.apache.kafka.streams.kstream.TimeWindowsTest > advanceIntervalMustNotBeNegative STARTED

org.apache.kafka.streams.kstream.TimeWindowsTest > advanceIntervalMustNotBeNegative PASSED

org.apache.kafka.streams.kstream.TimeWindowsTest > advanceIntervalMustNotBeLargerThanWindowSize STARTED

org.apache.kafka.streams.kstream.TimeWindowsTest > advanceIntervalMustNotBeLargerThanWindowSize PASSED

org.apache.kafka.streams.kstream.TimeWindowsTest > windowsForTumblingWindows STARTED

org.apache.kafka.streams.kstream.TimeWindowsTest > windowsForTumblingWindows PASSED

org.apache.kafka.streams.kstream.TimeWindowsTest > windowsForHoppingWindows STARTED

org.apache.kafka.streams.kstream.TimeWindowsTest > windowsForHoppingWindows PASSED

org.apache.kafka.streams.kstream.TimeWindowsTest > windowsForBarelyOverlappingHoppingWindows STARTED

org.apache.kafka.streams.kstream.TimeWindowsTest > windowsForBarelyOverlappingHoppingWindows PASSED

org.apache.kafka.streams.kstream.JoinWindowsTest > afterBelowLower STARTED

org.apache.kafka.streams.kstream.JoinWindowsTest > afterBelowLower PASSED

org.apache.kafka.streams.kstream.JoinWindowsTest > beforeOverUpper STARTED

org.apache.kafka.streams.kstream.JoinWindowsTest > beforeOverUpper PASSED

org.apache.kafka.streams.kstream.JoinWindowsTest > shouldHaveSaneEqualsAndHashCode STARTED

org.apache.kafka.streams.kstream.JoinWindowsTest > shouldHaveSaneEqualsAndHashCode PASSED

org.apache.kafka.streams.kstream.JoinWindowsTest > validWindows STARTED

org.apache.kafka.streams.kstream.JoinWindowsTest > validWindows PASSED

org.apache.kafka.streams.kstream.JoinWindowsTest > timeDifferenceMustNotBeNegative STARTED

org.apache.kafka.streams.kstream.JoinWindowsTest > timeDifferenceMustNotBeNegative PASSED

org.apache.kafka.streams.kstream.KStreamBuilderTest > shouldHaveCorrectSourceTopicsForTableFromMergedStream STARTED

org.apache.kafka.streams.kstream.KStreamBuilderTest > shouldHaveCorrectSourceTopicsForTableFromMergedStream PASSED

org.apache.kafka.streams.kstream.KStreamBuilderTest > shouldHaveCorrectSourceTopicsForTableFromMergedStreamWithProcessors STARTED

org.apache.kafka.streams.kstream.KStreamBuilderTest > shouldHaveCorrectSourceTopicsForTableFromMergedStreamWithProcessors PASSED

org.apache.kafka.streams.kstream.KStreamBuilderTest > testMerge STARTED

org.apache.kafka.streams.kstream.KStreamBuilderTest > testMerge PASSED

org.apache.kafka.streams.kstream.KStreamBuilderTest > testFrom STARTED

org.apache.kafka.streams.kstream.KStreamBuilderTest > testFrom PASSED

org.apache.kafka.streams.kstream.KStreamBuilderTest > shouldThrowExceptionWhenTopicNamesAreNull STARTED

org.apache.kafka.streams.kstream.KStreamBuilderTest > shouldThrowExceptionWhenTopicNamesAreNull PASSED

org.apache.kafka.streams.kstream.KStreamBuilderTest > shouldThrowExceptionWhenNoTopicPresent STARTED

org.apache.kafka.streams.kstream.KStreamBuilderTest > shouldThrowExceptionWhenNoTopicPresent PASSED

org.apache.kafka.streams.kstream.KStreamBuilderTest > testNewName STARTED

org.apache.kafka.streams.kstream.KStreamBuilderTest > testNewName PASSED

354 tests completed, 1 failed
:streams:test FAILED

FAILURE: Build failed with an exception.

* What went wrong:
Execution failed for task ':streams:test'.
> There were failing tests. See the report at: file://<https://builds.apache.org/job/kafka-trunk-jdk8/ws/streams/build/reports/tests/index.html>

* Try:
Run with --stacktrace option to get the stack trace. Run with --info or --debug option to get more log output.

BUILD FAILED

Total time: 1 hrs 21 mins 11.323 secs
Build step 'Execute shell' marked build as failure
Recording test results
Setting GRADLE_2_4_RC_2_HOME=/home/jenkins/jenkins-slave/tools/hudson.plugins.gradle.GradleInstallation/Gradle_2.4-rc-2
Setting GRADLE_2_4_RC_2_HOME=/home/jenkins/jenkins-slave/tools/hudson.plugins.gradle.GradleInstallation/Gradle_2.4-rc-2

Build failed in Jenkins: kafka-trunk-jdk8 #827

Posted by Apache Jenkins Server <je...@builds.apache.org>.
See <https://builds.apache.org/job/kafka-trunk-jdk8/827/changes>

Changes:

[wangguoz] KAFKA-4016: Added join benchmarks

------------------------------------------
[...truncated 12090 lines...]
org.apache.kafka.streams.processor.internals.assignment.AssignmentInfoTest > shouldDecodePreviousVersion PASSED

org.apache.kafka.streams.processor.internals.assignment.SubscriptionInfoTest > testEncodeDecode STARTED

org.apache.kafka.streams.processor.internals.assignment.SubscriptionInfoTest > testEncodeDecode PASSED

org.apache.kafka.streams.processor.internals.assignment.SubscriptionInfoTest > shouldEncodeDecodeWithUserEndPoint STARTED

org.apache.kafka.streams.processor.internals.assignment.SubscriptionInfoTest > shouldEncodeDecodeWithUserEndPoint PASSED

org.apache.kafka.streams.processor.internals.assignment.SubscriptionInfoTest > shouldBeBackwardCompatible STARTED

org.apache.kafka.streams.processor.internals.assignment.SubscriptionInfoTest > shouldBeBackwardCompatible PASSED

org.apache.kafka.streams.processor.internals.StreamThreadTest > testInjectClients STARTED

org.apache.kafka.streams.processor.internals.StreamThreadTest > testInjectClients PASSED

org.apache.kafka.streams.processor.internals.StreamThreadTest > testMaybeCommit STARTED

org.apache.kafka.streams.processor.internals.StreamThreadTest > testMaybeCommit PASSED

org.apache.kafka.streams.processor.internals.StreamThreadTest > testPartitionAssignmentChange STARTED

org.apache.kafka.streams.processor.internals.StreamThreadTest > testPartitionAssignmentChange PASSED

org.apache.kafka.streams.processor.internals.StreamThreadTest > testMaybeClean STARTED

org.apache.kafka.streams.processor.internals.StreamThreadTest > testMaybeClean PASSED

org.apache.kafka.streams.processor.internals.PunctuationQueueTest > testPunctuationInterval STARTED

org.apache.kafka.streams.processor.internals.PunctuationQueueTest > testPunctuationInterval PASSED

org.apache.kafka.streams.processor.internals.RecordQueueTest > testTimeTracking STARTED

org.apache.kafka.streams.processor.internals.RecordQueueTest > testTimeTracking PASSED

org.apache.kafka.streams.processor.internals.ProcessorStateManagerTest > testRegisterNonPersistentStore STARTED

org.apache.kafka.streams.processor.internals.ProcessorStateManagerTest > testRegisterNonPersistentStore PASSED

org.apache.kafka.streams.processor.internals.ProcessorStateManagerTest > testGetStore STARTED

org.apache.kafka.streams.processor.internals.ProcessorStateManagerTest > testGetStore PASSED

org.apache.kafka.streams.processor.internals.ProcessorStateManagerTest > testClose STARTED

org.apache.kafka.streams.processor.internals.ProcessorStateManagerTest > testClose PASSED

org.apache.kafka.streams.processor.internals.ProcessorStateManagerTest > testChangeLogOffsets STARTED

org.apache.kafka.streams.processor.internals.ProcessorStateManagerTest > testChangeLogOffsets PASSED

org.apache.kafka.streams.processor.internals.ProcessorStateManagerTest > testRegisterPersistentStore STARTED

org.apache.kafka.streams.processor.internals.ProcessorStateManagerTest > testRegisterPersistentStore PASSED

org.apache.kafka.streams.processor.internals.ProcessorStateManagerTest > testNoTopic STARTED

org.apache.kafka.streams.processor.internals.ProcessorStateManagerTest > testNoTopic PASSED

org.apache.kafka.streams.processor.internals.StreamTaskTest > testProcessOrder STARTED

org.apache.kafka.streams.processor.internals.StreamTaskTest > testProcessOrder PASSED

org.apache.kafka.streams.processor.internals.StreamTaskTest > testPauseResume STARTED

org.apache.kafka.streams.processor.internals.StreamTaskTest > testPauseResume PASSED

org.apache.kafka.streams.processor.internals.StreamTaskTest > testMaybePunctuate STARTED

org.apache.kafka.streams.processor.internals.StreamTaskTest > testMaybePunctuate PASSED

org.apache.kafka.streams.processor.internals.QuickUnionTest > testUnite STARTED

org.apache.kafka.streams.processor.internals.QuickUnionTest > testUnite PASSED

org.apache.kafka.streams.processor.internals.QuickUnionTest > testUniteMany STARTED

org.apache.kafka.streams.processor.internals.QuickUnionTest > testUniteMany PASSED

org.apache.kafka.streams.processor.TopologyBuilderTest > shouldNotAllowNullProcessorSupplier STARTED

org.apache.kafka.streams.processor.TopologyBuilderTest > shouldNotAllowNullProcessorSupplier PASSED

org.apache.kafka.streams.processor.TopologyBuilderTest > shouldNotSetApplicationIdToNull STARTED

org.apache.kafka.streams.processor.TopologyBuilderTest > shouldNotSetApplicationIdToNull PASSED

org.apache.kafka.streams.processor.TopologyBuilderTest > shouldNotAllowNullApplicationIdOnBuild STARTED

org.apache.kafka.streams.processor.TopologyBuilderTest > shouldNotAllowNullApplicationIdOnBuild PASSED

org.apache.kafka.streams.processor.TopologyBuilderTest > testSourceTopics STARTED

org.apache.kafka.streams.processor.TopologyBuilderTest > testSourceTopics PASSED

org.apache.kafka.streams.processor.TopologyBuilderTest > shouldNotAllowNullNameWhenAddingSink STARTED

org.apache.kafka.streams.processor.TopologyBuilderTest > shouldNotAllowNullNameWhenAddingSink PASSED

org.apache.kafka.streams.processor.TopologyBuilderTest > testNamedTopicMatchesAlreadyProvidedPattern STARTED

org.apache.kafka.streams.processor.TopologyBuilderTest > testNamedTopicMatchesAlreadyProvidedPattern PASSED

org.apache.kafka.streams.processor.TopologyBuilderTest > testAddSinkWithSameName STARTED

org.apache.kafka.streams.processor.TopologyBuilderTest > testAddSinkWithSameName PASSED

org.apache.kafka.streams.processor.TopologyBuilderTest > testAddSinkWithSelfParent STARTED

org.apache.kafka.streams.processor.TopologyBuilderTest > testAddSinkWithSelfParent PASSED

org.apache.kafka.streams.processor.TopologyBuilderTest > testAddProcessorWithSelfParent STARTED

org.apache.kafka.streams.processor.TopologyBuilderTest > testAddProcessorWithSelfParent PASSED

org.apache.kafka.streams.processor.TopologyBuilderTest > shouldAssociateStateStoreNameWhenStateStoreSupplierIsInternal STARTED

org.apache.kafka.streams.processor.TopologyBuilderTest > shouldAssociateStateStoreNameWhenStateStoreSupplierIsInternal PASSED

org.apache.kafka.streams.processor.TopologyBuilderTest > testAddStateStoreWithSink STARTED

org.apache.kafka.streams.processor.TopologyBuilderTest > testAddStateStoreWithSink PASSED

org.apache.kafka.streams.processor.TopologyBuilderTest > testTopicGroups STARTED

org.apache.kafka.streams.processor.TopologyBuilderTest > testTopicGroups PASSED

org.apache.kafka.streams.processor.TopologyBuilderTest > testBuild STARTED

org.apache.kafka.streams.processor.TopologyBuilderTest > testBuild PASSED

org.apache.kafka.streams.processor.TopologyBuilderTest > shouldNotAddNullStateStoreSupplier STARTED

org.apache.kafka.streams.processor.TopologyBuilderTest > shouldNotAddNullStateStoreSupplier PASSED

org.apache.kafka.streams.processor.TopologyBuilderTest > shouldNotAllowNullNameWhenAddingSource STARTED

org.apache.kafka.streams.processor.TopologyBuilderTest > shouldNotAllowNullNameWhenAddingSource PASSED

org.apache.kafka.streams.processor.TopologyBuilderTest > shouldNotAllowNullTopicWhenAddingSink STARTED

org.apache.kafka.streams.processor.TopologyBuilderTest > shouldNotAllowNullTopicWhenAddingSink PASSED

org.apache.kafka.streams.processor.TopologyBuilderTest > testAddStateStoreWithSource STARTED

org.apache.kafka.streams.processor.TopologyBuilderTest > testAddStateStoreWithSource PASSED

org.apache.kafka.streams.processor.TopologyBuilderTest > shouldNotAllowNullProcessorNameWhenConnectingProcessorAndStateStores STARTED

org.apache.kafka.streams.processor.TopologyBuilderTest > shouldNotAllowNullProcessorNameWhenConnectingProcessorAndStateStores PASSED

org.apache.kafka.streams.processor.TopologyBuilderTest > testAddSourceWithSameName STARTED

org.apache.kafka.streams.processor.TopologyBuilderTest > testAddSourceWithSameName PASSED

org.apache.kafka.streams.processor.TopologyBuilderTest > testAddMoreThanOnePatternSourceNode STARTED

org.apache.kafka.streams.processor.TopologyBuilderTest > testAddMoreThanOnePatternSourceNode PASSED

org.apache.kafka.streams.processor.TopologyBuilderTest > testAddProcessorWithSameName STARTED

org.apache.kafka.streams.processor.TopologyBuilderTest > testAddProcessorWithSameName PASSED

org.apache.kafka.streams.processor.TopologyBuilderTest > testAddSourceWithSameTopic STARTED

org.apache.kafka.streams.processor.TopologyBuilderTest > testAddSourceWithSameTopic PASSED

org.apache.kafka.streams.processor.TopologyBuilderTest > testTopicGroupsByStateStore STARTED

org.apache.kafka.streams.processor.TopologyBuilderTest > testTopicGroupsByStateStore PASSED

org.apache.kafka.streams.processor.TopologyBuilderTest > testAddStateStoreWithDuplicates STARTED

org.apache.kafka.streams.processor.TopologyBuilderTest > testAddStateStoreWithDuplicates PASSED

org.apache.kafka.streams.processor.TopologyBuilderTest > testPatternSourceTopic STARTED

org.apache.kafka.streams.processor.TopologyBuilderTest > testPatternSourceTopic PASSED

org.apache.kafka.streams.processor.TopologyBuilderTest > shouldAssociateStateStoreNameWhenStateStoreSupplierIsExternal STARTED

org.apache.kafka.streams.processor.TopologyBuilderTest > shouldAssociateStateStoreNameWhenStateStoreSupplierIsExternal PASSED

org.apache.kafka.streams.processor.TopologyBuilderTest > testAddSinkWithWrongParent STARTED

org.apache.kafka.streams.processor.TopologyBuilderTest > testAddSinkWithWrongParent PASSED

org.apache.kafka.streams.processor.TopologyBuilderTest > testPatternMatchesAlreadyProvidedTopicSource STARTED

org.apache.kafka.streams.processor.TopologyBuilderTest > testPatternMatchesAlreadyProvidedTopicSource PASSED

org.apache.kafka.streams.processor.TopologyBuilderTest > testAddSinkConnectedWithMultipleParent STARTED

org.apache.kafka.streams.processor.TopologyBuilderTest > testAddSinkConnectedWithMultipleParent PASSED

org.apache.kafka.streams.processor.TopologyBuilderTest > testSubscribeTopicNameAndPattern STARTED

org.apache.kafka.streams.processor.TopologyBuilderTest > testSubscribeTopicNameAndPattern PASSED

org.apache.kafka.streams.processor.TopologyBuilderTest > shouldNotAddNullInternalTopic STARTED

org.apache.kafka.streams.processor.TopologyBuilderTest > shouldNotAddNullInternalTopic PASSED

org.apache.kafka.streams.processor.TopologyBuilderTest > testAddProcessorWithWrongParent STARTED

org.apache.kafka.streams.processor.TopologyBuilderTest > testAddProcessorWithWrongParent PASSED

org.apache.kafka.streams.processor.TopologyBuilderTest > shouldNotAllowNullNameWhenAddingProcessor STARTED

org.apache.kafka.streams.processor.TopologyBuilderTest > shouldNotAllowNullNameWhenAddingProcessor PASSED

org.apache.kafka.streams.processor.TopologyBuilderTest > testAddStateStore STARTED

org.apache.kafka.streams.processor.TopologyBuilderTest > testAddStateStore PASSED

org.apache.kafka.streams.processor.TopologyBuilderTest > testAddSinkConnectedWithParent STARTED

org.apache.kafka.streams.processor.TopologyBuilderTest > testAddSinkConnectedWithParent PASSED

org.apache.kafka.streams.processor.TopologyBuilderTest > testAddStateStoreWithNonExistingProcessor STARTED

org.apache.kafka.streams.processor.TopologyBuilderTest > testAddStateStoreWithNonExistingProcessor PASSED

org.apache.kafka.streams.processor.TopologyBuilderTest > shouldCorrectlyMapStateStoreToInternalTopics STARTED

org.apache.kafka.streams.processor.TopologyBuilderTest > shouldCorrectlyMapStateStoreToInternalTopics PASSED

354 tests completed, 1 failed
:streams:test FAILED

FAILURE: Build failed with an exception.

* What went wrong:
Execution failed for task ':streams:test'.
> There were failing tests. See the report at: file://<https://builds.apache.org/job/kafka-trunk-jdk8/ws/streams/build/reports/tests/index.html>

* Try:
Run with --stacktrace option to get the stack trace. Run with --info or --debug option to get more log output.

BUILD FAILED

Total time: 2 hrs 1 mins 21.184 secs
Build step 'Execute shell' marked build as failure
Recording test results
Setting GRADLE_2_4_RC_2_HOME=/home/jenkins/jenkins-slave/tools/hudson.plugins.gradle.GradleInstallation/Gradle_2.4-rc-2
Setting GRADLE_2_4_RC_2_HOME=/home/jenkins/jenkins-slave/tools/hudson.plugins.gradle.GradleInstallation/Gradle_2.4-rc-2

Build failed in Jenkins: kafka-trunk-jdk8 #826

Posted by Apache Jenkins Server <je...@builds.apache.org>.
See <https://builds.apache.org/job/kafka-trunk-jdk8/826/changes>

Changes:

[cshapi] KAFKA-4056: Kafka logs values of sensitive configs like passwords

[cshapi] KAFKA-4053: remove redundant if/else statements in TopicCommand

------------------------------------------
[...truncated 12095 lines...]
org.apache.kafka.streams.processor.internals.assignment.AssignmentInfoTest > shouldDecodePreviousVersion PASSED

org.apache.kafka.streams.processor.internals.assignment.SubscriptionInfoTest > testEncodeDecode STARTED

org.apache.kafka.streams.processor.internals.assignment.SubscriptionInfoTest > testEncodeDecode PASSED

org.apache.kafka.streams.processor.internals.assignment.SubscriptionInfoTest > shouldEncodeDecodeWithUserEndPoint STARTED

org.apache.kafka.streams.processor.internals.assignment.SubscriptionInfoTest > shouldEncodeDecodeWithUserEndPoint PASSED

org.apache.kafka.streams.processor.internals.assignment.SubscriptionInfoTest > shouldBeBackwardCompatible STARTED

org.apache.kafka.streams.processor.internals.assignment.SubscriptionInfoTest > shouldBeBackwardCompatible PASSED

org.apache.kafka.streams.processor.internals.StreamThreadTest > testInjectClients STARTED

org.apache.kafka.streams.processor.internals.StreamThreadTest > testInjectClients PASSED

org.apache.kafka.streams.processor.internals.StreamThreadTest > testMaybeCommit STARTED

org.apache.kafka.streams.processor.internals.StreamThreadTest > testMaybeCommit PASSED

org.apache.kafka.streams.processor.internals.StreamThreadTest > testPartitionAssignmentChange STARTED

org.apache.kafka.streams.processor.internals.StreamThreadTest > testPartitionAssignmentChange PASSED

org.apache.kafka.streams.processor.internals.StreamThreadTest > testMaybeClean STARTED

org.apache.kafka.streams.processor.internals.StreamThreadTest > testMaybeClean PASSED

org.apache.kafka.streams.processor.internals.PunctuationQueueTest > testPunctuationInterval STARTED

org.apache.kafka.streams.processor.internals.PunctuationQueueTest > testPunctuationInterval PASSED

org.apache.kafka.streams.processor.internals.RecordQueueTest > testTimeTracking STARTED

org.apache.kafka.streams.processor.internals.RecordQueueTest > testTimeTracking PASSED

org.apache.kafka.streams.processor.internals.ProcessorStateManagerTest > testRegisterNonPersistentStore STARTED

org.apache.kafka.streams.processor.internals.ProcessorStateManagerTest > testRegisterNonPersistentStore PASSED

org.apache.kafka.streams.processor.internals.ProcessorStateManagerTest > testGetStore STARTED

org.apache.kafka.streams.processor.internals.ProcessorStateManagerTest > testGetStore PASSED

org.apache.kafka.streams.processor.internals.ProcessorStateManagerTest > testClose STARTED

org.apache.kafka.streams.processor.internals.ProcessorStateManagerTest > testClose PASSED

org.apache.kafka.streams.processor.internals.ProcessorStateManagerTest > testChangeLogOffsets STARTED

org.apache.kafka.streams.processor.internals.ProcessorStateManagerTest > testChangeLogOffsets PASSED

org.apache.kafka.streams.processor.internals.ProcessorStateManagerTest > testRegisterPersistentStore STARTED

org.apache.kafka.streams.processor.internals.ProcessorStateManagerTest > testRegisterPersistentStore PASSED

org.apache.kafka.streams.processor.internals.ProcessorStateManagerTest > testNoTopic STARTED

org.apache.kafka.streams.processor.internals.ProcessorStateManagerTest > testNoTopic PASSED

org.apache.kafka.streams.processor.internals.StreamTaskTest > testProcessOrder STARTED

org.apache.kafka.streams.processor.internals.StreamTaskTest > testProcessOrder PASSED

org.apache.kafka.streams.processor.internals.StreamTaskTest > testPauseResume STARTED

org.apache.kafka.streams.processor.internals.StreamTaskTest > testPauseResume PASSED

org.apache.kafka.streams.processor.internals.StreamTaskTest > testMaybePunctuate STARTED

org.apache.kafka.streams.processor.internals.StreamTaskTest > testMaybePunctuate PASSED

org.apache.kafka.streams.processor.internals.QuickUnionTest > testUnite STARTED

org.apache.kafka.streams.processor.internals.QuickUnionTest > testUnite PASSED

org.apache.kafka.streams.processor.internals.QuickUnionTest > testUniteMany STARTED

org.apache.kafka.streams.processor.internals.QuickUnionTest > testUniteMany PASSED

org.apache.kafka.streams.processor.TopologyBuilderTest > shouldNotAllowNullProcessorSupplier STARTED

org.apache.kafka.streams.processor.TopologyBuilderTest > shouldNotAllowNullProcessorSupplier PASSED

org.apache.kafka.streams.processor.TopologyBuilderTest > shouldNotSetApplicationIdToNull STARTED

org.apache.kafka.streams.processor.TopologyBuilderTest > shouldNotSetApplicationIdToNull PASSED

org.apache.kafka.streams.processor.TopologyBuilderTest > shouldNotAllowNullApplicationIdOnBuild STARTED

org.apache.kafka.streams.processor.TopologyBuilderTest > shouldNotAllowNullApplicationIdOnBuild PASSED

org.apache.kafka.streams.processor.TopologyBuilderTest > testSourceTopics STARTED

org.apache.kafka.streams.processor.TopologyBuilderTest > testSourceTopics PASSED

org.apache.kafka.streams.processor.TopologyBuilderTest > shouldNotAllowNullNameWhenAddingSink STARTED

org.apache.kafka.streams.processor.TopologyBuilderTest > shouldNotAllowNullNameWhenAddingSink PASSED

org.apache.kafka.streams.processor.TopologyBuilderTest > testNamedTopicMatchesAlreadyProvidedPattern STARTED

org.apache.kafka.streams.processor.TopologyBuilderTest > testNamedTopicMatchesAlreadyProvidedPattern PASSED

org.apache.kafka.streams.processor.TopologyBuilderTest > testAddSinkWithSameName STARTED

org.apache.kafka.streams.processor.TopologyBuilderTest > testAddSinkWithSameName PASSED

org.apache.kafka.streams.processor.TopologyBuilderTest > testAddSinkWithSelfParent STARTED

org.apache.kafka.streams.processor.TopologyBuilderTest > testAddSinkWithSelfParent PASSED

org.apache.kafka.streams.processor.TopologyBuilderTest > testAddProcessorWithSelfParent STARTED

org.apache.kafka.streams.processor.TopologyBuilderTest > testAddProcessorWithSelfParent PASSED

org.apache.kafka.streams.processor.TopologyBuilderTest > shouldAssociateStateStoreNameWhenStateStoreSupplierIsInternal STARTED

org.apache.kafka.streams.processor.TopologyBuilderTest > shouldAssociateStateStoreNameWhenStateStoreSupplierIsInternal PASSED

org.apache.kafka.streams.processor.TopologyBuilderTest > testAddStateStoreWithSink STARTED

org.apache.kafka.streams.processor.TopologyBuilderTest > testAddStateStoreWithSink PASSED

org.apache.kafka.streams.processor.TopologyBuilderTest > testTopicGroups STARTED

org.apache.kafka.streams.processor.TopologyBuilderTest > testTopicGroups PASSED

org.apache.kafka.streams.processor.TopologyBuilderTest > testBuild STARTED

org.apache.kafka.streams.processor.TopologyBuilderTest > testBuild PASSED

org.apache.kafka.streams.processor.TopologyBuilderTest > shouldNotAddNullStateStoreSupplier STARTED

org.apache.kafka.streams.processor.TopologyBuilderTest > shouldNotAddNullStateStoreSupplier PASSED

org.apache.kafka.streams.processor.TopologyBuilderTest > shouldNotAllowNullNameWhenAddingSource STARTED

org.apache.kafka.streams.processor.TopologyBuilderTest > shouldNotAllowNullNameWhenAddingSource PASSED

org.apache.kafka.streams.processor.TopologyBuilderTest > shouldNotAllowNullTopicWhenAddingSink STARTED

org.apache.kafka.streams.processor.TopologyBuilderTest > shouldNotAllowNullTopicWhenAddingSink PASSED

org.apache.kafka.streams.processor.TopologyBuilderTest > testAddStateStoreWithSource STARTED

org.apache.kafka.streams.processor.TopologyBuilderTest > testAddStateStoreWithSource PASSED

org.apache.kafka.streams.processor.TopologyBuilderTest > shouldNotAllowNullProcessorNameWhenConnectingProcessorAndStateStores STARTED

org.apache.kafka.streams.processor.TopologyBuilderTest > shouldNotAllowNullProcessorNameWhenConnectingProcessorAndStateStores PASSED

org.apache.kafka.streams.processor.TopologyBuilderTest > testAddSourceWithSameName STARTED

org.apache.kafka.streams.processor.TopologyBuilderTest > testAddSourceWithSameName PASSED

org.apache.kafka.streams.processor.TopologyBuilderTest > testAddMoreThanOnePatternSourceNode STARTED

org.apache.kafka.streams.processor.TopologyBuilderTest > testAddMoreThanOnePatternSourceNode PASSED

org.apache.kafka.streams.processor.TopologyBuilderTest > testAddProcessorWithSameName STARTED

org.apache.kafka.streams.processor.TopologyBuilderTest > testAddProcessorWithSameName PASSED

org.apache.kafka.streams.processor.TopologyBuilderTest > testAddSourceWithSameTopic STARTED

org.apache.kafka.streams.processor.TopologyBuilderTest > testAddSourceWithSameTopic PASSED

org.apache.kafka.streams.processor.TopologyBuilderTest > testTopicGroupsByStateStore STARTED

org.apache.kafka.streams.processor.TopologyBuilderTest > testTopicGroupsByStateStore PASSED

org.apache.kafka.streams.processor.TopologyBuilderTest > testAddStateStoreWithDuplicates STARTED

org.apache.kafka.streams.processor.TopologyBuilderTest > testAddStateStoreWithDuplicates PASSED

org.apache.kafka.streams.processor.TopologyBuilderTest > testPatternSourceTopic STARTED

org.apache.kafka.streams.processor.TopologyBuilderTest > testPatternSourceTopic PASSED

org.apache.kafka.streams.processor.TopologyBuilderTest > shouldAssociateStateStoreNameWhenStateStoreSupplierIsExternal STARTED

org.apache.kafka.streams.processor.TopologyBuilderTest > shouldAssociateStateStoreNameWhenStateStoreSupplierIsExternal PASSED

org.apache.kafka.streams.processor.TopologyBuilderTest > testAddSinkWithWrongParent STARTED

org.apache.kafka.streams.processor.TopologyBuilderTest > testAddSinkWithWrongParent PASSED

org.apache.kafka.streams.processor.TopologyBuilderTest > testPatternMatchesAlreadyProvidedTopicSource STARTED

org.apache.kafka.streams.processor.TopologyBuilderTest > testPatternMatchesAlreadyProvidedTopicSource PASSED

org.apache.kafka.streams.processor.TopologyBuilderTest > testAddSinkConnectedWithMultipleParent STARTED

org.apache.kafka.streams.processor.TopologyBuilderTest > testAddSinkConnectedWithMultipleParent PASSED

org.apache.kafka.streams.processor.TopologyBuilderTest > testSubscribeTopicNameAndPattern STARTED

org.apache.kafka.streams.processor.TopologyBuilderTest > testSubscribeTopicNameAndPattern PASSED

org.apache.kafka.streams.processor.TopologyBuilderTest > shouldNotAddNullInternalTopic STARTED

org.apache.kafka.streams.processor.TopologyBuilderTest > shouldNotAddNullInternalTopic PASSED

org.apache.kafka.streams.processor.TopologyBuilderTest > testAddProcessorWithWrongParent STARTED

org.apache.kafka.streams.processor.TopologyBuilderTest > testAddProcessorWithWrongParent PASSED

org.apache.kafka.streams.processor.TopologyBuilderTest > shouldNotAllowNullNameWhenAddingProcessor STARTED

org.apache.kafka.streams.processor.TopologyBuilderTest > shouldNotAllowNullNameWhenAddingProcessor PASSED

org.apache.kafka.streams.processor.TopologyBuilderTest > testAddStateStore STARTED

org.apache.kafka.streams.processor.TopologyBuilderTest > testAddStateStore PASSED

org.apache.kafka.streams.processor.TopologyBuilderTest > testAddSinkConnectedWithParent STARTED

org.apache.kafka.streams.processor.TopologyBuilderTest > testAddSinkConnectedWithParent PASSED

org.apache.kafka.streams.processor.TopologyBuilderTest > testAddStateStoreWithNonExistingProcessor STARTED

org.apache.kafka.streams.processor.TopologyBuilderTest > testAddStateStoreWithNonExistingProcessor PASSED

org.apache.kafka.streams.processor.TopologyBuilderTest > shouldCorrectlyMapStateStoreToInternalTopics STARTED

org.apache.kafka.streams.processor.TopologyBuilderTest > shouldCorrectlyMapStateStoreToInternalTopics PASSED

354 tests completed, 2 failed
:streams:test FAILED

FAILURE: Build failed with an exception.

* What went wrong:
Execution failed for task ':streams:test'.
> There were failing tests. See the report at: file://<https://builds.apache.org/job/kafka-trunk-jdk8/ws/streams/build/reports/tests/index.html>

* Try:
Run with --stacktrace option to get the stack trace. Run with --info or --debug option to get more log output.

BUILD FAILED

Total time: 1 hrs 59 mins 16.758 secs
Build step 'Execute shell' marked build as failure
Recording test results
Setting GRADLE_2_4_RC_2_HOME=/home/jenkins/jenkins-slave/tools/hudson.plugins.gradle.GradleInstallation/Gradle_2.4-rc-2
Setting GRADLE_2_4_RC_2_HOME=/home/jenkins/jenkins-slave/tools/hudson.plugins.gradle.GradleInstallation/Gradle_2.4-rc-2

Build failed in Jenkins: kafka-trunk-jdk8 #825

Posted by Apache Jenkins Server <je...@builds.apache.org>.
See <https://builds.apache.org/job/kafka-trunk-jdk8/825/changes>

Changes:

[jjkoshy] KAFKA-4050; Allow configuration of the PRNG used for SSL

------------------------------------------
[...truncated 12070 lines...]
org.apache.kafka.streams.processor.internals.assignment.AssignmentInfoTest > shouldDecodePreviousVersion PASSED

org.apache.kafka.streams.processor.internals.assignment.SubscriptionInfoTest > testEncodeDecode STARTED

org.apache.kafka.streams.processor.internals.assignment.SubscriptionInfoTest > testEncodeDecode PASSED

org.apache.kafka.streams.processor.internals.assignment.SubscriptionInfoTest > shouldEncodeDecodeWithUserEndPoint STARTED

org.apache.kafka.streams.processor.internals.assignment.SubscriptionInfoTest > shouldEncodeDecodeWithUserEndPoint PASSED

org.apache.kafka.streams.processor.internals.assignment.SubscriptionInfoTest > shouldBeBackwardCompatible STARTED

org.apache.kafka.streams.processor.internals.assignment.SubscriptionInfoTest > shouldBeBackwardCompatible PASSED

org.apache.kafka.streams.processor.internals.StreamThreadTest > testInjectClients STARTED

org.apache.kafka.streams.processor.internals.StreamThreadTest > testInjectClients PASSED

org.apache.kafka.streams.processor.internals.StreamThreadTest > testMaybeCommit STARTED

org.apache.kafka.streams.processor.internals.StreamThreadTest > testMaybeCommit PASSED

org.apache.kafka.streams.processor.internals.StreamThreadTest > testPartitionAssignmentChange STARTED

org.apache.kafka.streams.processor.internals.StreamThreadTest > testPartitionAssignmentChange PASSED

org.apache.kafka.streams.processor.internals.StreamThreadTest > testMaybeClean STARTED

org.apache.kafka.streams.processor.internals.StreamThreadTest > testMaybeClean PASSED

org.apache.kafka.streams.processor.internals.PunctuationQueueTest > testPunctuationInterval STARTED

org.apache.kafka.streams.processor.internals.PunctuationQueueTest > testPunctuationInterval PASSED

org.apache.kafka.streams.processor.internals.RecordQueueTest > testTimeTracking STARTED

org.apache.kafka.streams.processor.internals.RecordQueueTest > testTimeTracking PASSED

org.apache.kafka.streams.processor.internals.ProcessorStateManagerTest > testRegisterNonPersistentStore STARTED

org.apache.kafka.streams.processor.internals.ProcessorStateManagerTest > testRegisterNonPersistentStore PASSED

org.apache.kafka.streams.processor.internals.ProcessorStateManagerTest > testGetStore STARTED

org.apache.kafka.streams.processor.internals.ProcessorStateManagerTest > testGetStore PASSED

org.apache.kafka.streams.processor.internals.ProcessorStateManagerTest > testClose STARTED

org.apache.kafka.streams.processor.internals.ProcessorStateManagerTest > testClose PASSED

org.apache.kafka.streams.processor.internals.ProcessorStateManagerTest > testChangeLogOffsets STARTED

org.apache.kafka.streams.processor.internals.ProcessorStateManagerTest > testChangeLogOffsets PASSED

org.apache.kafka.streams.processor.internals.ProcessorStateManagerTest > testRegisterPersistentStore STARTED

org.apache.kafka.streams.processor.internals.ProcessorStateManagerTest > testRegisterPersistentStore PASSED

org.apache.kafka.streams.processor.internals.ProcessorStateManagerTest > testNoTopic STARTED

org.apache.kafka.streams.processor.internals.ProcessorStateManagerTest > testNoTopic PASSED

org.apache.kafka.streams.processor.internals.StreamTaskTest > testProcessOrder STARTED

org.apache.kafka.streams.processor.internals.StreamTaskTest > testProcessOrder PASSED

org.apache.kafka.streams.processor.internals.StreamTaskTest > testPauseResume STARTED

org.apache.kafka.streams.processor.internals.StreamTaskTest > testPauseResume PASSED

org.apache.kafka.streams.processor.internals.StreamTaskTest > testMaybePunctuate STARTED

org.apache.kafka.streams.processor.internals.StreamTaskTest > testMaybePunctuate PASSED

org.apache.kafka.streams.processor.internals.QuickUnionTest > testUnite STARTED

org.apache.kafka.streams.processor.internals.QuickUnionTest > testUnite PASSED

org.apache.kafka.streams.processor.internals.QuickUnionTest > testUniteMany STARTED

org.apache.kafka.streams.processor.internals.QuickUnionTest > testUniteMany PASSED

org.apache.kafka.streams.processor.TopologyBuilderTest > shouldNotAllowNullProcessorSupplier STARTED

org.apache.kafka.streams.processor.TopologyBuilderTest > shouldNotAllowNullProcessorSupplier PASSED

org.apache.kafka.streams.processor.TopologyBuilderTest > shouldNotSetApplicationIdToNull STARTED

org.apache.kafka.streams.processor.TopologyBuilderTest > shouldNotSetApplicationIdToNull PASSED

org.apache.kafka.streams.processor.TopologyBuilderTest > shouldNotAllowNullApplicationIdOnBuild STARTED

org.apache.kafka.streams.processor.TopologyBuilderTest > shouldNotAllowNullApplicationIdOnBuild PASSED

org.apache.kafka.streams.processor.TopologyBuilderTest > testSourceTopics STARTED

org.apache.kafka.streams.processor.TopologyBuilderTest > testSourceTopics PASSED

org.apache.kafka.streams.processor.TopologyBuilderTest > shouldNotAllowNullNameWhenAddingSink STARTED

org.apache.kafka.streams.processor.TopologyBuilderTest > shouldNotAllowNullNameWhenAddingSink PASSED

org.apache.kafka.streams.processor.TopologyBuilderTest > testNamedTopicMatchesAlreadyProvidedPattern STARTED

org.apache.kafka.streams.processor.TopologyBuilderTest > testNamedTopicMatchesAlreadyProvidedPattern PASSED

org.apache.kafka.streams.processor.TopologyBuilderTest > testAddSinkWithSameName STARTED

org.apache.kafka.streams.processor.TopologyBuilderTest > testAddSinkWithSameName PASSED

org.apache.kafka.streams.processor.TopologyBuilderTest > testAddSinkWithSelfParent STARTED

org.apache.kafka.streams.processor.TopologyBuilderTest > testAddSinkWithSelfParent PASSED

org.apache.kafka.streams.processor.TopologyBuilderTest > testAddProcessorWithSelfParent STARTED

org.apache.kafka.streams.processor.TopologyBuilderTest > testAddProcessorWithSelfParent PASSED

org.apache.kafka.streams.processor.TopologyBuilderTest > shouldAssociateStateStoreNameWhenStateStoreSupplierIsInternal STARTED

org.apache.kafka.streams.processor.TopologyBuilderTest > shouldAssociateStateStoreNameWhenStateStoreSupplierIsInternal PASSED

org.apache.kafka.streams.processor.TopologyBuilderTest > testAddStateStoreWithSink STARTED

org.apache.kafka.streams.processor.TopologyBuilderTest > testAddStateStoreWithSink PASSED

org.apache.kafka.streams.processor.TopologyBuilderTest > testTopicGroups STARTED

org.apache.kafka.streams.processor.TopologyBuilderTest > testTopicGroups PASSED

org.apache.kafka.streams.processor.TopologyBuilderTest > testBuild STARTED

org.apache.kafka.streams.processor.TopologyBuilderTest > testBuild PASSED

org.apache.kafka.streams.processor.TopologyBuilderTest > shouldNotAddNullStateStoreSupplier STARTED

org.apache.kafka.streams.processor.TopologyBuilderTest > shouldNotAddNullStateStoreSupplier PASSED

org.apache.kafka.streams.processor.TopologyBuilderTest > shouldNotAllowNullNameWhenAddingSource STARTED

org.apache.kafka.streams.processor.TopologyBuilderTest > shouldNotAllowNullNameWhenAddingSource PASSED

org.apache.kafka.streams.processor.TopologyBuilderTest > shouldNotAllowNullTopicWhenAddingSink STARTED

org.apache.kafka.streams.processor.TopologyBuilderTest > shouldNotAllowNullTopicWhenAddingSink PASSED

org.apache.kafka.streams.processor.TopologyBuilderTest > testAddStateStoreWithSource STARTED

org.apache.kafka.streams.processor.TopologyBuilderTest > testAddStateStoreWithSource PASSED

org.apache.kafka.streams.processor.TopologyBuilderTest > shouldNotAllowNullProcessorNameWhenConnectingProcessorAndStateStores STARTED

org.apache.kafka.streams.processor.TopologyBuilderTest > shouldNotAllowNullProcessorNameWhenConnectingProcessorAndStateStores PASSED

org.apache.kafka.streams.processor.TopologyBuilderTest > testAddSourceWithSameName STARTED

org.apache.kafka.streams.processor.TopologyBuilderTest > testAddSourceWithSameName PASSED

org.apache.kafka.streams.processor.TopologyBuilderTest > testAddMoreThanOnePatternSourceNode STARTED

org.apache.kafka.streams.processor.TopologyBuilderTest > testAddMoreThanOnePatternSourceNode PASSED

org.apache.kafka.streams.processor.TopologyBuilderTest > testAddProcessorWithSameName STARTED

org.apache.kafka.streams.processor.TopologyBuilderTest > testAddProcessorWithSameName PASSED

org.apache.kafka.streams.processor.TopologyBuilderTest > testAddSourceWithSameTopic STARTED

org.apache.kafka.streams.processor.TopologyBuilderTest > testAddSourceWithSameTopic PASSED

org.apache.kafka.streams.processor.TopologyBuilderTest > testTopicGroupsByStateStore STARTED

org.apache.kafka.streams.processor.TopologyBuilderTest > testTopicGroupsByStateStore PASSED

org.apache.kafka.streams.processor.TopologyBuilderTest > testAddStateStoreWithDuplicates STARTED

org.apache.kafka.streams.processor.TopologyBuilderTest > testAddStateStoreWithDuplicates PASSED

org.apache.kafka.streams.processor.TopologyBuilderTest > testPatternSourceTopic STARTED

org.apache.kafka.streams.processor.TopologyBuilderTest > testPatternSourceTopic PASSED

org.apache.kafka.streams.processor.TopologyBuilderTest > shouldAssociateStateStoreNameWhenStateStoreSupplierIsExternal STARTED

org.apache.kafka.streams.processor.TopologyBuilderTest > shouldAssociateStateStoreNameWhenStateStoreSupplierIsExternal PASSED

org.apache.kafka.streams.processor.TopologyBuilderTest > testAddSinkWithWrongParent STARTED

org.apache.kafka.streams.processor.TopologyBuilderTest > testAddSinkWithWrongParent PASSED

org.apache.kafka.streams.processor.TopologyBuilderTest > testPatternMatchesAlreadyProvidedTopicSource STARTED

org.apache.kafka.streams.processor.TopologyBuilderTest > testPatternMatchesAlreadyProvidedTopicSource PASSED

org.apache.kafka.streams.processor.TopologyBuilderTest > testAddSinkConnectedWithMultipleParent STARTED

org.apache.kafka.streams.processor.TopologyBuilderTest > testAddSinkConnectedWithMultipleParent PASSED

org.apache.kafka.streams.processor.TopologyBuilderTest > testSubscribeTopicNameAndPattern STARTED

org.apache.kafka.streams.processor.TopologyBuilderTest > testSubscribeTopicNameAndPattern PASSED

org.apache.kafka.streams.processor.TopologyBuilderTest > shouldNotAddNullInternalTopic STARTED

org.apache.kafka.streams.processor.TopologyBuilderTest > shouldNotAddNullInternalTopic PASSED

org.apache.kafka.streams.processor.TopologyBuilderTest > testAddProcessorWithWrongParent STARTED

org.apache.kafka.streams.processor.TopologyBuilderTest > testAddProcessorWithWrongParent PASSED

org.apache.kafka.streams.processor.TopologyBuilderTest > shouldNotAllowNullNameWhenAddingProcessor STARTED

org.apache.kafka.streams.processor.TopologyBuilderTest > shouldNotAllowNullNameWhenAddingProcessor PASSED

org.apache.kafka.streams.processor.TopologyBuilderTest > testAddStateStore STARTED

org.apache.kafka.streams.processor.TopologyBuilderTest > testAddStateStore PASSED

org.apache.kafka.streams.processor.TopologyBuilderTest > testAddSinkConnectedWithParent STARTED

org.apache.kafka.streams.processor.TopologyBuilderTest > testAddSinkConnectedWithParent PASSED

org.apache.kafka.streams.processor.TopologyBuilderTest > testAddStateStoreWithNonExistingProcessor STARTED

org.apache.kafka.streams.processor.TopologyBuilderTest > testAddStateStoreWithNonExistingProcessor PASSED

org.apache.kafka.streams.processor.TopologyBuilderTest > shouldCorrectlyMapStateStoreToInternalTopics STARTED

org.apache.kafka.streams.processor.TopologyBuilderTest > shouldCorrectlyMapStateStoreToInternalTopics PASSED

354 tests completed, 1 failed
:streams:test FAILED

FAILURE: Build failed with an exception.

* What went wrong:
Execution failed for task ':streams:test'.
> There were failing tests. See the report at: file://<https://builds.apache.org/job/kafka-trunk-jdk8/ws/streams/build/reports/tests/index.html>

* Try:
Run with --stacktrace option to get the stack trace. Run with --info or --debug option to get more log output.

BUILD FAILED

Total time: 1 hrs 57 mins 23.686 secs
Build step 'Execute shell' marked build as failure
Recording test results
Setting GRADLE_2_4_RC_2_HOME=/home/jenkins/jenkins-slave/tools/hudson.plugins.gradle.GradleInstallation/Gradle_2.4-rc-2
Setting GRADLE_2_4_RC_2_HOME=/home/jenkins/jenkins-slave/tools/hudson.plugins.gradle.GradleInstallation/Gradle_2.4-rc-2