You are viewing a plain text version of this content. The canonical link for it is here.
Posted to issues@ozone.apache.org by "Chung En Lee (Jira)" <ji...@apache.org> on 2024/12/18 18:46:00 UTC
[jira] [Updated] (HDDS-11869) Enable OM Ratis in TestOzoneDelegationTokenSecretManager
[ https://issues.apache.org/jira/browse/HDDS-11869?page=com.atlassian.jira.plugin.system.issuetabpanels:all-tabpanel ]
Chung En Lee updated HDDS-11869:
--------------------------------
Status: Patch Available (was: In Progress)
> Enable OM Ratis in TestOzoneDelegationTokenSecretManager
> --------------------------------------------------------
>
> Key: HDDS-11869
> URL: https://issues.apache.org/jira/browse/HDDS-11869
> Project: Apache Ozone
> Issue Type: Sub-task
> Components: test
> Reporter: Attila Doroszlai
> Assignee: Chung En Lee
> Priority: Major
>
> {{TestOzoneDelegationTokenSecretManager}} requires update to test renew/cancel with OM Ratis enabled.
> {code}
> [ERROR] Tests run: 15, Failures: 1, Errors: 3, Skipped: 0, Time elapsed: 5.394 s <<< FAILURE! - in org.apache.hadoop.ozone.security.TestOzoneDelegationTokenSecretManager
> [ERROR] org.apache.hadoop.ozone.security.TestOzoneDelegationTokenSecretManager.testCancelTokenSuccess Time elapsed: 0.202 s <<< ERROR!
> org.apache.hadoop.security.token.SecretManager$InvalidToken: Token not found in-memory map of tokens(OzoneToken owner=testUser, renewer=testUser, realUser=testUser, issueDate=2024-12-06T08:45:46.519Z, maxDate=2024-12-06T08:46:06.519Z, sequenceNumber=1, masterKeyId=1, strToSign=null, signature=null, awsAccessKeyId=null, omServiceId=omServiceIdDefault, omCertSerialId=null, secretKeyId=275af8cd-0aa6-4875-9d32-e9f3dfdfc136)
> at org.apache.hadoop.ozone.security.OzoneDelegationTokenSecretManager.cancelToken(OzoneDelegationTokenSecretManager.java:395)
> at org.apache.hadoop.ozone.security.TestOzoneDelegationTokenSecretManager.testCancelTokenSuccess(TestOzoneDelegationTokenSecretManager.java:357)
> [ERROR] org.apache.hadoop.ozone.security.TestOzoneDelegationTokenSecretManager.testReloadAndRenewToken Time elapsed: 0.214 s <<< ERROR!
> org.apache.hadoop.security.token.SecretManager$InvalidToken: token (OzoneToken owner=testUser, renewer=testUser, realUser=testUser, issueDate=2024-12-06T08:45:47.016Z, maxDate=2024-12-06T08:46:07.016Z, sequenceNumber=1, masterKeyId=1, strToSign=null, signature=null, awsAccessKeyId=null, omServiceId=omServiceIdDefault, omCertSerialId=null, secretKeyId=524a3e23-632a-4a4f-8619-f14ff7ddbcff) can't be found in cache
> at org.apache.hadoop.ozone.security.OzoneDelegationTokenSecretManager.validateToken(OzoneDelegationTokenSecretManager.java:438)
> at org.apache.hadoop.ozone.security.OzoneDelegationTokenSecretManager.renewToken(OzoneDelegationTokenSecretManager.java:309)
> at org.apache.hadoop.ozone.security.TestOzoneDelegationTokenSecretManager.testRenewTokenSuccessHelper(TestOzoneDelegationTokenSecretManager.java:266)
> at org.apache.hadoop.ozone.security.TestOzoneDelegationTokenSecretManager.testReloadAndRenewToken(TestOzoneDelegationTokenSecretManager.java:272)
> [ERROR] org.apache.hadoop.ozone.security.TestOzoneDelegationTokenSecretManager.testRenewTokenSuccess Time elapsed: 0.223 s <<< ERROR!
> org.apache.hadoop.security.token.SecretManager$InvalidToken: token (OzoneToken owner=testUser, renewer=testUser, realUser=testUser, issueDate=2024-12-06T08:45:47.585Z, maxDate=2024-12-06T08:46:07.585Z, sequenceNumber=1, masterKeyId=1, strToSign=null, signature=null, awsAccessKeyId=null, omServiceId=omServiceIdDefault, omCertSerialId=null, secretKeyId=8de83363-3002-479f-9949-7424c1c3b534) can't be found in cache
> at org.apache.hadoop.ozone.security.OzoneDelegationTokenSecretManager.validateToken(OzoneDelegationTokenSecretManager.java:438)
> at org.apache.hadoop.ozone.security.OzoneDelegationTokenSecretManager.renewToken(OzoneDelegationTokenSecretManager.java:309)
> at org.apache.hadoop.ozone.security.TestOzoneDelegationTokenSecretManager.testRenewTokenSuccessHelper(TestOzoneDelegationTokenSecretManager.java:266)
> at org.apache.hadoop.ozone.security.TestOzoneDelegationTokenSecretManager.testRenewTokenSuccess(TestOzoneDelegationTokenSecretManager.java:277)
> [ERROR] org.apache.hadoop.ozone.security.TestOzoneDelegationTokenSecretManager.testRenewTokenFailure Time elapsed: 0.159 s <<< FAILURE!
> org.opentest4j.AssertionFailedError: Unexpected exception type thrown, expected: <org.apache.hadoop.security.AccessControlException> but was: <org.apache.hadoop.security.token.SecretManager.InvalidToken>
> at org.junit.jupiter.api.Assertions.assertThrows(Assertions.java:3128)
> at org.apache.hadoop.ozone.security.TestOzoneDelegationTokenSecretManager.testRenewTokenFailure(TestOzoneDelegationTokenSecretManager.java:291)
> {code}
--
This message was sent by Atlassian Jira
(v8.20.10#820010)
---------------------------------------------------------------------
To unsubscribe, e-mail: issues-unsubscribe@ozone.apache.org
For additional commands, e-mail: issues-help@ozone.apache.org