You are viewing a plain text version of this content. The canonical link for it is here.
Posted to notifications@qpid.apache.org by Apache Jenkins Server <je...@builds.apache.org> on 2018/04/13 13:27:50 UTC
Build failed in Jenkins: Qpid-Broker-J-TestMatrix » ubuntu,JDK 1.8 (latest),java-dby.1-0 #4195
See <https://builds.apache.org/job/Qpid-Broker-J-TestMatrix/Ubuntu%20Slaves=ubuntu,jdk=JDK%201.8%20(latest),profile=java-dby.1-0/4195/display/redirect?page=changes>
Changes:
[kwall] QPID-8163: [Access Control Plugin] Support OWNER psuedo principal in ACL
------------------------------------------
[...truncated 406.55 KB...]
[INFO] Copying 3 resources
[INFO]
[INFO] --- maven-compiler-plugin:3.5.1:compile (default-compile) @ qpid-tck ---
[INFO] Compiling 1 source file to <https://builds.apache.org/job/Qpid-Broker-J-TestMatrix/Ubuntu%20Slaves=ubuntu,jdk=JDK%201.8%20(latest),profile=java-dby.1-0/ws/tck/target/classes>
[INFO] <https://builds.apache.org/job/Qpid-Broker-J-TestMatrix/Ubuntu%20Slaves=ubuntu,jdk=JDK%201.8%20(latest),profile=java-dby.1-0/ws/tck/src/main/java/org/apache/qpid/tck/ManageQpidJMSResources.java>: <https://builds.apache.org/job/Qpid-Broker-J-TestMatrix/Ubuntu%20Slaves=ubuntu,jdk=JDK%201.8%20(latest),profile=java-dby.1-0/ws/tck/src/main/java/org/apache/qpid/tck/ManageQpidJMSResources.java> uses unchecked or unsafe operations.
[INFO] <https://builds.apache.org/job/Qpid-Broker-J-TestMatrix/Ubuntu%20Slaves=ubuntu,jdk=JDK%201.8%20(latest),profile=java-dby.1-0/ws/tck/src/main/java/org/apache/qpid/tck/ManageQpidJMSResources.java>: Recompile with -Xlint:unchecked for details.
[INFO]
[INFO] --- maven-resources-plugin:2.7:testResources (default-testResources) @ qpid-tck ---
[INFO] Using 'UTF-8' encoding to copy filtered resources.
[INFO] Copying 5 resources
[INFO] Copying 3 resources
[INFO]
[INFO] --- maven-compiler-plugin:3.5.1:testCompile (default-testCompile) @ qpid-tck ---
[INFO] No sources to compile
[INFO]
[INFO] --- maven-surefire-plugin:2.19.1:test (default-test) @ qpid-tck ---
[INFO] Tests are skipped.
[INFO]
[INFO] --- maven-jar-plugin:3.0.0:jar (default-jar) @ qpid-tck ---
[INFO] Building jar: <https://builds.apache.org/job/Qpid-Broker-J-TestMatrix/Ubuntu%20Slaves=ubuntu,jdk=JDK%201.8%20(latest),profile=java-dby.1-0/ws/tck/target/qpid-tck-7.1.0-SNAPSHOT.jar>
[INFO]
[INFO] --- maven-site-plugin:3.5.1:attach-descriptor (attach-descriptor) @ qpid-tck ---
[INFO]
[INFO] ------------------------------------------------------------------------
[INFO] Building Apache Qpid Broker-J Docbook 7.1.0-SNAPSHOT
[INFO] ------------------------------------------------------------------------
[INFO]
[INFO] --- maven-clean-plugin:3.0.0:clean (default-clean) @ qpid-java-doc ---
[INFO]
[INFO] --- maven-antrun-plugin:1.8:run (output-test-properties) @ qpid-java-doc ---
[INFO] Executing tasks
main:
[echo] Qpid Test Profile Properties
[echo] [profile] java-dby.1-0
[echo] [profile.broker.version] 1.0
[echo] [profile.virtualhostnode.type] Memory
[echo] [profile.virtualhostnode.context.blueprint] {"type":"ProvidedStore","globalAddressDomains":"${qpid.globalAddressDomains}"}
[echo] [profile.test_receive_timeout] 3000
[INFO] Executed tasks
[INFO]
[INFO] --- maven-enforcer-plugin:1.4.1:enforce (enforce-minimum-versions) @ qpid-java-doc ---
[INFO]
[INFO] --- maven-enforcer-plugin:1.4.1:enforce (enforce-versions-standard-properties) @ qpid-java-doc ---
[INFO]
[INFO] --- maven-enforcer-plugin:1.4.1:enforce (enforce-enableAmqp0x) @ qpid-java-doc ---
[INFO]
[INFO] --- jacoco-maven-plugin:0.7.5.201505241946:prepare-agent (default-prepare-agent) @ qpid-java-doc ---
[INFO] argLine set to "-javaagent:/home/jenkins/.m2/repository/org/jacoco/org.jacoco.agent/0.7.5.201505241946/org.jacoco.agent-0.7.5.201505241946-runtime.jar=destfile=<https://builds.apache.org/job/Qpid-Broker-J-TestMatrix/Ubuntu%20Slaves=ubuntu,jdk=JDK%201.8%20(latest),profile=java-dby.1-0/ws/doc/target/jacoco.exec"> -Xmx512m
[INFO]
[INFO] --- maven-remote-resources-plugin:1.5:process (process-resource-bundles) @ qpid-java-doc ---
[INFO]
[INFO] --- maven-site-plugin:3.5.1:attach-descriptor (attach-descriptor) @ qpid-java-doc ---
[INFO]
[INFO] --- maven-assembly-plugin:2.6:single (default) @ qpid-java-doc ---
[INFO] Assemblies have been skipped per configuration of the skipAssembly parameter.
[INFO]
[INFO] ------------------------------------------------------------------------
[INFO] Building Apache Qpid Broker-J Docbook 7.1.0-SNAPSHOT
[INFO] ------------------------------------------------------------------------
[INFO]
[INFO] --- maven-clean-plugin:3.0.0:clean (default-clean) @ qpid-java-doc-broker ---
[INFO]
[INFO] --- maven-antrun-plugin:1.8:run (output-test-properties) @ qpid-java-doc-broker ---
[INFO] Executing tasks
main:
[echo] Qpid Test Profile Properties
[echo] [profile] java-dby.1-0
[echo] [profile.broker.version] 1.0
[echo] [profile.virtualhostnode.type] Memory
[echo] [profile.virtualhostnode.context.blueprint] {"type":"ProvidedStore","globalAddressDomains":"${qpid.globalAddressDomains}"}
[echo] [profile.test_receive_timeout] 3000
[INFO] Executed tasks
[INFO]
[INFO] --- maven-enforcer-plugin:1.4.1:enforce (enforce-minimum-versions) @ qpid-java-doc-broker ---
[INFO]
[INFO] --- maven-enforcer-plugin:1.4.1:enforce (enforce-versions-standard-properties) @ qpid-java-doc-broker ---
[INFO]
[INFO] --- maven-enforcer-plugin:1.4.1:enforce (enforce-enableAmqp0x) @ qpid-java-doc-broker ---
[INFO]
[INFO] --- jacoco-maven-plugin:0.7.5.201505241946:prepare-agent (default-prepare-agent) @ qpid-java-doc-broker ---
[INFO] argLine set to "-javaagent:/home/jenkins/.m2/repository/org/jacoco/org.jacoco.agent/0.7.5.201505241946/org.jacoco.agent-0.7.5.201505241946-runtime.jar=destfile=<https://builds.apache.org/job/Qpid-Broker-J-TestMatrix/Ubuntu%20Slaves=ubuntu,jdk=JDK%201.8%20(latest),profile=java-dby.1-0/ws/doc/java-broker/target/jacoco.exec"> -Xmx512m
[INFO]
[INFO] --- maven-resources-plugin:2.7:copy-resources (filter-docbook-sources) @ qpid-java-doc-broker ---
[INFO] Using 'UTF-8' encoding to copy filtered resources.
[INFO] Copying 76 resources
[INFO]
[INFO] --- maven-remote-resources-plugin:1.5:process (process-resource-bundles) @ qpid-java-doc-broker ---
[INFO]
[INFO] --- maven-resources-plugin:2.7:resources (default-resources) @ qpid-java-doc-broker ---
[INFO] Using 'UTF-8' encoding to copy filtered resources.
[INFO] Copying 76 resources
[INFO]
[INFO] --- maven-compiler-plugin:3.5.1:compile (default-compile) @ qpid-java-doc-broker ---
[INFO] No sources to compile
[INFO]
[INFO] --- maven-resources-plugin:2.7:testResources (default-testResources) @ qpid-java-doc-broker ---
[INFO] Using 'UTF-8' encoding to copy filtered resources.
[INFO] Copying 76 resources
[INFO]
[INFO] --- maven-compiler-plugin:3.5.1:testCompile (default-testCompile) @ qpid-java-doc-broker ---
[INFO] No sources to compile
[INFO]
[INFO] --- maven-surefire-plugin:2.19.1:test (default-test) @ qpid-java-doc-broker ---
[INFO] Tests are skipped.
[INFO]
[INFO] --- maven-jar-plugin:3.0.0:jar (default-jar) @ qpid-java-doc-broker ---
[WARNING] JAR will be empty - no content was marked for inclusion!
[INFO] Building jar: <https://builds.apache.org/job/Qpid-Broker-J-TestMatrix/Ubuntu%20Slaves=ubuntu,jdk=JDK%201.8%20(latest),profile=java-dby.1-0/ws/doc/java-broker/target/qpid-java-doc-broker-7.1.0-SNAPSHOT.jar>
[INFO]
[INFO] --- maven-site-plugin:3.5.1:attach-descriptor (attach-descriptor) @ qpid-java-doc-broker ---
[INFO]
[INFO] --- maven-assembly-plugin:2.6:single (default) @ qpid-java-doc-broker ---
[INFO] Assemblies have been skipped per configuration of the skipAssembly parameter.
[INFO]
[INFO] ------------------------------------------------------------------------
[INFO] Building Apache Qpid Broker-J Performance Test Docbook 7.1.0-SNAPSHOT
[INFO] ------------------------------------------------------------------------
[INFO]
[INFO] --- maven-clean-plugin:3.0.0:clean (default-clean) @ qpid-java-doc-perftests ---
[INFO]
[INFO] --- maven-antrun-plugin:1.8:run (output-test-properties) @ qpid-java-doc-perftests ---
[INFO] Executing tasks
main:
[echo] Qpid Test Profile Properties
[echo] [profile] java-dby.1-0
[echo] [profile.broker.version] 1.0
[echo] [profile.virtualhostnode.type] Memory
[echo] [profile.virtualhostnode.context.blueprint] {"type":"ProvidedStore","globalAddressDomains":"${qpid.globalAddressDomains}"}
[echo] [profile.test_receive_timeout] 3000
[INFO] Executed tasks
[INFO]
[INFO] --- maven-enforcer-plugin:1.4.1:enforce (enforce-minimum-versions) @ qpid-java-doc-perftests ---
[INFO]
[INFO] --- maven-enforcer-plugin:1.4.1:enforce (enforce-versions-standard-properties) @ qpid-java-doc-perftests ---
[INFO]
[INFO] --- maven-enforcer-plugin:1.4.1:enforce (enforce-enableAmqp0x) @ qpid-java-doc-perftests ---
[INFO]
[INFO] --- jacoco-maven-plugin:0.7.5.201505241946:prepare-agent (default-prepare-agent) @ qpid-java-doc-perftests ---
[INFO] argLine set to "-javaagent:/home/jenkins/.m2/repository/org/jacoco/org.jacoco.agent/0.7.5.201505241946/org.jacoco.agent-0.7.5.201505241946-runtime.jar=destfile=<https://builds.apache.org/job/Qpid-Broker-J-TestMatrix/Ubuntu%20Slaves=ubuntu,jdk=JDK%201.8%20(latest),profile=java-dby.1-0/ws/doc/java-perftests/target/jacoco.exec"> -Xmx512m
[INFO]
[INFO] --- maven-resources-plugin:2.7:copy-resources (filter-docbook-sources) @ qpid-java-doc-perftests ---
[INFO] Using 'UTF-8' encoding to copy filtered resources.
[INFO] Copying 1 resource
[INFO]
[INFO] --- maven-remote-resources-plugin:1.5:process (process-resource-bundles) @ qpid-java-doc-perftests ---
[INFO]
[INFO] --- maven-resources-plugin:2.7:resources (default-resources) @ qpid-java-doc-perftests ---
[INFO] Using 'UTF-8' encoding to copy filtered resources.
[INFO] Copying 1 resource
[INFO]
[INFO] --- maven-compiler-plugin:3.5.1:compile (default-compile) @ qpid-java-doc-perftests ---
[INFO] No sources to compile
[INFO]
[INFO] --- maven-resources-plugin:2.7:testResources (default-testResources) @ qpid-java-doc-perftests ---
[INFO] Using 'UTF-8' encoding to copy filtered resources.
[INFO] Copying 1 resource
[INFO]
[INFO] --- maven-compiler-plugin:3.5.1:testCompile (default-testCompile) @ qpid-java-doc-perftests ---
[INFO] No sources to compile
[INFO]
[INFO] --- maven-surefire-plugin:2.19.1:test (default-test) @ qpid-java-doc-perftests ---
[INFO] Tests are skipped.
[INFO]
[INFO] --- maven-jar-plugin:3.0.0:jar (default-jar) @ qpid-java-doc-perftests ---
[WARNING] JAR will be empty - no content was marked for inclusion!
[INFO] Building jar: <https://builds.apache.org/job/Qpid-Broker-J-TestMatrix/Ubuntu%20Slaves=ubuntu,jdk=JDK%201.8%20(latest),profile=java-dby.1-0/ws/doc/java-perftests/target/qpid-java-doc-perftests-7.1.0-SNAPSHOT.jar>
[INFO]
[INFO] --- maven-site-plugin:3.5.1:attach-descriptor (attach-descriptor) @ qpid-java-doc-perftests ---
[INFO]
[INFO] --- maven-assembly-plugin:2.6:single (default) @ qpid-java-doc-perftests ---
[INFO] Assemblies have been skipped per configuration of the skipAssembly parameter.
[INFO] ------------------------------------------------------------------------
[INFO] Reactor Summary:
[INFO]
[INFO] Apache Qpid Broker-J Parent ........................ SUCCESS [ 2.251 s]
[INFO] Apache Qpid Broker-J Code Generation ............... SUCCESS [ 1.872 s]
[INFO] Apache Qpid Broker-J Test Utilities ................ SUCCESS [ 0.579 s]
[INFO] Apache Qpid Broker-J Core .......................... SUCCESS [ 12.862 s]
[INFO] Apache Qpid Broker-J LogBack Logging Plug-in ....... SUCCESS [ 1.607 s]
[INFO] Apache Qpid Broker-J Access Control Plug-in ........ SUCCESS [ 0.885 s]
[INFO] Apache Qpid Broker-J AMQP 0-10 Protocol Plug-in .... SUCCESS [ 1.280 s]
[INFO] Apache Qpid Broker-J AMQP 0-8 Protocol Plug-in ..... SUCCESS [ 1.072 s]
[INFO] Apache Qpid Broker-J AMQP 1-0 Protocol Plug-in ..... SUCCESS [ 2.101 s]
[INFO] Apache Qpid Broker-J AMQP 0-8 to 0-10 Message Conversion Plug-in SUCCESS [ 0.285 s]
[INFO] Apache Qpid Broker-J AMQP 0-8 to 1-0 Message Conversion Plug-in SUCCESS [ 0.404 s]
[INFO] Apache Qpid Broker-J AMQP 0-10 to 1-0 Message Conversion Plug-in SUCCESS [ 0.432 s]
[INFO] Apache Qpid Broker-J JDBC Message Store Plug-in .... SUCCESS [ 0.810 s]
[INFO] Apache Qpid Broker-J Derby Message Store Plug-in ... SUCCESS [ 0.685 s]
[INFO] Apache Qpid Broker-J JDBC Message Store Connection Pooling Plug-in SUCCESS [ 0.310 s]
[INFO] Apache Qpid AMQP 1.0 JDBC Link Store Plug-in ....... SUCCESS [ 0.331 s]
[INFO] Apache Qpid Broker-J HTTP Management Plug-in ....... SUCCESS [ 1.630 s]
[INFO] Apache Qpid Broker-J AMQP Management Protocol Plug-in SUCCESS [ 0.291 s]
[INFO] Apache Qpid Broker-J Memory Message Store Plug-in .. SUCCESS [ 0.353 s]
[INFO] Apache Qpid Broker-J WebSocket Plug-in ............. SUCCESS [ 0.453 s]
[INFO] Apache Qpid Broker-J BDB Message Store Plug-in ..... SUCCESS [ 1.530 s]
[INFO] Apache Qpid AMQP 1.0 BDB Link Store Plug-in ........ SUCCESS [ 0.890 s]
[INFO] Apache Qpid Broker-J ............................... SUCCESS [ 0.924 s]
[INFO] Apache Qpid Broker-J Bundles ....................... SUCCESS [ 4.826 s]
[INFO] Apache Qpid Broker-J Tools ......................... SUCCESS [ 0.356 s]
[INFO] Apache Qpid Broker-J System Test Parent ............ SUCCESS [ 0.051 s]
[INFO] Apache Qpid Broker-J System Test Utils ............. SUCCESS [ 0.392 s]
[INFO] Apache Qpid Broker-J JMS System Tests Core ......... SUCCESS [ 0.684 s]
[INFO] Apache Qpid Broker-J JMS 1.1 System Tests .......... SUCCESS [ 1.811 s]
[INFO] Apache Qpid Broker-J JMS 2.0 System Tests .......... SUCCESS [ 1.081 s]
[INFO] Apache Qpid Broker-J HTTP system tests ............. SUCCESS [ 1.285 s]
[INFO] Apache Qpid Broker-J Protocol Tests Core ........... SUCCESS [ 0.242 s]
[INFO] Apache Qpid Protocol Tests for AMQP 0-8,0-9,0-9-1 .. SUCCESS [ 1.205 s]
[INFO] Apache Qpid Protocol Tests for AMQP 0-10 ........... SUCCESS [ 0.678 s]
[INFO] Apache Qpid Protocol Tests for AMQP 1.0 ............ SUCCESS [ 1.723 s]
[INFO] Apache Qpid Broker-J System Tests Spawn Broker Admin SUCCESS [ 1.111 s]
[INFO] Apache Qpid Broker-J End to End Conversion Tests ... SUCCESS [ 1.381 s]
[INFO] Apache Qpid Broker-J Performance Tests ............. SUCCESS [ 1.366 s]
[INFO] Apache Qpid Broker-J Performance Test System Tests . SUCCESS [ 0.719 s]
[INFO] Apache Qpid Broker-J Performance Tests Visualisation JFC SUCCESS [ 1.501 s]
[INFO] Apache Qpid Broker-J BDB Store System Tests ........ SUCCESS [ 0.667 s]
[INFO] Apache Qpid Joram JMS Tests ........................ SUCCESS [ 0.230 s]
[INFO] Apache Qpid Broker-J JMS TCK Configuration ......... SUCCESS [ 0.233 s]
[INFO] Apache Qpid Broker-J Docbook ....................... SUCCESS [ 0.032 s]
[INFO] Apache Qpid Broker-J Docbook ....................... SUCCESS [ 0.465 s]
[INFO] Apache Qpid Broker-J Performance Test Docbook ...... SUCCESS [ 0.062 s]
[INFO] ------------------------------------------------------------------------
[INFO] BUILD SUCCESS
[INFO] ------------------------------------------------------------------------
[INFO] Total time: 56.700 s
[INFO] Finished at: 2018-04-13T13:27:46Z
[INFO] Final Memory: 198M/9118M
[INFO] ------------------------------------------------------------------------
Archiving artifacts
ERROR: No artifacts found that match the file pattern "**/target/surefire-reports/**". Configuration error?
ERROR: java.lang.InterruptedException: no matches found within 10000
Build step 'Archive the artifacts' changed build result to FAILURE
Performing Post build task...
Match found for : : True
Logical operation result is TRUE
Running script : echo Finishing build
date
[java-dby.1-0] $ /bin/bash -xe /tmp/jenkins6864057728242016470.sh
+ echo Finishing build
Finishing build
+ date
Fri Apr 13 13:27:48 UTC 2018
POST BUILD TASK : SUCCESS
END OF POST BUILD TASK : 0
Recording test results
ERROR: Step ?Publish JUnit test result report? failed: No test report files were found. Configuration error?
Jenkins build is back to normal : Qpid-Broker-J-TestMatrix » ubuntu,JDK 1.8 (latest),java-dby.1-0 #4197
Posted by Apache Jenkins Server <je...@builds.apache.org>.
See <https://builds.apache.org/job/Qpid-Broker-J-TestMatrix/Ubuntu%20Slaves=ubuntu,jdk=JDK%201.8%20(latest),profile=java-dby.1-0/4197/display/redirect>
Build failed in Jenkins: Qpid-Broker-J-TestMatrix » ubuntu,JDK 1.8 (latest),java-dby.1-0 #4196
Posted by Apache Jenkins Server <je...@builds.apache.org>.
See <https://builds.apache.org/job/Qpid-Broker-J-TestMatrix/Ubuntu%20Slaves=ubuntu,jdk=JDK%201.8%20(latest),profile=java-dby.1-0/4196/display/redirect?page=changes>
Changes:
[orudyy] Revert "QPID-8158: [Broker-J] [System Tests] Run protocol tests as part
[orudyy] QPID-8158: [Broker-J] [System Tests] Update README and cleanup legacy
[orudyy] QPID-8158: [Broker-J] [System Tests] Fix issue with creation of folder
------------------------------------------
[...truncated 406.76 KB...]
[INFO] Copying 3 resources
[INFO]
[INFO] --- maven-compiler-plugin:3.5.1:compile (default-compile) @ qpid-tck ---
[INFO] Compiling 1 source file to <https://builds.apache.org/job/Qpid-Broker-J-TestMatrix/Ubuntu%20Slaves=ubuntu,jdk=JDK%201.8%20(latest),profile=java-dby.1-0/ws/tck/target/classes>
[INFO] <https://builds.apache.org/job/Qpid-Broker-J-TestMatrix/Ubuntu%20Slaves=ubuntu,jdk=JDK%201.8%20(latest),profile=java-dby.1-0/ws/tck/src/main/java/org/apache/qpid/tck/ManageQpidJMSResources.java>: <https://builds.apache.org/job/Qpid-Broker-J-TestMatrix/Ubuntu%20Slaves=ubuntu,jdk=JDK%201.8%20(latest),profile=java-dby.1-0/ws/tck/src/main/java/org/apache/qpid/tck/ManageQpidJMSResources.java> uses unchecked or unsafe operations.
[INFO] <https://builds.apache.org/job/Qpid-Broker-J-TestMatrix/Ubuntu%20Slaves=ubuntu,jdk=JDK%201.8%20(latest),profile=java-dby.1-0/ws/tck/src/main/java/org/apache/qpid/tck/ManageQpidJMSResources.java>: Recompile with -Xlint:unchecked for details.
[INFO]
[INFO] --- maven-resources-plugin:2.7:testResources (default-testResources) @ qpid-tck ---
[INFO] Using 'UTF-8' encoding to copy filtered resources.
[INFO] Copying 5 resources
[INFO] Copying 3 resources
[INFO]
[INFO] --- maven-compiler-plugin:3.5.1:testCompile (default-testCompile) @ qpid-tck ---
[INFO] No sources to compile
[INFO]
[INFO] --- maven-surefire-plugin:2.19.1:test (default-test) @ qpid-tck ---
[INFO] Tests are skipped.
[INFO]
[INFO] --- maven-jar-plugin:3.0.0:jar (default-jar) @ qpid-tck ---
[INFO] Building jar: <https://builds.apache.org/job/Qpid-Broker-J-TestMatrix/Ubuntu%20Slaves=ubuntu,jdk=JDK%201.8%20(latest),profile=java-dby.1-0/ws/tck/target/qpid-tck-7.1.0-SNAPSHOT.jar>
[INFO]
[INFO] --- maven-site-plugin:3.5.1:attach-descriptor (attach-descriptor) @ qpid-tck ---
[INFO]
[INFO] ------------------------------------------------------------------------
[INFO] Building Apache Qpid Broker-J Docbook 7.1.0-SNAPSHOT
[INFO] ------------------------------------------------------------------------
[INFO]
[INFO] --- maven-clean-plugin:3.0.0:clean (default-clean) @ qpid-java-doc ---
[INFO]
[INFO] --- maven-antrun-plugin:1.8:run (output-test-properties) @ qpid-java-doc ---
[INFO] Executing tasks
main:
[echo] Qpid Test Profile Properties
[echo] [profile] java-dby.1-0
[echo] [profile.broker.version] 1.0
[echo] [profile.virtualhostnode.type] Memory
[echo] [profile.virtualhostnode.context.blueprint] {"type":"ProvidedStore","globalAddressDomains":"${qpid.globalAddressDomains}"}
[echo] [profile.test_receive_timeout] 3000
[INFO] Executed tasks
[INFO]
[INFO] --- maven-enforcer-plugin:1.4.1:enforce (enforce-minimum-versions) @ qpid-java-doc ---
[INFO]
[INFO] --- maven-enforcer-plugin:1.4.1:enforce (enforce-versions-standard-properties) @ qpid-java-doc ---
[INFO]
[INFO] --- maven-enforcer-plugin:1.4.1:enforce (enforce-enableAmqp0x) @ qpid-java-doc ---
[INFO]
[INFO] --- jacoco-maven-plugin:0.7.5.201505241946:prepare-agent (default-prepare-agent) @ qpid-java-doc ---
[INFO] argLine set to "-javaagent:/home/jenkins/.m2/repository/org/jacoco/org.jacoco.agent/0.7.5.201505241946/org.jacoco.agent-0.7.5.201505241946-runtime.jar=destfile=<https://builds.apache.org/job/Qpid-Broker-J-TestMatrix/Ubuntu%20Slaves=ubuntu,jdk=JDK%201.8%20(latest),profile=java-dby.1-0/ws/doc/target/jacoco.exec"> -Xmx512m
[INFO]
[INFO] --- maven-remote-resources-plugin:1.5:process (process-resource-bundles) @ qpid-java-doc ---
[INFO]
[INFO] --- maven-site-plugin:3.5.1:attach-descriptor (attach-descriptor) @ qpid-java-doc ---
[INFO]
[INFO] --- maven-assembly-plugin:2.6:single (default) @ qpid-java-doc ---
[INFO] Assemblies have been skipped per configuration of the skipAssembly parameter.
[INFO]
[INFO] ------------------------------------------------------------------------
[INFO] Building Apache Qpid Broker-J Docbook 7.1.0-SNAPSHOT
[INFO] ------------------------------------------------------------------------
[INFO]
[INFO] --- maven-clean-plugin:3.0.0:clean (default-clean) @ qpid-java-doc-broker ---
[INFO]
[INFO] --- maven-antrun-plugin:1.8:run (output-test-properties) @ qpid-java-doc-broker ---
[INFO] Executing tasks
main:
[echo] Qpid Test Profile Properties
[echo] [profile] java-dby.1-0
[echo] [profile.broker.version] 1.0
[echo] [profile.virtualhostnode.type] Memory
[echo] [profile.virtualhostnode.context.blueprint] {"type":"ProvidedStore","globalAddressDomains":"${qpid.globalAddressDomains}"}
[echo] [profile.test_receive_timeout] 3000
[INFO] Executed tasks
[INFO]
[INFO] --- maven-enforcer-plugin:1.4.1:enforce (enforce-minimum-versions) @ qpid-java-doc-broker ---
[INFO]
[INFO] --- maven-enforcer-plugin:1.4.1:enforce (enforce-versions-standard-properties) @ qpid-java-doc-broker ---
[INFO]
[INFO] --- maven-enforcer-plugin:1.4.1:enforce (enforce-enableAmqp0x) @ qpid-java-doc-broker ---
[INFO]
[INFO] --- jacoco-maven-plugin:0.7.5.201505241946:prepare-agent (default-prepare-agent) @ qpid-java-doc-broker ---
[INFO] argLine set to "-javaagent:/home/jenkins/.m2/repository/org/jacoco/org.jacoco.agent/0.7.5.201505241946/org.jacoco.agent-0.7.5.201505241946-runtime.jar=destfile=<https://builds.apache.org/job/Qpid-Broker-J-TestMatrix/Ubuntu%20Slaves=ubuntu,jdk=JDK%201.8%20(latest),profile=java-dby.1-0/ws/doc/java-broker/target/jacoco.exec"> -Xmx512m
[INFO]
[INFO] --- maven-resources-plugin:2.7:copy-resources (filter-docbook-sources) @ qpid-java-doc-broker ---
[INFO] Using 'UTF-8' encoding to copy filtered resources.
[INFO] Copying 76 resources
[INFO]
[INFO] --- maven-remote-resources-plugin:1.5:process (process-resource-bundles) @ qpid-java-doc-broker ---
[INFO]
[INFO] --- maven-resources-plugin:2.7:resources (default-resources) @ qpid-java-doc-broker ---
[INFO] Using 'UTF-8' encoding to copy filtered resources.
[INFO] Copying 76 resources
[INFO]
[INFO] --- maven-compiler-plugin:3.5.1:compile (default-compile) @ qpid-java-doc-broker ---
[INFO] No sources to compile
[INFO]
[INFO] --- maven-resources-plugin:2.7:testResources (default-testResources) @ qpid-java-doc-broker ---
[INFO] Using 'UTF-8' encoding to copy filtered resources.
[INFO] Copying 76 resources
[INFO]
[INFO] --- maven-compiler-plugin:3.5.1:testCompile (default-testCompile) @ qpid-java-doc-broker ---
[INFO] No sources to compile
[INFO]
[INFO] --- maven-surefire-plugin:2.19.1:test (default-test) @ qpid-java-doc-broker ---
[INFO] Tests are skipped.
[INFO]
[INFO] --- maven-jar-plugin:3.0.0:jar (default-jar) @ qpid-java-doc-broker ---
[WARNING] JAR will be empty - no content was marked for inclusion!
[INFO] Building jar: <https://builds.apache.org/job/Qpid-Broker-J-TestMatrix/Ubuntu%20Slaves=ubuntu,jdk=JDK%201.8%20(latest),profile=java-dby.1-0/ws/doc/java-broker/target/qpid-java-doc-broker-7.1.0-SNAPSHOT.jar>
[INFO]
[INFO] --- maven-site-plugin:3.5.1:attach-descriptor (attach-descriptor) @ qpid-java-doc-broker ---
[INFO]
[INFO] --- maven-assembly-plugin:2.6:single (default) @ qpid-java-doc-broker ---
[INFO] Assemblies have been skipped per configuration of the skipAssembly parameter.
[INFO]
[INFO] ------------------------------------------------------------------------
[INFO] Building Apache Qpid Broker-J Performance Test Docbook 7.1.0-SNAPSHOT
[INFO] ------------------------------------------------------------------------
[INFO]
[INFO] --- maven-clean-plugin:3.0.0:clean (default-clean) @ qpid-java-doc-perftests ---
[INFO]
[INFO] --- maven-antrun-plugin:1.8:run (output-test-properties) @ qpid-java-doc-perftests ---
[INFO] Executing tasks
main:
[echo] Qpid Test Profile Properties
[echo] [profile] java-dby.1-0
[echo] [profile.broker.version] 1.0
[echo] [profile.virtualhostnode.type] Memory
[echo] [profile.virtualhostnode.context.blueprint] {"type":"ProvidedStore","globalAddressDomains":"${qpid.globalAddressDomains}"}
[echo] [profile.test_receive_timeout] 3000
[INFO] Executed tasks
[INFO]
[INFO] --- maven-enforcer-plugin:1.4.1:enforce (enforce-minimum-versions) @ qpid-java-doc-perftests ---
[INFO]
[INFO] --- maven-enforcer-plugin:1.4.1:enforce (enforce-versions-standard-properties) @ qpid-java-doc-perftests ---
[INFO]
[INFO] --- maven-enforcer-plugin:1.4.1:enforce (enforce-enableAmqp0x) @ qpid-java-doc-perftests ---
[INFO]
[INFO] --- jacoco-maven-plugin:0.7.5.201505241946:prepare-agent (default-prepare-agent) @ qpid-java-doc-perftests ---
[INFO] argLine set to "-javaagent:/home/jenkins/.m2/repository/org/jacoco/org.jacoco.agent/0.7.5.201505241946/org.jacoco.agent-0.7.5.201505241946-runtime.jar=destfile=<https://builds.apache.org/job/Qpid-Broker-J-TestMatrix/Ubuntu%20Slaves=ubuntu,jdk=JDK%201.8%20(latest),profile=java-dby.1-0/ws/doc/java-perftests/target/jacoco.exec"> -Xmx512m
[INFO]
[INFO] --- maven-resources-plugin:2.7:copy-resources (filter-docbook-sources) @ qpid-java-doc-perftests ---
[INFO] Using 'UTF-8' encoding to copy filtered resources.
[INFO] Copying 1 resource
[INFO]
[INFO] --- maven-remote-resources-plugin:1.5:process (process-resource-bundles) @ qpid-java-doc-perftests ---
[INFO]
[INFO] --- maven-resources-plugin:2.7:resources (default-resources) @ qpid-java-doc-perftests ---
[INFO] Using 'UTF-8' encoding to copy filtered resources.
[INFO] Copying 1 resource
[INFO]
[INFO] --- maven-compiler-plugin:3.5.1:compile (default-compile) @ qpid-java-doc-perftests ---
[INFO] No sources to compile
[INFO]
[INFO] --- maven-resources-plugin:2.7:testResources (default-testResources) @ qpid-java-doc-perftests ---
[INFO] Using 'UTF-8' encoding to copy filtered resources.
[INFO] Copying 1 resource
[INFO]
[INFO] --- maven-compiler-plugin:3.5.1:testCompile (default-testCompile) @ qpid-java-doc-perftests ---
[INFO] No sources to compile
[INFO]
[INFO] --- maven-surefire-plugin:2.19.1:test (default-test) @ qpid-java-doc-perftests ---
[INFO] Tests are skipped.
[INFO]
[INFO] --- maven-jar-plugin:3.0.0:jar (default-jar) @ qpid-java-doc-perftests ---
[WARNING] JAR will be empty - no content was marked for inclusion!
[INFO] Building jar: <https://builds.apache.org/job/Qpid-Broker-J-TestMatrix/Ubuntu%20Slaves=ubuntu,jdk=JDK%201.8%20(latest),profile=java-dby.1-0/ws/doc/java-perftests/target/qpid-java-doc-perftests-7.1.0-SNAPSHOT.jar>
[INFO]
[INFO] --- maven-site-plugin:3.5.1:attach-descriptor (attach-descriptor) @ qpid-java-doc-perftests ---
[INFO]
[INFO] --- maven-assembly-plugin:2.6:single (default) @ qpid-java-doc-perftests ---
[INFO] Assemblies have been skipped per configuration of the skipAssembly parameter.
[INFO] ------------------------------------------------------------------------
[INFO] Reactor Summary:
[INFO]
[INFO] Apache Qpid Broker-J Parent ........................ SUCCESS [ 4.002 s]
[INFO] Apache Qpid Broker-J Code Generation ............... SUCCESS [ 3.192 s]
[INFO] Apache Qpid Broker-J Test Utilities ................ SUCCESS [ 1.203 s]
[INFO] Apache Qpid Broker-J Core .......................... SUCCESS [ 23.500 s]
[INFO] Apache Qpid Broker-J LogBack Logging Plug-in ....... SUCCESS [ 2.262 s]
[INFO] Apache Qpid Broker-J Access Control Plug-in ........ SUCCESS [ 1.315 s]
[INFO] Apache Qpid Broker-J AMQP 0-10 Protocol Plug-in .... SUCCESS [ 2.973 s]
[INFO] Apache Qpid Broker-J AMQP 0-8 Protocol Plug-in ..... SUCCESS [ 2.120 s]
[INFO] Apache Qpid Broker-J AMQP 1-0 Protocol Plug-in ..... SUCCESS [ 3.848 s]
[INFO] Apache Qpid Broker-J AMQP 0-8 to 0-10 Message Conversion Plug-in SUCCESS [ 0.596 s]
[INFO] Apache Qpid Broker-J AMQP 0-8 to 1-0 Message Conversion Plug-in SUCCESS [ 0.651 s]
[INFO] Apache Qpid Broker-J AMQP 0-10 to 1-0 Message Conversion Plug-in SUCCESS [ 0.608 s]
[INFO] Apache Qpid Broker-J JDBC Message Store Plug-in .... SUCCESS [ 1.124 s]
[INFO] Apache Qpid Broker-J Derby Message Store Plug-in ... SUCCESS [ 0.977 s]
[INFO] Apache Qpid Broker-J JDBC Message Store Connection Pooling Plug-in SUCCESS [ 0.463 s]
[INFO] Apache Qpid AMQP 1.0 JDBC Link Store Plug-in ....... SUCCESS [ 0.516 s]
[INFO] Apache Qpid Broker-J HTTP Management Plug-in ....... SUCCESS [ 3.548 s]
[INFO] Apache Qpid Broker-J AMQP Management Protocol Plug-in SUCCESS [ 0.804 s]
[INFO] Apache Qpid Broker-J Memory Message Store Plug-in .. SUCCESS [ 0.530 s]
[INFO] Apache Qpid Broker-J WebSocket Plug-in ............. SUCCESS [ 0.825 s]
[INFO] Apache Qpid Broker-J BDB Message Store Plug-in ..... SUCCESS [ 2.874 s]
[INFO] Apache Qpid AMQP 1.0 BDB Link Store Plug-in ........ SUCCESS [ 0.561 s]
[INFO] Apache Qpid Broker-J ............................... SUCCESS [ 2.033 s]
[INFO] Apache Qpid Broker-J Bundles ....................... SUCCESS [ 8.568 s]
[INFO] Apache Qpid Broker-J Tools ......................... SUCCESS [ 0.339 s]
[INFO] Apache Qpid Broker-J System Test Parent ............ SUCCESS [ 0.064 s]
[INFO] Apache Qpid Broker-J System Test Utils ............. SUCCESS [ 0.594 s]
[INFO] Apache Qpid Broker-J JMS System Tests Core ......... SUCCESS [ 0.956 s]
[INFO] Apache Qpid Broker-J JMS 1.1 System Tests .......... SUCCESS [ 2.786 s]
[INFO] Apache Qpid Broker-J JMS 2.0 System Tests .......... SUCCESS [ 1.569 s]
[INFO] Apache Qpid Broker-J HTTP system tests ............. SUCCESS [ 2.419 s]
[INFO] Apache Qpid Broker-J Protocol Tests Core ........... SUCCESS [ 0.383 s]
[INFO] Apache Qpid Protocol Tests for AMQP 0-8,0-9,0-9-1 .. SUCCESS [ 1.699 s]
[INFO] Apache Qpid Protocol Tests for AMQP 0-10 ........... SUCCESS [ 1.368 s]
[INFO] Apache Qpid Protocol Tests for AMQP 1.0 ............ SUCCESS [ 3.458 s]
[INFO] Apache Qpid Broker-J System Tests Spawn Broker Admin SUCCESS [ 2.022 s]
[INFO] Apache Qpid Broker-J End to End Conversion Tests ... SUCCESS [ 3.020 s]
[INFO] Apache Qpid Broker-J Performance Tests ............. SUCCESS [ 1.806 s]
[INFO] Apache Qpid Broker-J Performance Test System Tests . SUCCESS [ 0.892 s]
[INFO] Apache Qpid Broker-J Performance Tests Visualisation JFC SUCCESS [ 1.889 s]
[INFO] Apache Qpid Broker-J BDB Store System Tests ........ SUCCESS [ 1.040 s]
[INFO] Apache Qpid Joram JMS Tests ........................ SUCCESS [ 0.308 s]
[INFO] Apache Qpid Broker-J JMS TCK Configuration ......... SUCCESS [ 0.632 s]
[INFO] Apache Qpid Broker-J Docbook ....................... SUCCESS [ 0.042 s]
[INFO] Apache Qpid Broker-J Docbook ....................... SUCCESS [ 0.834 s]
[INFO] Apache Qpid Broker-J Performance Test Docbook ...... SUCCESS [ 0.124 s]
[INFO] ------------------------------------------------------------------------
[INFO] BUILD SUCCESS
[INFO] ------------------------------------------------------------------------
[INFO] Total time: 01:39 min
[INFO] Finished at: 2018-04-13T21:17:45Z
[INFO] Final Memory: 146M/4880M
[INFO] ------------------------------------------------------------------------
Archiving artifacts
ERROR: No artifacts found that match the file pattern "**/target/surefire-reports/**". Configuration error?
ERROR: java.lang.InterruptedException: no matches found within 10000
Build step 'Archive the artifacts' changed build result to FAILURE
Performing Post build task...
Match found for : : True
Logical operation result is TRUE
Running script : echo Finishing build
date
[java-dby.1-0] $ /bin/bash -xe /tmp/jenkins4042088868154809256.sh
+ echo Finishing build
Finishing build
+ date
Fri Apr 13 21:17:47 UTC 2018
POST BUILD TASK : SUCCESS
END OF POST BUILD TASK : 0
Recording test results
ERROR: Step ?Publish JUnit test result report? failed: No test report files were found. Configuration error?