You are viewing a plain text version of this content. The canonical link for it is here.
Posted to notifications@maven.apache.org by "Continuum@maven.zones.apache.org" <co...@maven.zones.apache.org> on 2007/01/09 15:42:17 UTC
[continuum] BUILD FAILURE: SureFire JUnit4 Runner
Online report : http://maven.zones.apache.org/continuum/buildResult.action?buildId=314&projectId=140&projectName=SureFire JUnit4 Runner
Build statistics:
State: Failed
Previous Build: No previous build.
Started at: Tue, 9 Jan 2007 14:42:12 +0000
Finished at: Tue, 9 Jan 2007 14:42:17 +0000
Total time: 4s
Build Trigger: Schedule
Build Number: 0
Exit code: 1
Building machine hostname: maven.zones.apache.org
Operating system : SunOS(unknown)
Java version : 1.4.2_09(Sun Microsystems Inc.)
****************************************************************************
SCM Changes:
****************************************************************************
No files changed
****************************************************************************
Dependencies Changes:
****************************************************************************
No dependencies changed
****************************************************************************
Test Summary:
****************************************************************************
Tests: 0
Failures: 0
Total time: 0
****************************************************************************
Output:
****************************************************************************
[INFO] Scanning for projects...
[INFO] ----------------------------------------------------------------------------
[INFO] Building SureFire JUnit4 Runner
[INFO] task-segment: [clean, install]
[INFO] ----------------------------------------------------------------------------
[INFO] [clean:clean]
[INFO] Deleting directory /export/home/continuum/continuum_data/working-directory/140/target
[INFO] Deleting directory /export/home/continuum/continuum_data/working-directory/140/target/classes
[INFO] Deleting directory /export/home/continuum/continuum_data/working-directory/140/target/test-classes
[INFO] Deleting directory /export/home/continuum/continuum_data/working-directory/140/target/site
[INFO] [resources:resources]
[INFO] Using default encoding to copy filtered resources.
[INFO] Resource directory does not exist: /export/home/continuum/continuum_data/working-directory/140/src/main/resources
Downloading: http://repo.mergere.com/maven2/junit/junit/4.0/junit-4.0.pom
210b downloaded
Downloading: http://repo.mergere.com/maven2/junit/junit/4.0/junit-4.0.jar
103K downloaded
[INFO] [compiler:compile]
[INFO] Compiling 4 source files to /export/home/continuum/continuum_data/working-directory/140/target/classes
[INFO] ------------------------------------------------------------------------
[ERROR] BUILD FAILURE
[INFO] ------------------------------------------------------------------------
[INFO] Compilation failure
/export/home/continuum/continuum_data/working-directory/140/src/main/java/org/apache/maven/surefire/junit4/JUnit4StackTraceWriter.java:[4,-1] cannot access org.junit.runner.notification.Failure
bad class file: /export/home/continuum/maven-repo-local/junit/junit/4.0/junit-4.0.jar(org/junit/runner/notification/Failure.class)
class file has wrong version 49.0, should be 48.0
[INFO] ------------------------------------------------------------------------
[INFO] For more information, run Maven with the -e switch
[INFO] ------------------------------------------------------------------------
[INFO] Total time: 3 seconds
[INFO] Finished at: Tue Jan 09 14:42:17 GMT+00:00 2007
[INFO] Final Memory: 4M/11M
[INFO] ------------------------------------------------------------------------
****************************************************************************