You are viewing a plain text version of this content. The canonical link for it is here.
Posted to builds@cassandra.apache.org by Apache Jenkins Server <je...@builds.apache.org> on 2022/05/28 15:04:17 UTC

Build complete: Cassandra-2.2 #80 [UNSTABLE] 136c8c0f65cc8f2db87bb683e6eaceb05016f00e

-------------------------------------------------------------------------------
Build Cassandra-2.2 #80 Still Unstable
URL: https://ci-cassandra.apache.org/job/Cassandra-2.2/80/
-------------------------------------------------------------------------------
Changes:
[Michael Semb Wever] In jenkins retry each stage build in the pipeline


-------------------------------------------------------------------------------
Failed Tests:
70 tests failed.
FAILED:  dtest-large.replace_address_test.TestReplaceAddress.test_replace_stopped_node
FAILED:  dtest-offheap.bootstrap_test.TestBootstrap.test_cleanup
FAILED:  org.apache.cassandra.io.sstable.SSTableRewriterTest.testSSTableSplit-compression
FAILED:  org.apache.cassandra.io.sstable.SSTableRewriterTest.testOfflineAbort2-compression
FAILED:  org.apache.cassandra.io.sstable.SSTableRewriterTest.basicTest-compression
FAILED:  org.apache.cassandra.io.sstable.SSTableRewriterTest.testNumberOfFiles_abort2-compression
FAILED:  org.apache.cassandra.io.sstable.SSTableRewriterTest.testNumberOfFiles_abort-compression
FAILED:  org.apache.cassandra.io.sstable.SSTableRewriterTest.testOfflineAbort-compression
FAILED:  org.apache.cassandra.io.sstable.SSTableRewriterTest.testAbort-compression
FAILED:  org.apache.cassandra.io.sstable.SSTableRewriterTest.testAbort2-compression
FAILED:  org.apache.cassandra.io.sstable.SSTableRewriterTest.testAllKeysReadable-compression
FAILED:  org.apache.cassandra.io.sstable.SSTableRewriterTest.testCanonicalView-compression
FAILED:  org.apache.cassandra.io.sstable.SSTableRewriterTest.testSSTableSectionsForRanges-compression
FAILED:  org.apache.cassandra.io.sstable.SSTableRewriterTest.testTwoWriters-compression
FAILED:  org.apache.cassandra.io.sstable.SSTableRewriterTest.testSSTableSplit
FAILED:  org.apache.cassandra.io.sstable.SSTableRewriterTest.testNumberOfFiles_dont_clean_readers
FAILED:  org.apache.cassandra.io.sstable.SSTableRewriterTest.testNumberOfFilesAndSizes
FAILED:  org.apache.cassandra.io.sstable.SSTableRewriterTest.basicTest
FAILED:  org.apache.cassandra.io.sstable.SSTableRewriterTest.testNumberOfFiles_abort
FAILED:  org.apache.cassandra.io.sstable.SSTableRewriterTest.testOfflineAbort
FAILED:  org.apache.cassandra.io.sstable.SSTableRewriterTest.testOfflineAbort2
FAILED:  org.apache.cassandra.io.sstable.SSTableRewriterTest.testAbort
FAILED:  org.apache.cassandra.io.sstable.SSTableRewriterTest.testAbort2
FAILED:  org.apache.cassandra.io.sstable.SSTableRewriterTest.testAllKeysReadable
FAILED:  org.apache.cassandra.io.sstable.SSTableRewriterTest.testCanonicalView
FAILED:  org.apache.cassandra.io.sstable.SSTableRewriterTest.testSSTableSectionsForRanges
FAILED:  org.apache.cassandra.io.sstable.SSTableRewriterTest.testTwoWriters
FAILED:  org.apache.cassandra.concurrent.LongSharedExecutorPoolTest.testPromptnessOfExecution
FAILED:  dtest-novnode.auth_test.TestAuth.test_list_permissions
FAILED:  dtest-novnode.auth_test.TestAuthRoles.test_creator_of_db_resource_granted_all_permissions
FAILED:  dtest-novnode.auth_test.TestAuthRoles.test_filter_granted_permissions_by_resource_type
FAILED:  dtest-novnode.auth_test.TestAuthRoles.test_list_permissions
FAILED:  dtest-offheap.auth_test.TestAuth.test_list_permissions
FAILED:  dtest-offheap.auth_test.TestAuthRoles.test_creator_of_db_resource_granted_all_permissions
FAILED:  dtest-offheap.auth_test.TestAuthRoles.test_filter_granted_permissions_by_resource_type
FAILED:  dtest-offheap.auth_test.TestAuthRoles.test_list_permissions
FAILED:  dtest.auth_test.TestAuth.test_list_permissions
FAILED:  dtest.auth_test.TestAuthRoles.test_creator_of_db_resource_granted_all_permissions
FAILED:  dtest.auth_test.TestAuthRoles.test_filter_granted_permissions_by_resource_type
FAILED:  dtest.auth_test.TestAuthRoles.test_list_permissions
FAILED:  dtest-novnode.jmx_test.TestJMX.test_bloom_filter_false_ratio
FAILED:  dtest-novnode.gossip_test.TestGossip.test_assassination_of_unknown_node
FAILED:  dtest-offheap.jmx_test.TestJMX.test_bloom_filter_false_ratio
FAILED:  dtest.jmx_test.TestJMX.test_bloom_filter_false_ratio
FAILED:  org.apache.cassandra.db.ScrubTest.testScrubCorruptedCounterRow-compression
FAILED:  org.apache.cassandra.db.ScrubTest.testScrubCorruptedCounterRowNoEarlyOpen-compression
FAILED:  dtest-novnode.user_functions_test.TestUserFunctions.test_udf_scripting
FAILED:  dtest-novnode.paging_test.TestPagingWithDeletions.test_failure_threshold_deletions
FAILED:  dtest-novnode.pushed_notifications_test.TestVariousNotifications.test_tombstone_failure_threshold_message
FAILED:  dtest-offheap.user_functions_test.TestUserFunctions.test_udf_scripting
FAILED:  dtest-offheap.paging_test.TestPagingWithDeletions.test_failure_threshold_deletions
FAILED:  dtest-offheap.pushed_notifications_test.TestVariousNotifications.test_tombstone_failure_threshold_message
FAILED:  dtest.user_functions_test.TestUserFunctions.test_udf_scripting
FAILED:  dtest.paging_test.TestPagingWithDeletions.test_failure_threshold_deletions
FAILED:  dtest.pushed_notifications_test.TestVariousNotifications.test_tombstone_failure_threshold_message
FAILED:  dtest-novnode.cqlsh_tests.test_cqlsh_copy.TestCqlshCopy.test_all_datatypes_read
FAILED:  dtest-novnode.cqlsh_tests.test_cqlsh_copy.TestCqlshCopy.test_all_datatypes_round_trip
FAILED:  dtest-offheap.cqlsh_tests.test_cqlsh_copy.TestCqlshCopy.test_all_datatypes_read
FAILED:  dtest-offheap.cqlsh_tests.test_cqlsh_copy.TestCqlshCopy.test_all_datatypes_round_trip
FAILED:  dtest.cqlsh_tests.test_cqlsh_copy.TestCqlshCopy.test_all_datatypes_read
FAILED:  dtest.cqlsh_tests.test_cqlsh_copy.TestCqlshCopy.test_all_datatypes_round_trip
FAILED:  dtest-novnode.commitlog_test.TestCommitLog.test_stop_failure_policy
FAILED:  dtest-offheap.commitlog_test.TestCommitLog.test_stop_failure_policy
FAILED:  dtest.commitlog_test.TestCommitLog.test_stop_failure_policy
FAILED:  dtest-large.replace_address_test.TestReplaceAddress.test_resume_failed_replace
FAILED:  dtest-novnode.cqlsh_tests.test_cqlsh.TestCqlsh.test_client_warnings
FAILED:  dtest-offheap.cqlsh_tests.test_cqlsh.TestCqlsh.test_client_warnings
FAILED:  dtest.cqlsh_tests.test_cqlsh.TestCqlsh.test_client_warnings
FAILED:  junit.framework.TestSuite.org.apache.cassandra.io.sstable.LongSegmentedFileBoundaryTest
FAILED:  org.apache.cassandra.utils.LongBTreeTest.testSearchIterator

-------------------------------------------------------------------------------
For complete test report and logs see https://nightlies.apache.org/cassandra/Cassandra-2.2/80/