You are viewing a plain text version of this content. The canonical link for it is here.
Posted to builds@hbase.apache.org by Apache Jenkins Server <je...@builds.apache.org> on 2017/05/19 04:10:56 UTC

Build failed in Jenkins: HBase-Trunk_matrix » JDK 1.8 (latest),Hadoop #3036

See <https://builds.apache.org/job/HBase-Trunk_matrix/jdk=JDK%201.8%20(latest),label=Hadoop/3036/display/redirect?page=changes>

Changes:

[tedyu] HBASE-18058 Zookeeper retry sleep time should have an upper limit (Allan

[tedyu] HBASE-18035 Meta replica does not give any primaryOperationTimeout to

------------------------------------------
[...truncated 928.90 KB...]
[WARNING] Using platform encoding (ISO-8859-1 actually) to copy filtered resources, i.e. build is platform dependent!
[INFO] Copying 2 resources
[INFO] 
[INFO] --- maven-archetype-plugin:2.4:jar (default-jar) @ hbase-client-project-archetype ---
[INFO] Building archetype jar: <https://builds.apache.org/job/HBase-Trunk_matrix/jdk=JDK%201.8%20(latest),label=Hadoop/ws/hbase-archetypes/hbase-client-project/target/build-archetype/target/generated-sources/archetype/target/hbase-client-project-archetype-2.0.0-SNAPSHOT>
[INFO] ------------------------------------------------------------------------
[INFO] BUILD SUCCESS
[INFO] ------------------------------------------------------------------------
[INFO] Total time: 1.093s
[INFO] Finished at: Fri May 19 04:05:26 UTC 2017
[INFO] Final Memory: 20M/724M
[INFO] ------------------------------------------------------------------------
[INFO] Archetype project created in <https://builds.apache.org/job/HBase-Trunk_matrix/jdk=JDK%201.8%20(latest),label=Hadoop/ws/hbase-archetypes/hbase-client-project/target/build-archetype/target/generated-sources/archetype>
[INFO] ------------------------------------------------------------------------
[INFO] BUILD SUCCESS
[INFO] ------------------------------------------------------------------------
[INFO] Total time: 3.390s
[INFO] Finished at: Fri May 19 04:05:27 UTC 2017
[INFO] Final Memory: 21M/724M
[INFO] ------------------------------------------------------------------------
[INFO] Scanning for projects...
[INFO]                                                                         
[INFO] ------------------------------------------------------------------------
[INFO] Building Apache HBase - Exemplar for hbase-shaded-client archetype 2.0.0-SNAPSHOT
[INFO] ------------------------------------------------------------------------
[INFO] 
[INFO] >>> maven-archetype-plugin:2.4:create-from-project (default-cli) @ hbase-shaded-client-project >>>
[INFO] 
[INFO] <<< maven-archetype-plugin:2.4:create-from-project (default-cli) @ hbase-shaded-client-project <<<
[INFO] 
[INFO] --- maven-archetype-plugin:2.4:create-from-project (default-cli) @ hbase-shaded-client-project ---
[INFO] Setting default groupId: org.apache.hbase
[INFO] Setting default artifactId: hbase-shaded-client-project
[INFO] Setting default version: 2.0.0-SNAPSHOT
[INFO] Setting default package: org.apache.hbase.archetypes.exemplars.shaded_client
[INFO] Scanning for projects...
[INFO]                                                                         
[INFO] ------------------------------------------------------------------------
[INFO] Building hbase-shaded-client-project-archetype 2.0.0-SNAPSHOT
[INFO] ------------------------------------------------------------------------
[INFO] 
[INFO] --- maven-resources-plugin:3.0.1:resources (default-resources) @ hbase-shaded-client-project-archetype ---
[WARNING] Using platform encoding (ISO-8859-1 actually) to copy filtered resources, i.e. build is platform dependent!
[INFO] Copying 6 resources
[INFO] 
[INFO] --- maven-resources-plugin:3.0.1:testResources (default-testResources) @ hbase-shaded-client-project-archetype ---
[WARNING] Using platform encoding (ISO-8859-1 actually) to copy filtered resources, i.e. build is platform dependent!
[INFO] Copying 2 resources
[INFO] 
[INFO] --- maven-archetype-plugin:2.4:jar (default-jar) @ hbase-shaded-client-project-archetype ---
[INFO] Building archetype jar: <https://builds.apache.org/job/HBase-Trunk_matrix/jdk=JDK%201.8%20(latest),label=Hadoop/ws/hbase-archetypes/hbase-shaded-client-project/target/build-archetype/target/generated-sources/archetype/target/hbase-shaded-client-project-archetype-2.0.0-SNAPSHOT>
[INFO] ------------------------------------------------------------------------
[INFO] BUILD SUCCESS
[INFO] ------------------------------------------------------------------------
[INFO] Total time: 1.154s
[INFO] Finished at: Fri May 19 04:05:31 UTC 2017
[INFO] Final Memory: 20M/724M
[INFO] ------------------------------------------------------------------------
[INFO] Archetype project created in <https://builds.apache.org/job/HBase-Trunk_matrix/jdk=JDK%201.8%20(latest),label=Hadoop/ws/hbase-archetypes/hbase-shaded-client-project/target/build-archetype/target/generated-sources/archetype>
[INFO] ------------------------------------------------------------------------
[INFO] BUILD SUCCESS
[INFO] ------------------------------------------------------------------------
[INFO] Total time: 3.649s
[INFO] Finished at: Fri May 19 04:05:31 UTC 2017
[INFO] Final Memory: 21M/724M
[INFO] ------------------------------------------------------------------------
[INFO] 
[INFO] --- maven-resources-plugin:2.7:copy-resources (hbase-client-ARCHETYPE__copy-pom-to-temp-for-xslt-processing) @ hbase-archetype-builder ---
[INFO] Using 'UTF-8' encoding to copy filtered resources.
[INFO] Copying 1 resource
[INFO] 
[INFO] --- maven-resources-plugin:2.7:copy-resources (hbase-shaded-client-ARCHETYPE__copy-pom-to-temp-for-xslt-processing) @ hbase-archetype-builder ---
[INFO] Using 'UTF-8' encoding to copy filtered resources.
[INFO] Copying 1 resource
[INFO] 
[INFO] --- xml-maven-plugin:1.0.1:transform (modify-archetype-pom-files-via-xslt) @ hbase-archetype-builder ---
[INFO] Transforming file: <https://builds.apache.org/job/HBase-Trunk_matrix/jdk=JDK%201.8%20(latest),label=Hadoop/3036/artifact/hbase-archetypes/hbase-archetype-builder/../hbase-client-project/target/temp-arch/pom.xml>
[INFO] Transformed 1 file(s).
[INFO] Transforming file: <https://builds.apache.org/job/HBase-Trunk_matrix/jdk=JDK%201.8%20(latest),label=Hadoop/3036/artifact/hbase-archetypes/hbase-archetype-builder/../hbase-shaded-client-project/target/temp-arch/pom.xml>
[INFO] Transformed 1 file(s).
[INFO] 
[INFO] --- maven-install-plugin:2.5.2:install (default-install) @ hbase-archetype-builder ---
[INFO] Installing <https://builds.apache.org/job/HBase-Trunk_matrix/jdk=JDK%201.8%20(latest),label=Hadoop/3036/artifact/hbase-archetypes/hbase-archetype-builder/pom.xml> to /home/jenkins/.m2/repository/org/apache/hbase/hbase-archetype-builder/2.0.0-SNAPSHOT/hbase-archetype-builder-2.0.0-SNAPSHOT.pom
[INFO] 
[INFO] --- exec-maven-plugin:1.4.0:exec (run-installArchetypes-script) @ hbase-archetype-builder ---
[INFO] Scanning for projects...
[INFO]                                                                         
[INFO] ------------------------------------------------------------------------
[INFO] Building hbase-client-project-archetype 2.0.0-SNAPSHOT
[INFO] ------------------------------------------------------------------------
[INFO] 
[INFO] --- maven-resources-plugin:3.0.1:resources (default-resources) @ hbase-client-project-archetype ---
[INFO] Using 'UTF-8' encoding to copy filtered resources.
[INFO] Copying 6 resources
[INFO] 
[INFO] --- maven-resources-plugin:3.0.1:testResources (default-testResources) @ hbase-client-project-archetype ---
[INFO] Using 'UTF-8' encoding to copy filtered resources.
[INFO] Copying 2 resources
[INFO] 
[INFO] --- maven-archetype-plugin:2.4:jar (default-jar) @ hbase-client-project-archetype ---
[INFO] Building archetype jar: <https://builds.apache.org/job/HBase-Trunk_matrix/jdk=JDK%201.8%20(latest),label=Hadoop/ws/hbase-archetypes/hbase-client-project/target/build-archetype/target/generated-sources/archetype/target/hbase-client-project-archetype-2.0.0-SNAPSHOT>
[INFO] 
[INFO] --- maven-archetype-plugin:2.4:integration-test (default-integration-test) @ hbase-client-project-archetype ---
[INFO] Processing Archetype IT project: basic
[INFO] ----------------------------------------------------------------------------
[INFO] Using following parameters for creating project from Archetype: hbase-client-project-archetype:2.0.0-SNAPSHOT
[INFO] ----------------------------------------------------------------------------
[INFO] Parameter: groupId, Value: archetype.it
[INFO] Parameter: artifactId, Value: basic
[INFO] Parameter: version, Value: 0.1-SNAPSHOT
[INFO] Parameter: package, Value: it.pkg
[INFO] Parameter: packageInPathFormat, Value: it/pkg
[INFO] Parameter: version, Value: 0.1-SNAPSHOT
[INFO] Parameter: package, Value: it.pkg
[INFO] Parameter: groupId, Value: archetype.it
[INFO] Parameter: artifactId, Value: basic
[INFO] project created from Archetype in dir: <https://builds.apache.org/job/HBase-Trunk_matrix/jdk=JDK%201.8%20(latest),label=Hadoop/ws/hbase-archetypes/hbase-client-project/target/build-archetype/target/generated-sources/archetype/target/test-classes/projects/basic/project/basic>
[INFO] 
[INFO] --- maven-install-plugin:2.5.2:install (default-install) @ hbase-client-project-archetype ---
[INFO] Installing <https://builds.apache.org/job/HBase-Trunk_matrix/jdk=JDK%201.8%20(latest),label=Hadoop/ws/hbase-archetypes/hbase-client-project/target/build-archetype/target/generated-sources/archetype/target/hbase-client-project-archetype-2.0.0-SNAPSHOT.jar> to /home/jenkins/.m2/repository/org/apache/hbase/hbase-client-project-archetype/2.0.0-SNAPSHOT/hbase-client-project-archetype-2.0.0-SNAPSHOT.jar
[INFO] Installing <https://builds.apache.org/job/HBase-Trunk_matrix/jdk=JDK%201.8%20(latest),label=Hadoop/3036/artifact/hbase-archetypes/hbase-client-project/target/build-archetype/target/generated-sources/archetype/pom.xml> to /home/jenkins/.m2/repository/org/apache/hbase/hbase-client-project-archetype/2.0.0-SNAPSHOT/hbase-client-project-archetype-2.0.0-SNAPSHOT.pom
[INFO] 
[INFO] --- maven-archetype-plugin:2.4:update-local-catalog (default-update-local-catalog) @ hbase-client-project-archetype ---
[INFO] ------------------------------------------------------------------------
[INFO] BUILD SUCCESS
[INFO] ------------------------------------------------------------------------
[INFO] Total time: 1.460s
[INFO] Finished at: Fri May 19 04:05:34 UTC 2017
[INFO] Final Memory: 21M/724M
[INFO] ------------------------------------------------------------------------
[INFO] Scanning for projects...
[INFO]                                                                         
[INFO] ------------------------------------------------------------------------
[INFO] Building hbase-shaded-client-project-archetype 2.0.0-SNAPSHOT
[INFO] ------------------------------------------------------------------------
[INFO] 
[INFO] --- maven-resources-plugin:3.0.1:resources (default-resources) @ hbase-shaded-client-project-archetype ---
[INFO] Using 'UTF-8' encoding to copy filtered resources.
[INFO] Copying 6 resources
[INFO] 
[INFO] --- maven-resources-plugin:3.0.1:testResources (default-testResources) @ hbase-shaded-client-project-archetype ---
[INFO] Using 'UTF-8' encoding to copy filtered resources.
[INFO] Copying 2 resources
[INFO] 
[INFO] --- maven-archetype-plugin:2.4:jar (default-jar) @ hbase-shaded-client-project-archetype ---
[INFO] Building archetype jar: <https://builds.apache.org/job/HBase-Trunk_matrix/jdk=JDK%201.8%20(latest),label=Hadoop/ws/hbase-archetypes/hbase-shaded-client-project/target/build-archetype/target/generated-sources/archetype/target/hbase-shaded-client-project-archetype-2.0.0-SNAPSHOT>
[INFO] 
[INFO] --- maven-archetype-plugin:2.4:integration-test (default-integration-test) @ hbase-shaded-client-project-archetype ---
[INFO] Processing Archetype IT project: basic
[INFO] ----------------------------------------------------------------------------
[INFO] Using following parameters for creating project from Archetype: hbase-shaded-client-project-archetype:2.0.0-SNAPSHOT
[INFO] ----------------------------------------------------------------------------
[INFO] Parameter: groupId, Value: archetype.it
[INFO] Parameter: artifactId, Value: basic
[INFO] Parameter: version, Value: 0.1-SNAPSHOT
[INFO] Parameter: package, Value: it.pkg
[INFO] Parameter: packageInPathFormat, Value: it/pkg
[INFO] Parameter: version, Value: 0.1-SNAPSHOT
[INFO] Parameter: package, Value: it.pkg
[INFO] Parameter: groupId, Value: archetype.it
[INFO] Parameter: artifactId, Value: basic
[INFO] project created from Archetype in dir: <https://builds.apache.org/job/HBase-Trunk_matrix/jdk=JDK%201.8%20(latest),label=Hadoop/ws/hbase-archetypes/hbase-shaded-client-project/target/build-archetype/target/generated-sources/archetype/target/test-classes/projects/basic/project/basic>
[INFO] 
[INFO] --- maven-install-plugin:2.5.2:install (default-install) @ hbase-shaded-client-project-archetype ---
[INFO] Installing <https://builds.apache.org/job/HBase-Trunk_matrix/jdk=JDK%201.8%20(latest),label=Hadoop/ws/hbase-archetypes/hbase-shaded-client-project/target/build-archetype/target/generated-sources/archetype/target/hbase-shaded-client-project-archetype-2.0.0-SNAPSHOT.jar> to /home/jenkins/.m2/repository/org/apache/hbase/hbase-shaded-client-project-archetype/2.0.0-SNAPSHOT/hbase-shaded-client-project-archetype-2.0.0-SNAPSHOT.jar
[INFO] Installing <https://builds.apache.org/job/HBase-Trunk_matrix/jdk=JDK%201.8%20(latest),label=Hadoop/3036/artifact/hbase-archetypes/hbase-shaded-client-project/target/build-archetype/target/generated-sources/archetype/pom.xml> to /home/jenkins/.m2/repository/org/apache/hbase/hbase-shaded-client-project-archetype/2.0.0-SNAPSHOT/hbase-shaded-client-project-archetype-2.0.0-SNAPSHOT.pom
[INFO] 
[INFO] --- maven-archetype-plugin:2.4:update-local-catalog (default-update-local-catalog) @ hbase-shaded-client-project-archetype ---
[INFO] ------------------------------------------------------------------------
[INFO] BUILD SUCCESS
[INFO] ------------------------------------------------------------------------
[INFO] Total time: 1.509s
[INFO] Finished at: Fri May 19 04:05:37 UTC 2017
[INFO] Final Memory: 21M/724M
[INFO] ------------------------------------------------------------------------
[INFO] ------------------------------------------------------------------------
[INFO] Reactor Summary:
[INFO] 
[INFO] Apache HBase ...................................... SUCCESS [2.032s]
[INFO] Apache HBase - Checkstyle ......................... SUCCESS [0.773s]
[INFO] Apache HBase - Resource Bundle .................... SUCCESS [0.246s]
[INFO] Apache HBase - Annotations ........................ SUCCESS [0.259s]
[INFO] Apache HBase - Common ............................. SUCCESS [1:18.611s]
[INFO] Apache HBase - Protocol ........................... SUCCESS [0.765s]
[INFO] Apache HBase - Shaded Protocol .................... SUCCESS [1.312s]
[INFO] Apache HBase - Procedure .......................... SUCCESS [2:39.613s]
[INFO] Apache HBase - Metrics API ........................ SUCCESS [1.502s]
[INFO] Apache HBase - Hadoop Compatibility ............... SUCCESS [9.612s]
[INFO] Apache HBase - Metrics Implementation ............. SUCCESS [4.244s]
[INFO] Apache HBase - Hadoop Two Compatibility ........... SUCCESS [11.380s]
[INFO] Apache HBase - Client ............................. SUCCESS [2:00.606s]
[INFO] Apache HBase - Prefix Tree ........................ SUCCESS [10.210s]
[INFO] Apache HBase - Server ............................. FAILURE [2:04:32.042s]
[INFO] Apache HBase - Testing Util ....................... SKIPPED
[INFO] Apache HBase - Thrift ............................. SKIPPED
[INFO] Apache HBase - RSGroup ............................ SKIPPED
[INFO] Apache HBase - Shell .............................. SKIPPED
[INFO] Apache HBase - Coprocessor Endpoint ............... SKIPPED
[INFO] Apache HBase - Integration Tests .................. SKIPPED
[INFO] Apache HBase - Examples ........................... SKIPPED
[INFO] Apache HBase - Rest ............................... SKIPPED
[INFO] Apache HBase - External Block Cache ............... SKIPPED
[INFO] Apache HBase - Spark .............................. SKIPPED
[INFO] Apache HBase - Assembly ........................... SKIPPED
[INFO] Apache HBase - Shaded ............................. SUCCESS [0.147s]
[INFO] Apache HBase - Shaded - Client .................... SUCCESS [1.017s]
[INFO] Apache HBase - Shaded - Server .................... SKIPPED
[INFO] Apache HBase - Archetypes ......................... SUCCESS [0.146s]
[INFO] Apache HBase - Exemplar for hbase-client archetype  SKIPPED
[INFO] Apache HBase - Exemplar for hbase-shaded-client archetype  SKIPPED
[INFO] Apache HBase - Archetype builder .................. SUCCESS [15.871s]
[INFO] ------------------------------------------------------------------------
[INFO] BUILD FAILURE
[INFO] ------------------------------------------------------------------------
[INFO] Total time: 2:11:31.602s
[INFO] Finished at: Fri May 19 04:05:37 UTC 2017
[INFO] Final Memory: 83M/2478M
[INFO] ------------------------------------------------------------------------
[ERROR] Failed to execute goal org.apache.maven.plugins:maven-surefire-plugin:2.18.1:test (secondPartTestsExecution) on project hbase-server: There are test failures.
[ERROR] 
[ERROR] Please refer to <https://builds.apache.org/job/HBase-Trunk_matrix/jdk=JDK%201.8%20(latest),label=Hadoop/ws/hbase-server/target/surefire-reports> for the individual test results.
[ERROR] -> [Help 1]
[ERROR] 
[ERROR] To see the full stack trace of the errors, re-run Maven with the -e switch.
[ERROR] Re-run Maven using the -X switch to enable full debug logging.
[ERROR] 
[ERROR] For more information about the errors and possible solutions, please read the following articles:
[ERROR] [Help 1] http://cwiki.apache.org/confluence/display/MAVEN/MojoFailureException
[ERROR] 
[ERROR] After correcting the problems, you can resume the build with the command
[ERROR]   mvn <goals> -rf :hbase-server
Build step 'Invoke top-level Maven targets' marked build as failure
Performing Post build task...
Match found for :.* : True
Logical operation result is TRUE
Running script  : # Run zombie detector script
./dev-support/zombie-detector.sh --jenkins ${BUILD_ID}
[a3159d73] $ /bin/bash -xe /tmp/hudson5468407111681434034.sh
+ ./dev-support/zombie-detector.sh --jenkins 3036
Fri May 19 04:05:39 UTC 2017 We're ok: there is no zombie test


    {color:green}+1 zombies{color}. No zombie tests found running at the end of the build.
POST BUILD TASK : SUCCESS
END OF POST BUILD TASK : 0
Archiving artifacts
Recording test results
[FINDBUGS] Skipping publisher since build result is FAILURE
[CHECKSTYLE] Skipping publisher since build result is FAILURE

Jenkins build is back to normal : HBase-Trunk_matrix » JDK 1.8 (latest),Hadoop #3038

Posted by Apache Jenkins Server <je...@builds.apache.org>.
See <https://builds.apache.org/job/HBase-Trunk_matrix/jdk=JDK%201.8%20(latest),label=Hadoop/3038/display/redirect?page=changes>


Build failed in Jenkins: HBase-Trunk_matrix » JDK 1.8 (latest),Hadoop #3037

Posted by Apache Jenkins Server <je...@builds.apache.org>.
See <https://builds.apache.org/job/HBase-Trunk_matrix/jdk=JDK%201.8%20(latest),label=Hadoop/3037/display/redirect?page=changes>

Changes:

[appy] HBASE-18076 Flaky dashboard improvement: Add status markers to show

[appy] HBASE-18076 (addendum) Flaky dashboard improvement: Add status markers

------------------------------------------
[...truncated 743.57 KB...]
[INFO] 
[INFO] --- maven-compiler-plugin:3.2:testCompile (default-testCompile) @ hbase-prefix-tree ---
[INFO] Nothing to compile - all classes are up to date
[INFO] 
[INFO] --- maven-surefire-plugin:2.18.1:test (default-test) @ hbase-prefix-tree ---
[INFO] Surefire report directory: <https://builds.apache.org/job/HBase-Trunk_matrix/jdk=JDK%201.8%20(latest),label=Hadoop/ws/hbase-prefix-tree/target/surefire-reports>
[INFO] Using configured provider org.apache.maven.surefire.junitcore.JUnitCoreProvider
[INFO] parallel='none', perCoreThreadCount=true, threadCount=0, useUnlimitedThreads=false, threadCountSuites=0, threadCountClasses=0, threadCountMethods=0, parallelOptimized=true

-------------------------------------------------------
 T E S T S
-------------------------------------------------------
Running org.apache.hadoop.hbase.util.vint.TestVIntTool
Tests run: 6, Failures: 0, Errors: 0, Skipped: 0, Time elapsed: 0.114 sec - in org.apache.hadoop.hbase.util.vint.TestVIntTool
Running org.apache.hadoop.hbase.util.vint.TestFIntTool
Tests run: 7, Failures: 0, Errors: 0, Skipped: 0, Time elapsed: 0.005 sec - in org.apache.hadoop.hbase.util.vint.TestFIntTool
Running org.apache.hadoop.hbase.util.vint.TestVLongTool
Tests run: 6, Failures: 0, Errors: 0, Skipped: 0, Time elapsed: 0.117 sec - in org.apache.hadoop.hbase.util.vint.TestVLongTool
Running org.apache.hadoop.hbase.util.bytes.TestByteRange
Tests run: 1, Failures: 0, Errors: 0, Skipped: 0, Time elapsed: 0.003 sec - in org.apache.hadoop.hbase.util.bytes.TestByteRange
Running org.apache.hadoop.hbase.codec.keyvalue.TestKeyValueTool
Tests run: 18, Failures: 0, Errors: 0, Skipped: 0, Time elapsed: 0.036 sec - in org.apache.hadoop.hbase.codec.keyvalue.TestKeyValueTool
Running org.apache.hadoop.hbase.codec.prefixtree.timestamp.TestTimestampEncoder
Tests run: 12, Failures: 0, Errors: 0, Skipped: 0, Time elapsed: 0.008 sec - in org.apache.hadoop.hbase.codec.prefixtree.timestamp.TestTimestampEncoder
Running org.apache.hadoop.hbase.codec.prefixtree.blockmeta.TestBlockMeta
Tests run: 1, Failures: 0, Errors: 0, Skipped: 0, Time elapsed: 0.123 sec - in org.apache.hadoop.hbase.codec.prefixtree.blockmeta.TestBlockMeta
Running org.apache.hadoop.hbase.codec.prefixtree.column.TestColumnBuilder
Tests run: 17, Failures: 0, Errors: 0, Skipped: 0, Time elapsed: 0.231 sec - in org.apache.hadoop.hbase.codec.prefixtree.column.TestColumnBuilder
Running org.apache.hadoop.hbase.codec.prefixtree.builder.TestTokenizer
Tests run: 4, Failures: 0, Errors: 0, Skipped: 0, Time elapsed: 0.006 sec - in org.apache.hadoop.hbase.codec.prefixtree.builder.TestTokenizer
Running org.apache.hadoop.hbase.codec.prefixtree.builder.TestTreeDepth
Tests run: 7, Failures: 0, Errors: 0, Skipped: 0, Time elapsed: 0.176 sec - in org.apache.hadoop.hbase.codec.prefixtree.builder.TestTreeDepth
Running org.apache.hadoop.hbase.codec.prefixtree.row.TestPrefixTreeSearcher
Tests run: 108, Failures: 0, Errors: 0, Skipped: 0, Time elapsed: 0.573 sec - in org.apache.hadoop.hbase.codec.prefixtree.row.TestPrefixTreeSearcher
Running org.apache.hadoop.hbase.codec.prefixtree.row.TestRowEncoder
Tests run: 90, Failures: 0, Errors: 0, Skipped: 0, Time elapsed: 0.342 sec - in org.apache.hadoop.hbase.codec.prefixtree.row.TestRowEncoder

Results :

Tests run: 277, Failures: 0, Errors: 0, Skipped: 0

[INFO] 
[INFO] --- maven-surefire-plugin:2.18.1:test (secondPartTestsExecution) @ hbase-prefix-tree ---
[INFO] Surefire report directory: <https://builds.apache.org/job/HBase-Trunk_matrix/jdk=JDK%201.8%20(latest),label=Hadoop/ws/hbase-prefix-tree/target/surefire-reports>
[INFO] Using configured provider org.apache.maven.surefire.junitcore.JUnitCoreProvider
[INFO] parallel='none', perCoreThreadCount=true, threadCount=0, useUnlimitedThreads=false, threadCountSuites=0, threadCountClasses=0, threadCountMethods=0, parallelOptimized=true

-------------------------------------------------------
 T E S T S
-------------------------------------------------------

Results :

Tests run: 0, Failures: 0, Errors: 0, Skipped: 0

[INFO] 
[INFO] --- maven-source-plugin:3.0.0:jar-no-fork (attach-sources) @ hbase-prefix-tree ---
[INFO] Building jar: <https://builds.apache.org/job/HBase-Trunk_matrix/jdk=JDK%201.8%20(latest),label=Hadoop/ws/hbase-prefix-tree/target/hbase-prefix-tree-2.0.0-SNAPSHOT-sources.jar>
[INFO] 
[INFO] --- maven-jar-plugin:3.0.0:test-jar (default) @ hbase-prefix-tree ---
[INFO] Building jar: <https://builds.apache.org/job/HBase-Trunk_matrix/jdk=JDK%201.8%20(latest),label=Hadoop/ws/hbase-prefix-tree/target/hbase-prefix-tree-2.0.0-SNAPSHOT-tests.jar>
[INFO] 
[INFO] --- maven-jar-plugin:3.0.0:jar (default-jar) @ hbase-prefix-tree ---
[INFO] Building jar: <https://builds.apache.org/job/HBase-Trunk_matrix/jdk=JDK%201.8%20(latest),label=Hadoop/ws/hbase-prefix-tree/target/hbase-prefix-tree-2.0.0-SNAPSHOT.jar>
[INFO] 
[INFO] --- maven-install-plugin:2.5.2:install (default-install) @ hbase-prefix-tree ---
[INFO] Installing <https://builds.apache.org/job/HBase-Trunk_matrix/jdk=JDK%201.8%20(latest),label=Hadoop/ws/hbase-prefix-tree/target/hbase-prefix-tree-2.0.0-SNAPSHOT.jar> to /home/jenkins/.m2/repository/org/apache/hbase/hbase-prefix-tree/2.0.0-SNAPSHOT/hbase-prefix-tree-2.0.0-SNAPSHOT.jar
[INFO] Installing <https://builds.apache.org/job/HBase-Trunk_matrix/jdk=JDK%201.8%20(latest),label=Hadoop/3037/artifact/hbase-prefix-tree/pom.xml> to /home/jenkins/.m2/repository/org/apache/hbase/hbase-prefix-tree/2.0.0-SNAPSHOT/hbase-prefix-tree-2.0.0-SNAPSHOT.pom
[INFO] Installing <https://builds.apache.org/job/HBase-Trunk_matrix/jdk=JDK%201.8%20(latest),label=Hadoop/ws/hbase-prefix-tree/target/hbase-prefix-tree-2.0.0-SNAPSHOT-sources.jar> to /home/jenkins/.m2/repository/org/apache/hbase/hbase-prefix-tree/2.0.0-SNAPSHOT/hbase-prefix-tree-2.0.0-SNAPSHOT-sources.jar
[INFO] Installing <https://builds.apache.org/job/HBase-Trunk_matrix/jdk=JDK%201.8%20(latest),label=Hadoop/ws/hbase-prefix-tree/target/hbase-prefix-tree-2.0.0-SNAPSHOT-tests.jar> to /home/jenkins/.m2/repository/org/apache/hbase/hbase-prefix-tree/2.0.0-SNAPSHOT/hbase-prefix-tree-2.0.0-SNAPSHOT-tests.jar
[INFO]                                                                         
[INFO] ------------------------------------------------------------------------
[INFO] Building Apache HBase - Server 2.0.0-SNAPSHOT
[INFO] ------------------------------------------------------------------------
[WARNING] The POM for org.glassfish:javax.el:jar:3.0.1-b06-SNAPSHOT is missing, no dependency information available
[WARNING] The POM for org.glassfish:javax.el:jar:3.0.1-b07-SNAPSHOT is missing, no dependency information available
[WARNING] The POM for org.glassfish:javax.el:jar:3.0.1-b08-SNAPSHOT is missing, no dependency information available
[INFO] 
[INFO] --- maven-enforcer-plugin:1.4:enforce (min-maven-min-java-banned-xerces) @ hbase-server ---
[INFO] 
[INFO] --- maven-enforcer-plugin:1.4:enforce (banned-jsr305) @ hbase-server ---
[INFO] 
[INFO] --- buildnumber-maven-plugin:1.3:create-timestamp (default) @ hbase-server ---
[INFO] 
[INFO] --- build-helper-maven-plugin:1.9.1:add-source (jspcSource-packageInfo-source) @ hbase-server ---
[INFO] Source directory: <https://builds.apache.org/job/HBase-Trunk_matrix/jdk=JDK%201.8%20(latest),label=Hadoop/ws/hbase-server/target/generated-jamon> added.
[INFO] Source directory: <https://builds.apache.org/job/HBase-Trunk_matrix/jdk=JDK%201.8%20(latest),label=Hadoop/ws/hbase-server/target/generated-sources/java> added.
[INFO] 
[INFO] --- jamon-maven-plugin:2.4.1:translate (default) @ hbase-server ---
[INFO] 
[INFO] --- maven-antrun-plugin:1.8:run (generate) @ hbase-server ---
[INFO] Executing tasks

main:
[INFO] Executed tasks
[INFO] 
[INFO] --- maven-remote-resources-plugin:1.5:process (process-resource-bundles) @ hbase-server ---
[INFO] 
[INFO] --- maven-resources-plugin:2.7:resources (default-resources) @ hbase-server ---
[INFO] Using 'UTF-8' encoding to copy filtered resources.
[INFO] Copying 22 resources
[INFO] Copying 3 resources
[INFO] 
[INFO] --- maven-compiler-plugin:3.2:compile (default-compile) @ hbase-server ---
[INFO] Compiling 7 source files to <https://builds.apache.org/job/HBase-Trunk_matrix/jdk=JDK%201.8%20(latest),label=Hadoop/ws/hbase-server/target/classes>
[INFO] 
[INFO] --- maven-dependency-plugin:2.10:build-classpath (create-mrapp-generated-classpath) @ hbase-server ---
[INFO] Skipped writing classpath file '<https://builds.apache.org/job/HBase-Trunk_matrix/jdk=JDK%201.8%20(latest),label=Hadoop/ws/hbase-server/target/test-classes/mrapp-generated-classpath'.>  No changes found.
[INFO] 
[INFO] --- maven-resources-plugin:2.7:testResources (default-testResources) @ hbase-server ---
[INFO] Using 'UTF-8' encoding to copy filtered resources.
[INFO] Copying 1 resource to META-INF/
[INFO] Copying 15 resources
[INFO] Copying 3 resources
[INFO] 
[INFO] --- maven-compiler-plugin:3.2:testCompile (default-testCompile) @ hbase-server ---
[INFO] Nothing to compile - all classes are up to date
[INFO] 
[INFO] --- maven-surefire-plugin:2.18.1:test (default-test) @ hbase-server ---
[INFO] Surefire report directory: <https://builds.apache.org/job/HBase-Trunk_matrix/jdk=JDK%201.8%20(latest),label=Hadoop/ws/hbase-server/target/surefire-reports>
[INFO] Using configured provider org.apache.maven.surefire.junitcore.JUnitCoreProvider
[INFO] parallel='none', perCoreThreadCount=true, threadCount=0, useUnlimitedThreads=false, threadCountSuites=0, threadCountClasses=0, threadCountMethods=0, parallelOptimized=true

-------------------------------------------------------
 T E S T S
-------------------------------------------------------
Running org.apache.hadoop.hbase.master.TestRegionPlan
Tests run: 1, Failures: 0, Errors: 0, Skipped: 0, Time elapsed: 0.305 sec - in org.apache.hadoop.hbase.master.TestRegionPlan
Running org.apache.hadoop.hbase.master.TestHMasterCommandLine
Tests run: 1, Failures: 0, Errors: 0, Skipped: 0, Time elapsed: 0.496 sec - in org.apache.hadoop.hbase.master.TestHMasterCommandLine
Running org.apache.hadoop.hbase.master.TestCatalogJanitor
Tests run: 7, Failures: 0, Errors: 0, Skipped: 0, Time elapsed: 12.1 sec - in org.apache.hadoop.hbase.master.TestCatalogJanitor
Running org.apache.hadoop.hbase.master.locking.TestLockManager
Tests run: 3, Failures: 0, Errors: 0, Skipped: 0, Time elapsed: 3.341 sec - in org.apache.hadoop.hbase.master.locking.TestLockManager
Running org.apache.hadoop.hbase.master.locking.TestLockProcedure
Tests run: 14, Failures: 0, Errors: 0, Skipped: 0, Time elapsed: 35.344 sec - in org.apache.hadoop.hbase.master.locking.TestLockProcedure
Running org.apache.hadoop.hbase.master.normalizer.TestSimpleRegionNormalizer
Tests run: 7, Failures: 0, Errors: 0, Skipped: 0, Time elapsed: 1.335 sec - in org.apache.hadoop.hbase.master.normalizer.TestSimpleRegionNormalizer
Running org.apache.hadoop.hbase.master.procedure.TestMasterProcedureScheduler
Tests run: 22, Failures: 0, Errors: 0, Skipped: 0, Time elapsed: 1.453 sec - in org.apache.hadoop.hbase.master.procedure.TestMasterProcedureScheduler
Running org.apache.hadoop.hbase.master.snapshot.TestSnapshotHFileCleaner
Tests run: 4, Failures: 0, Errors: 0, Skipped: 0, Time elapsed: 1.055 sec - in org.apache.hadoop.hbase.master.snapshot.TestSnapshotHFileCleaner
Running org.apache.hadoop.hbase.master.snapshot.TestSnapshotManager
Tests run: 2, Failures: 0, Errors: 0, Skipped: 0, Time elapsed: 0.387 sec - in org.apache.hadoop.hbase.master.snapshot.TestSnapshotManager
Running org.apache.hadoop.hbase.master.TestRegionStates
Tests run: 2, Failures: 0, Errors: 0, Skipped: 0, Time elapsed: 0.775 sec - in org.apache.hadoop.hbase.master.TestRegionStates
Running org.apache.hadoop.hbase.master.cleaner.TestReplicationHFileCleaner
Tests run: 4, Failures: 0, Errors: 0, Skipped: 0, Time elapsed: 0.554 sec - in org.apache.hadoop.hbase.master.cleaner.TestReplicationHFileCleaner
Running org.apache.hadoop.hbase.master.cleaner.TestCleanerChore
Tests run: 8, Failures: 0, Errors: 0, Skipped: 0, Time elapsed: 1.156 sec - in org.apache.hadoop.hbase.master.cleaner.TestCleanerChore
Running org.apache.hadoop.hbase.master.balancer.TestRegionLocationFinder
Tests run: 4, Failures: 0, Errors: 0, Skipped: 0, Time elapsed: 3.516 sec - in org.apache.hadoop.hbase.master.balancer.TestRegionLocationFinder
Running org.apache.hadoop.hbase.master.balancer.TestServerAndLoad
Tests run: 1, Failures: 0, Errors: 0, Skipped: 0, Time elapsed: 0.285 sec - in org.apache.hadoop.hbase.master.balancer.TestServerAndLoad
Running org.apache.hadoop.hbase.master.TestClockSkewDetection
Tests run: 1, Failures: 0, Errors: 0, Skipped: 0, Time elapsed: 0.621 sec - in org.apache.hadoop.hbase.master.TestClockSkewDetection
Running org.apache.hadoop.hbase.master.TestRegionState
Tests run: 1, Failures: 0, Errors: 0, Skipped: 0, Time elapsed: 1.01 sec - in org.apache.hadoop.hbase.master.TestRegionState
Running org.apache.hadoop.hbase.master.TestMasterQosFunction
Tests run: 2, Failures: 0, Errors: 0, Skipped: 0, Time elapsed: 1.776 sec - in org.apache.hadoop.hbase.master.TestMasterQosFunction
Running org.apache.hadoop.hbase.TestCheckTestClasses
Tests run: 1, Failures: 0, Errors: 0, Skipped: 0, Time elapsed: 3.567 sec - in org.apache.hadoop.hbase.TestCheckTestClasses
Running org.apache.hadoop.hbase.conf.TestConfigurationManager
Tests run: 2, Failures: 0, Errors: 0, Skipped: 0, Time elapsed: 0.314 sec - in org.apache.hadoop.hbase.conf.TestConfigurationManager
Running org.apache.hadoop.hbase.regionserver.TestStoreFileInfo
Tests run: 2, Failures: 0, Errors: 0, Skipped: 0, Time elapsed: 0.48 sec - in org.apache.hadoop.hbase.regionserver.TestStoreFileInfo
Running org.apache.hadoop.hbase.regionserver.TestDefaultCompactSelection
Tests run: 4, Failures: 0, Errors: 0, Skipped: 0, Time elapsed: 1.651 sec - in org.apache.hadoop.hbase.regionserver.TestDefaultCompactSelection
Running org.apache.hadoop.hbase.regionserver.TestDefaultStoreEngine
Tests run: 1, Failures: 0, Errors: 0, Skipped: 0, Time elapsed: 0.814 sec - in org.apache.hadoop.hbase.regionserver.TestDefaultStoreEngine
Running org.apache.hadoop.hbase.regionserver.TestStoreFileScannerWithTagCompression
Tests run: 1, Failures: 0, Errors: 0, Skipped: 0, Time elapsed: 0.403 sec - in org.apache.hadoop.hbase.regionserver.TestStoreFileScannerWithTagCompression
Running org.apache.hadoop.hbase.regionserver.TestTimeRangeTracker
Tests run: 9, Failures: 0, Errors: 0, Skipped: 0, Time elapsed: 5.61 sec - in org.apache.hadoop.hbase.regionserver.TestTimeRangeTracker
Running org.apache.hadoop.hbase.regionserver.compactions.TestDateTieredCompactor
Tests run: 4, Failures: 0, Errors: 0, Skipped: 0, Time elapsed: 1.105 sec - in org.apache.hadoop.hbase.regionserver.compactions.TestDateTieredCompactor
Running org.apache.hadoop.hbase.regionserver.compactions.TestOffPeakHours
Tests run: 3, Failures: 0, Errors: 0, Skipped: 0, Time elapsed: 0.102 sec - in org.apache.hadoop.hbase.regionserver.compactions.TestOffPeakHours
Running org.apache.hadoop.hbase.regionserver.compactions.TestStripeCompactionPolicy
Tests run: 30, Failures: 0, Errors: 0, Skipped: 0, Time elapsed: 3.395 sec - in org.apache.hadoop.hbase.regionserver.compactions.TestStripeCompactionPolicy
Running org.apache.hadoop.hbase.regionserver.compactions.TestStripeCompactor
Tests run: 6, Failures: 0, Errors: 0, Skipped: 0, Time elapsed: 1.971 sec - in org.apache.hadoop.hbase.regionserver.compactions.TestStripeCompactor
Running org.apache.hadoop.hbase.regionserver.TestStoreFileRefresherChore
Tests run: 1, Failures: 0, Errors: 0, Skipped: 0, Time elapsed: 2.78 sec - in org.apache.hadoop.hbase.regionserver.TestStoreFileRefresherChore
Running org.apache.hadoop.hbase.regionserver.TestRegionServerAccounting
Tests run: 6, Failures: 0, Errors: 0, Skipped: 0, Time elapsed: 0.715 sec - in org.apache.hadoop.hbase.regionserver.TestRegionServerAccounting
Running org.apache.hadoop.hbase.regionserver.TestMemstoreLABWithoutPool
Tests run: 2, Failures: 0, Errors: 0, Skipped: 0, Time elapsed: 7.593 sec - in org.apache.hadoop.hbase.regionserver.TestMemstoreLABWithoutPool
Running org.apache.hadoop.hbase.regionserver.TestStoreFile
Tests run: 13, Failures: 0, Errors: 0, Skipped: 0, Time elapsed: 3.393 sec - in org.apache.hadoop.hbase.regionserver.TestStoreFile
Running org.apache.hadoop.hbase.regionserver.TestKeyValueScanFixture
Tests run: 1, Failures: 0, Errors: 0, Skipped: 0, Time elapsed: 0.276 sec - in org.apache.hadoop.hbase.regionserver.TestKeyValueScanFixture
Running org.apache.hadoop.hbase.regionserver.TestMetricsRegion
Tests run: 1, Failures: 0, Errors: 0, Skipped: 0, Time elapsed: 0.449 sec - in org.apache.hadoop.hbase.regionserver.TestMetricsRegion
Running org.apache.hadoop.hbase.regionserver.TestServerNonceManager
Tests run: 7, Failures: 0, Errors: 0, Skipped: 0, Time elapsed: 1.898 sec - in org.apache.hadoop.hbase.regionserver.TestServerNonceManager
Running org.apache.hadoop.hbase.regionserver.TestCellFlatSet
Tests run: 8, Failures: 0, Errors: 0, Skipped: 0, Time elapsed: 0.302 sec - in org.apache.hadoop.hbase.regionserver.TestCellFlatSet
Running org.apache.hadoop.hbase.regionserver.TestResettingCounters
Tests run: 1, Failures: 0, Errors: 0, Skipped: 0, Time elapsed: 2.432 sec - in org.apache.hadoop.hbase.regionserver.TestResettingCounters
Running org.apache.hadoop.hbase.regionserver.TestCellSkipListSet
Tests run: 4, Failures: 0, Errors: 0, Skipped: 0, Time elapsed: 0.265 sec - in org.apache.hadoop.hbase.regionserver.TestCellSkipListSet
Running org.apache.hadoop.hbase.regionserver.TestHRegionFileSystem
Tests run: 4, Failures: 0, Errors: 0, Skipped: 0, Time elapsed: 47.485 sec - in org.apache.hadoop.hbase.regionserver.TestHRegionFileSystem
Running org.apache.hadoop.hbase.regionserver.TestDateTieredCompactionPolicy
Tests run: 15, Failures: 0, Errors: 0, Skipped: 0, Time elapsed: 2.113 sec - in org.apache.hadoop.hbase.regionserver.TestDateTieredCompactionPolicy
Running org.apache.hadoop.hbase.regionserver.TestRpcSchedulerFactory
Tests run: 2, Failures: 0, Errors: 0, Skipped: 0, Time elapsed: 0.54 sec - in org.apache.hadoop.hbase.regionserver.TestRpcSchedulerFactory
Running org.apache.hadoop.hbase.regionserver.TestWALMonotonicallyIncreasingSeqId
Tests run: 1, Failures: 0, Errors: 0, Skipped: 0, Time elapsed: 2.683 sec - in org.apache.hadoop.hbase.regionserver.TestWALMonotonicallyIncreasingSeqId
Running org.apache.hadoop.hbase.regionserver.TestQosFunction
Tests run: 2, Failures: 0, Errors: 0, Skipped: 0, Time elapsed: 1.26 sec - in org.apache.hadoop.hbase.regionserver.TestQosFunction
Running org.apache.hadoop.hbase.regionserver.TestRegionSplitPolicy
Tests run: 9, Failures: 0, Errors: 0, Skipped: 0, Time elapsed: 2.002 sec - in org.apache.hadoop.hbase.regionserver.TestRegionSplitPolicy
Running org.apache.hadoop.hbase.regionserver.TestKeepDeletes
Tests run: 12, Failures: 0, Errors: 0, Skipped: 0, Time elapsed: 4.14 sec - in org.apache.hadoop.hbase.regionserver.TestKeepDeletes
Running org.apache.hadoop.hbase.regionserver.TestStripeStoreEngine
Tests run: 2, Failures: 0, Errors: 0, Skipped: 0, Time elapsed: 0.983 sec - in org.apache.hadoop.hbase.regionserver.TestStripeStoreEngine
Running org.apache.hadoop.hbase.regionserver.TestMetricsRegionServer
Tests run: 6, Failures: 0, Errors: 0, Skipped: 0, Time elapsed: 1.204 sec - in org.apache.hadoop.hbase.regionserver.TestMetricsRegionServer
Running org.apache.hadoop.hbase.regionserver.TestMinVersions
Tests run: 6, Failures: 0, Errors: 0, Skipped: 0, Time elapsed: 2.981 sec - in org.apache.hadoop.hbase.regionserver.TestMinVersions
Running org.apache.hadoop.hbase.regionserver.TestObservedExceptionsInBatch
Tests run: 2, Failures: 0, Errors: 0, Skipped: 0, Time elapsed: 0.299 sec - in org.apache.hadoop.hbase.regionserver.TestObservedExceptionsInBatch
Running org.apache.hadoop.hbase.regionserver.TestScanWithBloomError
Tests run: 3, Failures: 0, Errors: 0, Skipped: 0, Time elapsed: 2.133 sec - in org.apache.hadoop.hbase.regionserver.TestScanWithBloomError
Running org.apache.hadoop.hbase.regionserver.TestRSStatusServlet
Tests run: 2, Failures: 0, Errors: 0, Skipped: 0, Time elapsed: 1.204 sec - in org.apache.hadoop.hbase.regionserver.TestRSStatusServlet
Running org.apache.hadoop.hbase.regionserver.TestMetricsTableAggregate
Tests run: 1, Failures: 0, Errors: 0, Skipped: 0, Time elapsed: 0.492 sec - in org.apache.hadoop.hbase.regionserver.TestMetricsTableAggregate
Running org.apache.hadoop.hbase.regionserver.TestMemStoreLAB
Build step 'Invoke top-level Maven targets' marked build as failure
Performing Post build task...
Match found for :.* : True
Logical operation result is TRUE
Running script  : # Run zombie detector script
./dev-support/zombie-detector.sh --jenkins ${BUILD_ID}
[a3159d73] $ /bin/bash -xe /tmp/hudson7412704575959780949.sh
+ ./dev-support/zombie-detector.sh --jenkins 3037
Fri May 19 06:01:03 UTC 2017 We're ok: there is no zombie test


    {color:green}+1 zombies{color}. No zombie tests found running at the end of the build.
POST BUILD TASK : SUCCESS
END OF POST BUILD TASK : 0
Archiving artifacts
Recording test results
[FINDBUGS] Skipping publisher since build result is FAILURE
[CHECKSTYLE] Skipping publisher since build result is FAILURE