You are viewing a plain text version of this content. The canonical link for it is here.
Posted to dev@lucene.apache.org by Policeman Jenkins Server <je...@thetaphi.de> on 2016/06/19 14:04:59 UTC

[JENKINS] Lucene-Solr-6.x-Linux (32bit/jdk1.8.0_92) - Build # 922 - Failure!

Build: http://jenkins.thetaphi.de/job/Lucene-Solr-6.x-Linux/922/
Java: 32bit/jdk1.8.0_92 -client -XX:+UseSerialGC

1 tests failed.
FAILED:  org.apache.solr.schema.TestManagedSchemaAPI.test

Error Message:
Error from server at http://127.0.0.1:34159/solr/testschemaapi_shard1_replica1: ERROR: [doc=2] unknown field 'myNewField1'

Stack Trace:
org.apache.solr.client.solrj.impl.CloudSolrClient$RouteException: Error from server at http://127.0.0.1:34159/solr/testschemaapi_shard1_replica1: ERROR: [doc=2] unknown field 'myNewField1'
	at __randomizedtesting.SeedInfo.seed([EFE60EE1E8DAC4CE:67B2313B4626A936]:0)
	at org.apache.solr.client.solrj.impl.CloudSolrClient.directUpdate(CloudSolrClient.java:697)
	at org.apache.solr.client.solrj.impl.CloudSolrClient.sendRequest(CloudSolrClient.java:1109)
	at org.apache.solr.client.solrj.impl.CloudSolrClient.requestWithRetryOnStaleState(CloudSolrClient.java:998)
	at org.apache.solr.client.solrj.impl.CloudSolrClient.request(CloudSolrClient.java:934)
	at org.apache.solr.schema.TestManagedSchemaAPI.testAddFieldAndDocument(TestManagedSchemaAPI.java:86)
	at org.apache.solr.schema.TestManagedSchemaAPI.test(TestManagedSchemaAPI.java:55)
	at sun.reflect.NativeMethodAccessorImpl.invoke0(Native Method)
	at sun.reflect.NativeMethodAccessorImpl.invoke(NativeMethodAccessorImpl.java:62)
	at sun.reflect.DelegatingMethodAccessorImpl.invoke(DelegatingMethodAccessorImpl.java:43)
	at java.lang.reflect.Method.invoke(Method.java:498)
	at com.carrotsearch.randomizedtesting.RandomizedRunner.invoke(RandomizedRunner.java:1764)
	at com.carrotsearch.randomizedtesting.RandomizedRunner$8.evaluate(RandomizedRunner.java:871)
	at com.carrotsearch.randomizedtesting.RandomizedRunner$9.evaluate(RandomizedRunner.java:907)
	at com.carrotsearch.randomizedtesting.RandomizedRunner$10.evaluate(RandomizedRunner.java:921)
	at com.carrotsearch.randomizedtesting.rules.SystemPropertiesRestoreRule$1.evaluate(SystemPropertiesRestoreRule.java:57)
	at org.apache.lucene.util.TestRuleSetupTeardownChained$1.evaluate(TestRuleSetupTeardownChained.java:49)
	at org.apache.lucene.util.AbstractBeforeAfterRule$1.evaluate(AbstractBeforeAfterRule.java:45)
	at org.apache.lucene.util.TestRuleThreadAndTestName$1.evaluate(TestRuleThreadAndTestName.java:48)
	at org.apache.lucene.util.TestRuleIgnoreAfterMaxFailures$1.evaluate(TestRuleIgnoreAfterMaxFailures.java:64)
	at org.apache.lucene.util.TestRuleMarkFailure$1.evaluate(TestRuleMarkFailure.java:47)
	at com.carrotsearch.randomizedtesting.rules.StatementAdapter.evaluate(StatementAdapter.java:36)
	at com.carrotsearch.randomizedtesting.ThreadLeakControl$StatementRunner.run(ThreadLeakControl.java:367)
	at com.carrotsearch.randomizedtesting.ThreadLeakControl.forkTimeoutingTask(ThreadLeakControl.java:809)
	at com.carrotsearch.randomizedtesting.ThreadLeakControl$3.evaluate(ThreadLeakControl.java:460)
	at com.carrotsearch.randomizedtesting.RandomizedRunner.runSingleTest(RandomizedRunner.java:880)
	at com.carrotsearch.randomizedtesting.RandomizedRunner$5.evaluate(RandomizedRunner.java:781)
	at com.carrotsearch.randomizedtesting.RandomizedRunner$6.evaluate(RandomizedRunner.java:816)
	at com.carrotsearch.randomizedtesting.RandomizedRunner$7.evaluate(RandomizedRunner.java:827)
	at com.carrotsearch.randomizedtesting.rules.StatementAdapter.evaluate(StatementAdapter.java:36)
	at com.carrotsearch.randomizedtesting.rules.SystemPropertiesRestoreRule$1.evaluate(SystemPropertiesRestoreRule.java:57)
	at org.apache.lucene.util.AbstractBeforeAfterRule$1.evaluate(AbstractBeforeAfterRule.java:45)
	at com.carrotsearch.randomizedtesting.rules.StatementAdapter.evaluate(StatementAdapter.java:36)
	at org.apache.lucene.util.TestRuleStoreClassName$1.evaluate(TestRuleStoreClassName.java:41)
	at com.carrotsearch.randomizedtesting.rules.NoShadowingOrOverridesOnMethodsRule$1.evaluate(NoShadowingOrOverridesOnMethodsRule.java:40)
	at com.carrotsearch.randomizedtesting.rules.NoShadowingOrOverridesOnMethodsRule$1.evaluate(NoShadowingOrOverridesOnMethodsRule.java:40)
	at com.carrotsearch.randomizedtesting.rules.StatementAdapter.evaluate(StatementAdapter.java:36)
	at com.carrotsearch.randomizedtesting.rules.StatementAdapter.evaluate(StatementAdapter.java:36)
	at com.carrotsearch.randomizedtesting.rules.StatementAdapter.evaluate(StatementAdapter.java:36)
	at org.apache.lucene.util.TestRuleAssertionsRequired$1.evaluate(TestRuleAssertionsRequired.java:53)
	at org.apache.lucene.util.TestRuleMarkFailure$1.evaluate(TestRuleMarkFailure.java:47)
	at org.apache.lucene.util.TestRuleIgnoreAfterMaxFailures$1.evaluate(TestRuleIgnoreAfterMaxFailures.java:64)
	at org.apache.lucene.util.TestRuleIgnoreTestSuites$1.evaluate(TestRuleIgnoreTestSuites.java:54)
	at com.carrotsearch.randomizedtesting.rules.StatementAdapter.evaluate(StatementAdapter.java:36)
	at com.carrotsearch.randomizedtesting.ThreadLeakControl$StatementRunner.run(ThreadLeakControl.java:367)
	at java.lang.Thread.run(Thread.java:745)
Caused by: org.apache.solr.client.solrj.impl.HttpSolrClient$RemoteSolrException: Error from server at http://127.0.0.1:34159/solr/testschemaapi_shard1_replica1: ERROR: [doc=2] unknown field 'myNewField1'
	at org.apache.solr.client.solrj.impl.HttpSolrClient.executeMethod(HttpSolrClient.java:590)
	at org.apache.solr.client.solrj.impl.HttpSolrClient.request(HttpSolrClient.java:259)
	at org.apache.solr.client.solrj.impl.HttpSolrClient.request(HttpSolrClient.java:248)
	at org.apache.solr.client.solrj.impl.LBHttpSolrClient.doRequest(LBHttpSolrClient.java:403)
	at org.apache.solr.client.solrj.impl.LBHttpSolrClient.request(LBHttpSolrClient.java:356)
	at org.apache.solr.client.solrj.impl.CloudSolrClient.lambda$directUpdate$0(CloudSolrClient.java:674)
	at java.util.concurrent.FutureTask.run(FutureTask.java:266)
	at org.apache.solr.common.util.ExecutorUtil$MDCAwareThreadPoolExecutor.lambda$execute$0(ExecutorUtil.java:229)
	at java.util.concurrent.ThreadPoolExecutor.runWorker(ThreadPoolExecutor.java:1142)
	at java.util.concurrent.ThreadPoolExecutor$Worker.run(ThreadPoolExecutor.java:617)
	... 1 more




Build Log:
[...truncated 11210 lines...]
   [junit4] Suite: org.apache.solr.schema.TestManagedSchemaAPI
   [junit4]   2> Creating dataDir: /home/jenkins/workspace/Lucene-Solr-6.x-Linux/solr/build/solr-core/test/J0/temp/solr.schema.TestManagedSchemaAPI_EFE60EE1E8DAC4CE-001/init-core-data-001
   [junit4]   2> 740472 INFO  (SUITE-TestManagedSchemaAPI-seed#[EFE60EE1E8DAC4CE]-worker) [    ] o.a.s.SolrTestCaseJ4 Randomized ssl (false) and clientAuth (true) via: @org.apache.solr.util.RandomizeSSL(reason=, ssl=NaN, value=NaN, clientAuth=NaN)
   [junit4]   2> 740473 INFO  (SUITE-TestManagedSchemaAPI-seed#[EFE60EE1E8DAC4CE]-worker) [    ] o.a.s.c.ZkTestServer STARTING ZK TEST SERVER
   [junit4]   2> 740473 INFO  (Thread-1940) [    ] o.a.s.c.ZkTestServer client port:0.0.0.0/0.0.0.0:0
   [junit4]   2> 740473 INFO  (Thread-1940) [    ] o.a.s.c.ZkTestServer Starting server
   [junit4]   2> 740573 INFO  (SUITE-TestManagedSchemaAPI-seed#[EFE60EE1E8DAC4CE]-worker) [    ] o.a.s.c.ZkTestServer start zk server on port:37713
   [junit4]   2> 740574 INFO  (SUITE-TestManagedSchemaAPI-seed#[EFE60EE1E8DAC4CE]-worker) [    ] o.a.s.c.c.SolrZkClient Using default ZkCredentialsProvider
   [junit4]   2> 740574 INFO  (SUITE-TestManagedSchemaAPI-seed#[EFE60EE1E8DAC4CE]-worker) [    ] o.a.s.c.c.ConnectionManager Waiting for client to connect to ZooKeeper
   [junit4]   2> 740576 INFO  (zkCallback-901-thread-1) [    ] o.a.s.c.c.ConnectionManager Watcher org.apache.solr.common.cloud.ConnectionManager@3c9a54 name:ZooKeeperConnection Watcher:127.0.0.1:37713 got event WatchedEvent state:SyncConnected type:None path:null path:null type:None
   [junit4]   2> 740577 INFO  (SUITE-TestManagedSchemaAPI-seed#[EFE60EE1E8DAC4CE]-worker) [    ] o.a.s.c.c.ConnectionManager Client is connected to ZooKeeper
   [junit4]   2> 740577 INFO  (SUITE-TestManagedSchemaAPI-seed#[EFE60EE1E8DAC4CE]-worker) [    ] o.a.s.c.c.SolrZkClient Using default ZkACLProvider
   [junit4]   2> 740577 INFO  (SUITE-TestManagedSchemaAPI-seed#[EFE60EE1E8DAC4CE]-worker) [    ] o.a.s.c.c.SolrZkClient makePath: /solr/solr.xml
   [junit4]   2> 740580 INFO  (jetty-launcher-900-thread-1) [    ] o.e.j.s.Server jetty-9.3.8.v20160314
   [junit4]   2> 740580 INFO  (jetty-launcher-900-thread-2) [    ] o.e.j.s.Server jetty-9.3.8.v20160314
   [junit4]   2> 740582 INFO  (jetty-launcher-900-thread-1) [    ] o.e.j.s.h.ContextHandler Started o.e.j.s.ServletContextHandler@1964e7e{/solr,null,AVAILABLE}
   [junit4]   2> 740582 INFO  (jetty-launcher-900-thread-2) [    ] o.e.j.s.h.ContextHandler Started o.e.j.s.ServletContextHandler@ef0211{/solr,null,AVAILABLE}
   [junit4]   2> 740585 INFO  (jetty-launcher-900-thread-1) [    ] o.e.j.s.ServerConnector Started ServerConnector@b02d39{HTTP/1.1,[http/1.1]}{127.0.0.1:34159}
   [junit4]   2> 740585 INFO  (jetty-launcher-900-thread-2) [    ] o.e.j.s.ServerConnector Started ServerConnector@50ad4a{HTTP/1.1,[http/1.1]}{127.0.0.1:43078}
   [junit4]   2> 740585 INFO  (jetty-launcher-900-thread-1) [    ] o.e.j.s.Server Started @742163ms
   [junit4]   2> 740585 INFO  (jetty-launcher-900-thread-2) [    ] o.e.j.s.Server Started @742163ms
   [junit4]   2> 740585 INFO  (jetty-launcher-900-thread-1) [    ] o.a.s.c.s.e.JettySolrRunner Jetty properties: {hostContext=/solr, hostPort=34159}
   [junit4]   2> 740585 INFO  (jetty-launcher-900-thread-2) [    ] o.a.s.c.s.e.JettySolrRunner Jetty properties: {hostContext=/solr, hostPort=43078}
   [junit4]   2> 740585 INFO  (jetty-launcher-900-thread-1) [    ] o.a.s.s.SolrDispatchFilter SolrDispatchFilter.init(): sun.misc.Launcher$AppClassLoader@1d16e93
   [junit4]   2> 740585 INFO  (jetty-launcher-900-thread-2) [    ] o.a.s.s.SolrDispatchFilter SolrDispatchFilter.init(): sun.misc.Launcher$AppClassLoader@1d16e93
   [junit4]   2> 740585 INFO  (jetty-launcher-900-thread-1) [    ] o.a.s.c.SolrResourceLoader new SolrResourceLoader for directory: '/home/jenkins/workspace/Lucene-Solr-6.x-Linux/solr/build/solr-core/test/J0/temp/solr.schema.TestManagedSchemaAPI_EFE60EE1E8DAC4CE-001/tempDir-001/node1'
   [junit4]   2> 740585 INFO  (jetty-launcher-900-thread-2) [    ] o.a.s.c.SolrResourceLoader new SolrResourceLoader for directory: '/home/jenkins/workspace/Lucene-Solr-6.x-Linux/solr/build/solr-core/test/J0/temp/solr.schema.TestManagedSchemaAPI_EFE60EE1E8DAC4CE-001/tempDir-001/node2'
   [junit4]   2> 740585 INFO  (jetty-launcher-900-thread-1) [    ] o.a.s.c.SolrResourceLoader JNDI not configured for solr (NoInitialContextEx)
   [junit4]   2> 740585 INFO  (jetty-launcher-900-thread-2) [    ] o.a.s.c.SolrResourceLoader JNDI not configured for solr (NoInitialContextEx)
   [junit4]   2> 740585 INFO  (jetty-launcher-900-thread-1) [    ] o.a.s.c.SolrResourceLoader solr home defaulted to 'solr/' (could not find system property or JNDI)
   [junit4]   2> 740585 INFO  (jetty-launcher-900-thread-2) [    ] o.a.s.c.SolrResourceLoader solr home defaulted to 'solr/' (could not find system property or JNDI)
   [junit4]   2> 740586 INFO  (jetty-launcher-900-thread-1) [    ] o.a.s.c.c.SolrZkClient Using default ZkCredentialsProvider
   [junit4]   2> 740586 INFO  (jetty-launcher-900-thread-2) [    ] o.a.s.c.c.SolrZkClient Using default ZkCredentialsProvider
   [junit4]   2> 740586 INFO  (jetty-launcher-900-thread-1) [    ] o.a.s.c.c.ConnectionManager Waiting for client to connect to ZooKeeper
   [junit4]   2> 740586 INFO  (jetty-launcher-900-thread-2) [    ] o.a.s.c.c.ConnectionManager Waiting for client to connect to ZooKeeper
   [junit4]   2> 740587 INFO  (zkCallback-902-thread-1) [    ] o.a.s.c.c.ConnectionManager Watcher org.apache.solr.common.cloud.ConnectionManager@1c572ae name:ZooKeeperConnection Watcher:127.0.0.1:37713/solr got event WatchedEvent state:SyncConnected type:None path:null path:null type:None
   [junit4]   2> 740587 INFO  (jetty-launcher-900-thread-1) [    ] o.a.s.c.c.ConnectionManager Client is connected to ZooKeeper
   [junit4]   2> 740587 INFO  (zkCallback-903-thread-1) [    ] o.a.s.c.c.ConnectionManager Watcher org.apache.solr.common.cloud.ConnectionManager@8b31c name:ZooKeeperConnection Watcher:127.0.0.1:37713/solr got event WatchedEvent state:SyncConnected type:None path:null path:null type:None
   [junit4]   2> 740588 INFO  (jetty-launcher-900-thread-2) [    ] o.a.s.c.c.ConnectionManager Client is connected to ZooKeeper
   [junit4]   2> 740588 INFO  (jetty-launcher-900-thread-1) [    ] o.a.s.c.c.SolrZkClient Using default ZkACLProvider
   [junit4]   2> 740588 INFO  (jetty-launcher-900-thread-2) [    ] o.a.s.c.c.SolrZkClient Using default ZkACLProvider
   [junit4]   2> 740588 INFO  (jetty-launcher-900-thread-1) [    ] o.a.s.s.SolrDispatchFilter solr.xml found in ZooKeeper. Loading...
   [junit4]   2> 740588 INFO  (jetty-launcher-900-thread-2) [    ] o.a.s.s.SolrDispatchFilter solr.xml found in ZooKeeper. Loading...
   [junit4]   2> 740596 INFO  (jetty-launcher-900-thread-1) [    ] o.a.s.c.CorePropertiesLocator Config-defined core root directory: /home/jenkins/workspace/Lucene-Solr-6.x-Linux/solr/build/solr-core/test/J0/temp/solr.schema.TestManagedSchemaAPI_EFE60EE1E8DAC4CE-001/tempDir-001/node1/.
   [junit4]   2> 740596 WARN  (NIOServerCxn.Factory:0.0.0.0/0.0.0.0:0) [    ] o.a.z.s.NIOServerCnxn caught end of stream exception
   [junit4]   2> EndOfStreamException: Unable to read additional data from client sessionid 0x15568e14b430002, likely client has closed socket
   [junit4]   2> 	at org.apache.zookeeper.server.NIOServerCnxn.doIO(NIOServerCnxn.java:228)
   [junit4]   2> 	at org.apache.zookeeper.server.NIOServerCnxnFactory.run(NIOServerCnxnFactory.java:208)
   [junit4]   2> 	at java.lang.Thread.run(Thread.java:745)
   [junit4]   2> 740596 INFO  (jetty-launcher-900-thread-1) [    ] o.a.s.c.CoreContainer New CoreContainer 19606832
   [junit4]   2> 740596 INFO  (jetty-launcher-900-thread-2) [    ] o.a.s.c.CorePropertiesLocator Config-defined core root directory: /home/jenkins/workspace/Lucene-Solr-6.x-Linux/solr/build/solr-core/test/J0/temp/solr.schema.TestManagedSchemaAPI_EFE60EE1E8DAC4CE-001/tempDir-001/node2/.
   [junit4]   2> 740596 INFO  (jetty-launcher-900-thread-1) [    ] o.a.s.c.CoreContainer Loading cores into CoreContainer [instanceDir=/home/jenkins/workspace/Lucene-Solr-6.x-Linux/solr/build/solr-core/test/J0/temp/solr.schema.TestManagedSchemaAPI_EFE60EE1E8DAC4CE-001/tempDir-001/node1]
   [junit4]   2> 740596 INFO  (jetty-launcher-900-thread-2) [    ] o.a.s.c.CoreContainer New CoreContainer 26909407
   [junit4]   2> 740596 INFO  (jetty-launcher-900-thread-2) [    ] o.a.s.c.CoreContainer Loading cores into CoreContainer [instanceDir=/home/jenkins/workspace/Lucene-Solr-6.x-Linux/solr/build/solr-core/test/J0/temp/solr.schema.TestManagedSchemaAPI_EFE60EE1E8DAC4CE-001/tempDir-001/node2]
   [junit4]   2> 740597 WARN  (jetty-launcher-900-thread-1) [    ] o.a.s.c.CoreContainer Couldn't add files from /home/jenkins/workspace/Lucene-Solr-6.x-Linux/solr/build/solr-core/test/J0/temp/solr.schema.TestManagedSchemaAPI_EFE60EE1E8DAC4CE-001/tempDir-001/node1/lib to classpath: /home/jenkins/workspace/Lucene-Solr-6.x-Linux/solr/build/solr-core/test/J0/temp/solr.schema.TestManagedSchemaAPI_EFE60EE1E8DAC4CE-001/tempDir-001/node1/lib
   [junit4]   2> 740597 WARN  (jetty-launcher-900-thread-2) [    ] o.a.s.c.CoreContainer Couldn't add files from /home/jenkins/workspace/Lucene-Solr-6.x-Linux/solr/build/solr-core/test/J0/temp/solr.schema.TestManagedSchemaAPI_EFE60EE1E8DAC4CE-001/tempDir-001/node2/lib to classpath: /home/jenkins/workspace/Lucene-Solr-6.x-Linux/solr/build/solr-core/test/J0/temp/solr.schema.TestManagedSchemaAPI_EFE60EE1E8DAC4CE-001/tempDir-001/node2/lib
   [junit4]   2> 740597 INFO  (jetty-launcher-900-thread-1) [    ] o.a.s.h.c.HttpShardHandlerFactory created with socketTimeout : 90000,urlScheme : ,connTimeout : 15000,maxConnectionsPerHost : 20,maxConnections : 10000,corePoolSize : 0,maximumPoolSize : 2147483647,maxThreadIdleTime : 5,sizeOfQueue : -1,fairnessPolicy : false,useRetries : false,
   [junit4]   2> 740597 INFO  (jetty-launcher-900-thread-2) [    ] o.a.s.h.c.HttpShardHandlerFactory created with socketTimeout : 90000,urlScheme : ,connTimeout : 15000,maxConnectionsPerHost : 20,maxConnections : 10000,corePoolSize : 0,maximumPoolSize : 2147483647,maxThreadIdleTime : 5,sizeOfQueue : -1,fairnessPolicy : false,useRetries : false,
   [junit4]   2> 740598 INFO  (jetty-launcher-900-thread-1) [    ] o.a.s.u.UpdateShardHandler Creating UpdateShardHandler HTTP client with params: socketTimeout=340000&connTimeout=45000&retry=true
   [junit4]   2> 740598 INFO  (jetty-launcher-900-thread-2) [    ] o.a.s.u.UpdateShardHandler Creating UpdateShardHandler HTTP client with params: socketTimeout=340000&connTimeout=45000&retry=true
   [junit4]   2> 740598 INFO  (jetty-launcher-900-thread-1) [    ] o.a.s.l.LogWatcher SLF4J impl is org.slf4j.impl.Log4jLoggerFactory
   [junit4]   2> 740599 INFO  (jetty-launcher-900-thread-1) [    ] o.a.s.l.LogWatcher Registering Log Listener [Log4j (org.slf4j.impl.Log4jLoggerFactory)]
   [junit4]   2> 740599 INFO  (jetty-launcher-900-thread-2) [    ] o.a.s.l.LogWatcher SLF4J impl is org.slf4j.impl.Log4jLoggerFactory
   [junit4]   2> 740599 INFO  (jetty-launcher-900-thread-2) [    ] o.a.s.l.LogWatcher Registering Log Listener [Log4j (org.slf4j.impl.Log4jLoggerFactory)]
   [junit4]   2> 740599 INFO  (jetty-launcher-900-thread-1) [    ] o.a.s.c.ZkContainer Zookeeper client=127.0.0.1:37713/solr
   [junit4]   2> 740599 INFO  (jetty-launcher-900-thread-1) [    ] o.a.s.c.ZkController zkHost includes chroot
   [junit4]   2> 740599 INFO  (jetty-launcher-900-thread-2) [    ] o.a.s.c.ZkContainer Zookeeper client=127.0.0.1:37713/solr
   [junit4]   2> 740599 INFO  (jetty-launcher-900-thread-1) [    ] o.a.s.c.c.SolrZkClient Using default ZkCredentialsProvider
   [junit4]   2> 740599 INFO  (jetty-launcher-900-thread-2) [    ] o.a.s.c.ZkController zkHost includes chroot
   [junit4]   2> 740599 INFO  (jetty-launcher-900-thread-2) [    ] o.a.s.c.c.SolrZkClient Using default ZkCredentialsProvider
   [junit4]   2> 740600 INFO  (jetty-launcher-900-thread-1) [    ] o.a.s.c.c.ConnectionManager Waiting for client to connect to ZooKeeper
   [junit4]   2> 740600 INFO  (jetty-launcher-900-thread-2) [    ] o.a.s.c.c.ConnectionManager Waiting for client to connect to ZooKeeper
   [junit4]   2> 740601 INFO  (zkCallback-908-thread-1) [    ] o.a.s.c.c.ConnectionManager Watcher org.apache.solr.common.cloud.ConnectionManager@1b710ba name:ZooKeeperConnection Watcher:127.0.0.1:37713 got event WatchedEvent state:SyncConnected type:None path:null path:null type:None
   [junit4]   2> 740601 INFO  (jetty-launcher-900-thread-1) [    ] o.a.s.c.c.ConnectionManager Client is connected to ZooKeeper
   [junit4]   2> 740601 INFO  (zkCallback-909-thread-1) [    ] o.a.s.c.c.ConnectionManager Watcher org.apache.solr.common.cloud.ConnectionManager@1f1715f name:ZooKeeperConnection Watcher:127.0.0.1:37713 got event WatchedEvent state:SyncConnected type:None path:null path:null type:None
   [junit4]   2> 740601 INFO  (jetty-launcher-900-thread-2) [    ] o.a.s.c.c.ConnectionManager Client is connected to ZooKeeper
   [junit4]   2> 740601 INFO  (jetty-launcher-900-thread-1) [    ] o.a.s.c.c.SolrZkClient Using default ZkACLProvider
   [junit4]   2> 740601 INFO  (jetty-launcher-900-thread-2) [    ] o.a.s.c.c.SolrZkClient Using default ZkACLProvider
   [junit4]   2> 740602 INFO  (jetty-launcher-900-thread-1) [n:127.0.0.1:34159_solr    ] o.a.s.c.ZkController Added new OnReconnect listener org.apache.solr.cloud.ZkController$$Lambda$12/30259778@b9c00d
   [junit4]   2> 740602 INFO  (jetty-launcher-900-thread-1) [n:127.0.0.1:34159_solr    ] o.a.s.c.c.ConnectionManager Waiting for client to connect to ZooKeeper
   [junit4]   2> 740602 INFO  (jetty-launcher-900-thread-2) [n:127.0.0.1:43078_solr    ] o.a.s.c.ZkController Added new OnReconnect listener org.apache.solr.cloud.ZkController$$Lambda$12/30259778@30620
   [junit4]   2> 740604 INFO  (jetty-launcher-900-thread-2) [n:127.0.0.1:43078_solr    ] o.a.s.c.c.ConnectionManager Waiting for client to connect to ZooKeeper
   [junit4]   2> 740604 INFO  (zkCallback-910-thread-1-processing-n:127.0.0.1:34159_solr) [n:127.0.0.1:34159_solr    ] o.a.s.c.c.ConnectionManager Watcher org.apache.solr.common.cloud.ConnectionManager@61d402 name:ZooKeeperConnection Watcher:127.0.0.1:37713/solr got event WatchedEvent state:SyncConnected type:None path:null path:null type:None
   [junit4]   2> 740604 INFO  (jetty-launcher-900-thread-1) [n:127.0.0.1:34159_solr    ] o.a.s.c.c.ConnectionManager Client is connected to ZooKeeper
   [junit4]   2> 740605 INFO  (zkCallback-911-thread-1-processing-n:127.0.0.1:43078_solr) [n:127.0.0.1:43078_solr    ] o.a.s.c.c.ConnectionManager Watcher org.apache.solr.common.cloud.ConnectionManager@ef5e66 name:ZooKeeperConnection Watcher:127.0.0.1:37713/solr got event WatchedEvent state:SyncConnected type:None path:null path:null type:None
   [junit4]   2> 740605 INFO  (jetty-launcher-900-thread-2) [n:127.0.0.1:43078_solr    ] o.a.s.c.c.ConnectionManager Client is connected to ZooKeeper
   [junit4]   2> 740605 INFO  (jetty-launcher-900-thread-1) [n:127.0.0.1:34159_solr    ] o.a.s.c.c.SolrZkClient makePath: /overseer/queue
   [junit4]   2> 740605 INFO  (jetty-launcher-900-thread-2) [n:127.0.0.1:43078_solr    ] o.a.s.c.c.SolrZkClient makePath: /overseer/queue
   [junit4]   2> 740607 INFO  (jetty-launcher-900-thread-2) [n:127.0.0.1:43078_solr    ] o.a.s.c.c.SolrZkClient makePath: /overseer/collection-queue-work
   [junit4]   2> 740607 INFO  (jetty-launcher-900-thread-1) [n:127.0.0.1:34159_solr    ] o.a.s.c.c.SolrZkClient makePath: /overseer/collection-queue-work
   [junit4]   2> 740609 INFO  (jetty-launcher-900-thread-1) [n:127.0.0.1:34159_solr    ] o.a.s.c.c.SolrZkClient makePath: /overseer/collection-map-running
   [junit4]   2> 740609 INFO  (jetty-launcher-900-thread-2) [n:127.0.0.1:43078_solr    ] o.a.s.c.c.SolrZkClient makePath: /overseer/collection-map-running
   [junit4]   2> 740610 INFO  (jetty-launcher-900-thread-2) [n:127.0.0.1:43078_solr    ] o.a.s.c.c.SolrZkClient makePath: /overseer/collection-map-completed
   [junit4]   2> 740610 INFO  (jetty-launcher-900-thread-1) [n:127.0.0.1:34159_solr    ] o.a.s.c.c.SolrZkClient makePath: /overseer/collection-map-completed
   [junit4]   2> 740611 INFO  (jetty-launcher-900-thread-1) [n:127.0.0.1:34159_solr    ] o.a.s.c.c.SolrZkClient makePath: /overseer/collection-map-failure
   [junit4]   2> 740611 INFO  (jetty-launcher-900-thread-2) [n:127.0.0.1:43078_solr    ] o.a.s.c.c.SolrZkClient makePath: /overseer/collection-map-failure
   [junit4]   2> 740612 INFO  (jetty-launcher-900-thread-2) [n:127.0.0.1:43078_solr    ] o.a.s.c.c.SolrZkClient makePath: /live_nodes
   [junit4]   2> 740612 INFO  (jetty-launcher-900-thread-1) [n:127.0.0.1:34159_solr    ] o.a.s.c.c.SolrZkClient makePath: /live_nodes
   [junit4]   2> 740613 INFO  (jetty-launcher-900-thread-1) [n:127.0.0.1:34159_solr    ] o.a.s.c.c.SolrZkClient makePath: /collections
   [junit4]   2> 740613 INFO  (jetty-launcher-900-thread-2) [n:127.0.0.1:43078_solr    ] o.a.s.c.c.SolrZkClient makePath: /collections
   [junit4]   2> 740614 INFO  (jetty-launcher-900-thread-2) [n:127.0.0.1:43078_solr    ] o.a.s.c.c.SolrZkClient makePath: /aliases.json
   [junit4]   2> 740614 INFO  (jetty-launcher-900-thread-1) [n:127.0.0.1:34159_solr    ] o.a.s.c.c.SolrZkClient makePath: /aliases.json
   [junit4]   2> 740615 INFO  (jetty-launcher-900-thread-1) [n:127.0.0.1:34159_solr    ] o.a.s.c.c.SolrZkClient makePath: /clusterstate.json
   [junit4]   2> 740616 INFO  (jetty-launcher-900-thread-2) [n:127.0.0.1:43078_solr    ] o.a.s.c.c.SolrZkClient makePath: /clusterstate.json
   [junit4]   2> 740617 INFO  (jetty-launcher-900-thread-2) [n:127.0.0.1:43078_solr    ] o.a.s.c.c.SolrZkClient makePath: /security.json
   [junit4]   2> 740617 INFO  (jetty-launcher-900-thread-1) [n:127.0.0.1:34159_solr    ] o.a.s.c.c.SolrZkClient makePath: /security.json
   [junit4]   2> 740617 INFO  (jetty-launcher-900-thread-1) [n:127.0.0.1:34159_solr    ] o.a.s.c.c.ZkStateReader Updating cluster state from ZooKeeper... 
   [junit4]   2> 740617 INFO  (jetty-launcher-900-thread-2) [n:127.0.0.1:43078_solr    ] o.a.s.c.c.ZkStateReader Updating cluster state from ZooKeeper... 
   [junit4]   2> 740617 INFO  (jetty-launcher-900-thread-1) [n:127.0.0.1:34159_solr    ] o.a.s.c.c.ZkStateReader Loaded empty cluster properties
   [junit4]   2> 740618 INFO  (jetty-launcher-900-thread-2) [n:127.0.0.1:43078_solr    ] o.a.s.c.c.ZkStateReader Loaded empty cluster properties
   [junit4]   2> 740618 INFO  (jetty-launcher-900-thread-1) [n:127.0.0.1:34159_solr    ] o.a.s.c.c.ZkStateReader Updated live nodes from ZooKeeper... (0) -> (0)
   [junit4]   2> 740618 INFO  (jetty-launcher-900-thread-2) [n:127.0.0.1:43078_solr    ] o.a.s.c.c.ZkStateReader Updated live nodes from ZooKeeper... (0) -> (0)
   [junit4]   2> 740620 INFO  (jetty-launcher-900-thread-1) [n:127.0.0.1:34159_solr    ] o.a.s.c.c.SolrZkClient makePath: /overseer_elect
   [junit4]   2> 740620 INFO  (jetty-launcher-900-thread-2) [n:127.0.0.1:43078_solr    ] o.a.s.c.c.SolrZkClient makePath: /overseer_elect
   [junit4]   2> 740621 INFO  (jetty-launcher-900-thread-2) [n:127.0.0.1:43078_solr    ] o.a.s.c.c.SolrZkClient makePath: /overseer_elect/election
   [junit4]   2> 740621 INFO  (jetty-launcher-900-thread-1) [n:127.0.0.1:34159_solr    ] o.a.s.c.c.SolrZkClient makePath: /overseer_elect/election
   [junit4]   2> 740621 INFO  (jetty-launcher-900-thread-1) [n:127.0.0.1:34159_solr    ] o.a.s.c.Overseer Overseer (id=null) closing
   [junit4]   2> 740621 INFO  (jetty-launcher-900-thread-2) [n:127.0.0.1:43078_solr    ] o.a.s.c.Overseer Overseer (id=null) closing
   [junit4]   2> 740622 INFO  (jetty-launcher-900-thread-1) [n:127.0.0.1:34159_solr    ] o.a.s.c.LeaderElector Joined leadership election with path: /overseer_elect/election/96098283897946117-127.0.0.1:34159_solr-n_0000000000
   [junit4]   2> 740622 INFO  (jetty-launcher-900-thread-2) [n:127.0.0.1:43078_solr    ] o.a.s.c.LeaderElector Joined leadership election with path: /overseer_elect/election/96098283897946118-127.0.0.1:43078_solr-n_0000000001
   [junit4]   2> 740622 INFO  (jetty-launcher-900-thread-1) [n:127.0.0.1:34159_solr    ] o.a.s.c.OverseerElectionContext I am going to be the leader 127.0.0.1:34159_solr
   [junit4]   2> 740622 INFO  (jetty-launcher-900-thread-1) [n:127.0.0.1:34159_solr    ] o.a.s.c.c.SolrZkClient makePath: /overseer_elect/leader
   [junit4]   2> 740622 INFO  (jetty-launcher-900-thread-2) [n:127.0.0.1:43078_solr    ] o.a.s.c.LeaderElector Watching path /overseer_elect/election/96098283897946117-127.0.0.1:34159_solr-n_0000000000 to know if I could be the leader
   [junit4]   2> 740623 INFO  (jetty-launcher-900-thread-2) [n:127.0.0.1:43078_solr    ] o.a.s.c.ZkController Register node as live in ZooKeeper:/live_nodes/127.0.0.1:43078_solr
   [junit4]   2> 740623 INFO  (jetty-launcher-900-thread-2) [n:127.0.0.1:43078_solr    ] o.a.s.c.c.SolrZkClient makePath: /live_nodes/127.0.0.1:43078_solr
   [junit4]   2> 740623 INFO  (jetty-launcher-900-thread-1) [n:127.0.0.1:34159_solr    ] o.a.s.c.Overseer Overseer (id=96098283897946117-127.0.0.1:34159_solr-n_0000000000) starting
   [junit4]   2> 740624 INFO  (zkCallback-911-thread-1-processing-n:127.0.0.1:43078_solr) [n:127.0.0.1:43078_solr    ] o.a.s.c.c.ZkStateReader A live node change: [WatchedEvent state:SyncConnected type:NodeChildrenChanged path:/live_nodes], has occurred - updating... (live nodes size: [0])
   [junit4]   2> 740624 INFO  (zkCallback-910-thread-1-processing-n:127.0.0.1:34159_solr) [n:127.0.0.1:34159_solr    ] o.a.s.c.c.ZkStateReader A live node change: [WatchedEvent state:SyncConnected type:NodeChildrenChanged path:/live_nodes], has occurred - updating... (live nodes size: [0])
   [junit4]   2> 740624 INFO  (zkCallback-911-thread-1-processing-n:127.0.0.1:43078_solr) [n:127.0.0.1:43078_solr    ] o.a.s.c.c.ZkStateReader Updated live nodes from ZooKeeper... (0) -> (1)
   [junit4]   2> 740625 INFO  (zkCallback-910-thread-1-processing-n:127.0.0.1:34159_solr) [n:127.0.0.1:34159_solr    ] o.a.s.c.c.ZkStateReader Updated live nodes from ZooKeeper... (0) -> (1)
   [junit4]   2> 740625 INFO  (jetty-launcher-900-thread-1) [n:127.0.0.1:34159_solr    ] o.a.s.c.c.SolrZkClient makePath: /overseer/queue-work
   [junit4]   2> 740629 INFO  (jetty-launcher-900-thread-1) [n:127.0.0.1:34159_solr    ] o.a.s.c.OverseerAutoReplicaFailoverThread Starting OverseerAutoReplicaFailoverThread autoReplicaFailoverWorkLoopDelay=10000 autoReplicaFailoverWaitAfterExpiration=30000 autoReplicaFailoverBadNodeExpiration=60000
   [junit4]   2> 740629 INFO  (OverseerCollectionConfigSetProcessor-96098283897946117-127.0.0.1:34159_solr-n_0000000000) [n:127.0.0.1:34159_solr    ] o.a.s.c.OverseerTaskProcessor Process current queue of overseer operations
   [junit4]   2> 740630 INFO  (OverseerStateUpdate-96098283897946117-127.0.0.1:34159_solr-n_0000000000) [n:127.0.0.1:34159_solr    ] o.a.s.c.Overseer Starting to work on the main queue
   [junit4]   2> 740630 INFO  (jetty-launcher-900-thread-1) [n:127.0.0.1:34159_solr    ] o.a.s.c.ZkController Publish node=127.0.0.1:34159_solr as DOWN
   [junit4]   2> 740632 INFO  (OverseerStateUpdate-96098283897946117-127.0.0.1:34159_solr-n_0000000000) [n:127.0.0.1:34159_solr    ] o.a.s.c.c.ZkStateReader Updated live nodes from ZooKeeper... (1) -> (1)
   [junit4]   2> 740633 INFO  (OverseerStateUpdate-96098283897946117-127.0.0.1:34159_solr-n_0000000000) [n:127.0.0.1:34159_solr    ] o.a.s.c.Overseer processMessage: queueSize: 1, message = {
   [junit4]   2>   "operation":"downnode",
   [junit4]   2>   "node_name":"127.0.0.1:34159_solr"} current state version: 0
   [junit4]   2> 740633 INFO  (OverseerStateUpdate-96098283897946117-127.0.0.1:34159_solr-n_0000000000) [n:127.0.0.1:34159_solr    ] o.a.s.c.o.NodeMutator DownNode state invoked for node: 127.0.0.1:34159_solr
   [junit4]   2> 740673 INFO  (jetty-launcher-900-thread-2) [n:127.0.0.1:43078_solr    ] o.a.s.c.CoreContainer Security conf doesn't exist. Skipping setup for authorization module.
   [junit4]   2> 740673 INFO  (jetty-launcher-900-thread-2) [n:127.0.0.1:43078_solr    ] o.a.s.c.CoreContainer No authentication plugin used.
   [junit4]   2> 740674 INFO  (jetty-launcher-900-thread-2) [n:127.0.0.1:43078_solr    ] o.a.s.c.CorePropertiesLocator Looking for core definitions underneath /home/jenkins/workspace/Lucene-Solr-6.x-Linux/solr/build/solr-core/test/J0/temp/solr.schema.TestManagedSchemaAPI_EFE60EE1E8DAC4CE-001/tempDir-001/node2/.
   [junit4]   2> 740674 INFO  (jetty-launcher-900-thread-2) [n:127.0.0.1:43078_solr    ] o.a.s.c.CorePropertiesLocator Found 0 core definitions
   [junit4]   2> 740676 INFO  (jetty-launcher-900-thread-2) [n:127.0.0.1:43078_solr    ] o.a.s.s.SolrDispatchFilter user.dir=/home/jenkins/workspace/Lucene-Solr-6.x-Linux/solr/build/solr-core/test/J0
   [junit4]   2> 740676 INFO  (jetty-launcher-900-thread-2) [n:127.0.0.1:43078_solr    ] o.a.s.s.SolrDispatchFilter SolrDispatchFilter.init() done
   [junit4]   2> 741632 INFO  (jetty-launcher-900-thread-1) [n:127.0.0.1:34159_solr    ] o.a.s.c.ZkController Register node as live in ZooKeeper:/live_nodes/127.0.0.1:34159_solr
   [junit4]   2> 741632 INFO  (jetty-launcher-900-thread-1) [n:127.0.0.1:34159_solr    ] o.a.s.c.c.SolrZkClient makePath: /live_nodes/127.0.0.1:34159_solr
   [junit4]   2> 741633 INFO  (zkCallback-911-thread-1-processing-n:127.0.0.1:43078_solr) [n:127.0.0.1:43078_solr    ] o.a.s.c.c.ZkStateReader A live node change: [WatchedEvent state:SyncConnected type:NodeChildrenChanged path:/live_nodes], has occurred - updating... (live nodes size: [1])
   [junit4]   2> 741633 INFO  (zkCallback-910-thread-1-processing-n:127.0.0.1:34159_solr) [n:127.0.0.1:34159_solr    ] o.a.s.c.c.ZkStateReader A live node change: [WatchedEvent state:SyncConnected type:NodeChildrenChanged path:/live_nodes], has occurred - updating... (live nodes size: [1])
   [junit4]   2> 741634 INFO  (zkCallback-911-thread-1-processing-n:127.0.0.1:43078_solr) [n:127.0.0.1:43078_solr    ] o.a.s.c.c.ZkStateReader Updated live nodes from ZooKeeper... (1) -> (2)
   [junit4]   2> 741634 INFO  (zkCallback-910-thread-1-processing-n:127.0.0.1:34159_solr) [n:127.0.0.1:34159_solr    ] o.a.s.c.c.ZkStateReader Updated live nodes from ZooKeeper... (1) -> (2)
   [junit4]   2> 741667 INFO  (jetty-launcher-900-thread-1) [n:127.0.0.1:34159_solr    ] o.a.s.c.CoreContainer Security conf doesn't exist. Skipping setup for authorization module.
   [junit4]   2> 741667 INFO  (jetty-launcher-900-thread-1) [n:127.0.0.1:34159_solr    ] o.a.s.c.CoreContainer No authentication plugin used.
   [junit4]   2> 741667 INFO  (jetty-launcher-900-thread-1) [n:127.0.0.1:34159_solr    ] o.a.s.c.CorePropertiesLocator Looking for core definitions underneath /home/jenkins/workspace/Lucene-Solr-6.x-Linux/solr/build/solr-core/test/J0/temp/solr.schema.TestManagedSchemaAPI_EFE60EE1E8DAC4CE-001/tempDir-001/node1/.
   [junit4]   2> 741668 INFO  (jetty-launcher-900-thread-1) [n:127.0.0.1:34159_solr    ] o.a.s.c.CorePropertiesLocator Found 0 core definitions
   [junit4]   2> 741668 INFO  (jetty-launcher-900-thread-1) [n:127.0.0.1:34159_solr    ] o.a.s.s.SolrDispatchFilter user.dir=/home/jenkins/workspace/Lucene-Solr-6.x-Linux/solr/build/solr-core/test/J0
   [junit4]   2> 741668 INFO  (jetty-launcher-900-thread-1) [n:127.0.0.1:34159_solr    ] o.a.s.s.SolrDispatchFilter SolrDispatchFilter.init() done
   [junit4]   2> 741668 INFO  (SUITE-TestManagedSchemaAPI-seed#[EFE60EE1E8DAC4CE]-worker) [    ] o.a.s.c.c.SolrZkClient Using default ZkCredentialsProvider
   [junit4]   2> 741669 INFO  (SUITE-TestManagedSchemaAPI-seed#[EFE60EE1E8DAC4CE]-worker) [    ] o.a.s.c.c.ConnectionManager Waiting for client to connect to ZooKeeper
   [junit4]   2> 741670 INFO  (zkCallback-914-thread-1) [    ] o.a.s.c.c.ConnectionManager Watcher org.apache.solr.common.cloud.ConnectionManager@f18140 name:ZooKeeperConnection Watcher:127.0.0.1:37713 got event WatchedEvent state:SyncConnected type:None path:null path:null type:None
   [junit4]   2> 741670 INFO  (SUITE-TestManagedSchemaAPI-seed#[EFE60EE1E8DAC4CE]-worker) [    ] o.a.s.c.c.ConnectionManager Client is connected to ZooKeeper
   [junit4]   2> 741670 INFO  (SUITE-TestManagedSchemaAPI-seed#[EFE60EE1E8DAC4CE]-worker) [    ] o.a.s.c.c.SolrZkClient Using default ZkACLProvider
   [junit4]   2> 741671 INFO  (SUITE-TestManagedSchemaAPI-seed#[EFE60EE1E8DAC4CE]-worker) [    ] o.a.s.c.s.i.CloudSolrClient Final constructed zkHost string: 127.0.0.1:37713/solr
   [junit4]   2> 741671 INFO  (SUITE-TestManagedSchemaAPI-seed#[EFE60EE1E8DAC4CE]-worker) [    ] o.a.s.c.c.SolrZkClient Using default ZkCredentialsProvider
   [junit4]   2> 741672 INFO  (SUITE-TestManagedSchemaAPI-seed#[EFE60EE1E8DAC4CE]-worker) [    ] o.a.s.c.c.ConnectionManager Waiting for client to connect to ZooKeeper
   [junit4]   2> 741672 INFO  (zkCallback-917-thread-1) [    ] o.a.s.c.c.ConnectionManager Watcher org.apache.solr.common.cloud.ConnectionManager@619d4d name:ZooKeeperConnection Watcher:127.0.0.1:37713/solr got event WatchedEvent state:SyncConnected type:None path:null path:null type:None
   [junit4]   2> 741673 INFO  (SUITE-TestManagedSchemaAPI-seed#[EFE60EE1E8DAC4CE]-worker) [    ] o.a.s.c.c.ConnectionManager Client is connected to ZooKeeper
   [junit4]   2> 741673 INFO  (SUITE-TestManagedSchemaAPI-seed#[EFE60EE1E8DAC4CE]-worker) [    ] o.a.s.c.c.SolrZkClient Using default ZkACLProvider
   [junit4]   2> 741673 INFO  (SUITE-TestManagedSchemaAPI-seed#[EFE60EE1E8DAC4CE]-worker) [    ] o.a.s.c.c.ZkStateReader Updating cluster state from ZooKeeper... 
   [junit4]   2> 741673 INFO  (SUITE-TestManagedSchemaAPI-seed#[EFE60EE1E8DAC4CE]-worker) [    ] o.a.s.c.c.ZkStateReader Loaded empty cluster properties
   [junit4]   2> 741674 INFO  (SUITE-TestManagedSchemaAPI-seed#[EFE60EE1E8DAC4CE]-worker) [    ] o.a.s.c.c.ZkStateReader Updated live nodes from ZooKeeper... (0) -> (2)
   [junit4]   2> 741675 INFO  (SUITE-TestManagedSchemaAPI-seed#[EFE60EE1E8DAC4CE]-worker) [    ] o.a.s.c.c.SolrZkClient makePath: /configs/conf1/solrconfig.xml
   [junit4]   2> 741676 INFO  (SUITE-TestManagedSchemaAPI-seed#[EFE60EE1E8DAC4CE]-worker) [    ] o.a.s.c.c.SolrZkClient makePath: /configs/conf1/managed-schema
   [junit4]   2> 741689 INFO  (TEST-TestManagedSchemaAPI.test-seed#[EFE60EE1E8DAC4CE]) [    ] o.a.s.SolrTestCaseJ4 ###Starting test
   [junit4]   2> 741692 INFO  (qtp4763573-5297) [n:127.0.0.1:34159_solr    ] o.a.s.h.a.CollectionsHandler Invoked Collection Action :create with params replicationFactor=2&collection.configName=conf1&name=testschemaapi&action=CREATE&numShards=1&wt=javabin&version=2 and sendToOCPQueue=true
   [junit4]   2> 741693 INFO  (OverseerCollectionConfigSetProcessor-96098283897946117-127.0.0.1:34159_solr-n_0000000000) [n:127.0.0.1:34159_solr    ] o.a.s.c.OverseerTaskProcessor Overseer Collection Message Handler: Get the message id:/overseer/collection-queue-work/qn-0000000000 message:{
   [junit4]   2>   "name":"testschemaapi",
   [junit4]   2>   "fromApi":"true",
   [junit4]   2>   "replicationFactor":"2",
   [junit4]   2>   "collection.configName":"conf1",
   [junit4]   2>   "numShards":"1",
   [junit4]   2>   "stateFormat":"2",
   [junit4]   2>   "operation":"create"}
   [junit4]   2> 741694 INFO  (OverseerThreadFactory-2592-thread-1-processing-n:127.0.0.1:34159_solr) [n:127.0.0.1:34159_solr    ] o.a.s.c.OverseerCollectionMessageHandler OverseerCollectionMessageHandler.processMessage : create , {
   [junit4]   2>   "name":"testschemaapi",
   [junit4]   2>   "fromApi":"true",
   [junit4]   2>   "replicationFactor":"2",
   [junit4]   2>   "collection.configName":"conf1",
   [junit4]   2>   "numShards":"1",
   [junit4]   2>   "stateFormat":"2",
   [junit4]   2>   "operation":"create"}
   [junit4]   2> 741694 INFO  (OverseerThreadFactory-2592-thread-1-processing-n:127.0.0.1:34159_solr) [n:127.0.0.1:34159_solr    ] o.a.s.c.OverseerCollectionMessageHandler Create collection testschemaapi
   [junit4]   2> 741694 INFO  (OverseerThreadFactory-2592-thread-1-processing-n:127.0.0.1:34159_solr) [n:127.0.0.1:34159_solr    ] o.a.s.c.OverseerCollectionMessageHandler creating collections conf node /collections/testschemaapi 
   [junit4]   2> 741694 INFO  (OverseerThreadFactory-2592-thread-1-processing-n:127.0.0.1:34159_solr) [n:127.0.0.1:34159_solr    ] o.a.s.c.c.SolrZkClient makePath: /collections/testschemaapi
   [junit4]   2> 741696 INFO  (zkCallback-917-thread-1) [    ] o.a.s.c.c.ZkStateReader A collections change: [WatchedEvent state:SyncConnected type:NodeChildrenChanged path:/collections], has occurred - updating...
   [junit4]   2> 741696 INFO  (zkCallback-911-thread-1-processing-n:127.0.0.1:43078_solr) [n:127.0.0.1:43078_solr    ] o.a.s.c.c.ZkStateReader A collections change: [WatchedEvent state:SyncConnected type:NodeChildrenChanged path:/collections], has occurred - updating...
   [junit4]   2> 741696 INFO  (zkCallback-910-thread-1-processing-n:127.0.0.1:34159_solr) [n:127.0.0.1:34159_solr    ] o.a.s.c.c.ZkStateReader A collections change: [WatchedEvent state:SyncConnected type:NodeChildrenChanged path:/collections], has occurred - updating...
   [junit4]   2> 741698 INFO  (OverseerStateUpdate-96098283897946117-127.0.0.1:34159_solr-n_0000000000) [n:127.0.0.1:34159_solr    ] o.a.s.c.Overseer processMessage: queueSize: 1, message = {
   [junit4]   2>   "name":"testschemaapi",
   [junit4]   2>   "fromApi":"true",
   [junit4]   2>   "replicationFactor":"2",
   [junit4]   2>   "collection.configName":"conf1",
   [junit4]   2>   "numShards":"1",
   [junit4]   2>   "stateFormat":"2",
   [junit4]   2>   "operation":"create"} current state version: 0
   [junit4]   2> 741698 INFO  (OverseerStateUpdate-96098283897946117-127.0.0.1:34159_solr-n_0000000000) [n:127.0.0.1:34159_solr    ] o.a.s.c.o.ClusterStateMutator building a new cName: testschemaapi
   [junit4]   2> 741699 INFO  (OverseerStateUpdate-96098283897946117-127.0.0.1:34159_solr-n_0000000000) [n:127.0.0.1:34159_solr    ] o.a.s.c.o.ZkStateWriter going to create_collection /collections/testschemaapi/state.json
   [junit4]   2> 741798 INFO  (OverseerThreadFactory-2592-thread-1-processing-n:127.0.0.1:34159_solr) [n:127.0.0.1:34159_solr    ] o.a.s.c.OverseerCollectionMessageHandler Creating SolrCores for new collection testschemaapi, shardNames [shard1] , replicationFactor : 2
   [junit4]   2> 741798 INFO  (OverseerThreadFactory-2592-thread-1-processing-n:127.0.0.1:34159_solr) [n:127.0.0.1:34159_solr    ] o.a.s.c.OverseerCollectionMessageHandler Creating core testschemaapi_shard1_replica2 as part of shard shard1 of collection testschemaapi on 127.0.0.1:43078_solr
   [junit4]   2> 741798 INFO  (OverseerThreadFactory-2592-thread-1-processing-n:127.0.0.1:34159_solr) [n:127.0.0.1:34159_solr    ] o.a.s.c.OverseerCollectionMessageHandler Creating core testschemaapi_shard1_replica1 as part of shard shard1 of collection testschemaapi on 127.0.0.1:34159_solr
   [junit4]   2> 741801 INFO  (qtp29144090-5296) [n:127.0.0.1:43078_solr    ] o.a.s.h.a.CoreAdminOperation core create command qt=/admin/cores&collection.configName=conf1&name=testschemaapi_shard1_replica2&action=CREATE&numShards=1&collection=testschemaapi&shard=shard1&wt=javabin&version=2
   [junit4]   2> 741801 INFO  (qtp4763573-5301) [n:127.0.0.1:34159_solr    ] o.a.s.h.a.CoreAdminOperation core create command qt=/admin/cores&collection.configName=conf1&name=testschemaapi_shard1_replica1&action=CREATE&numShards=1&collection=testschemaapi&shard=shard1&wt=javabin&version=2
   [junit4]   2> 741802 INFO  (qtp4763573-5301) [n:127.0.0.1:34159_solr    ] o.a.s.c.CoreDescriptor Created CoreDescriptor: {name=testschemaapi_shard1_replica1, collection.configName=conf1, config=solrconfig.xml, transient=false, schema=schema.xml, loadOnStartup=true, configSetProperties=configsetprops.json, collection=testschemaapi, numShards=1, dataDir=data/, shard=shard1}
   [junit4]   2> 741802 INFO  (qtp29144090-5296) [n:127.0.0.1:43078_solr    ] o.a.s.c.CoreDescriptor Created CoreDescriptor: {name=testschemaapi_shard1_replica2, collection.configName=conf1, config=solrconfig.xml, transient=false, schema=schema.xml, loadOnStartup=true, configSetProperties=configsetprops.json, collection=testschemaapi, numShards=1, dataDir=data/, shard=shard1}
   [junit4]   2> 741802 INFO  (qtp4763573-5301) [n:127.0.0.1:34159_solr c:testschemaapi s:shard1  x:testschemaapi_shard1_replica1] o.a.s.c.ZkController publishing state=down
   [junit4]   2> 741802 INFO  (qtp29144090-5296) [n:127.0.0.1:43078_solr c:testschemaapi s:shard1  x:testschemaapi_shard1_replica2] o.a.s.c.ZkController publishing state=down
   [junit4]   2> 741804 INFO  (qtp4763573-5301) [n:127.0.0.1:34159_solr c:testschemaapi s:shard1  x:testschemaapi_shard1_replica1] o.a.s.c.ZkController Registering watch for collection testschemaapi
   [junit4]   2> 741804 INFO  (qtp29144090-5296) [n:127.0.0.1:43078_solr c:testschemaapi s:shard1  x:testschemaapi_shard1_replica2] o.a.s.c.ZkController Registering watch for collection testschemaapi
   [junit4]   2> 741804 INFO  (OverseerStateUpdate-96098283897946117-127.0.0.1:34159_solr-n_0000000000) [n:127.0.0.1:34159_solr    ] o.a.s.c.Overseer processMessage: queueSize: 2, message = {
   [junit4]   2>   "core":"testschemaapi_shard1_replica1",
   [junit4]   2>   "roles":null,
   [junit4]   2>   "base_url":"http://127.0.0.1:34159/solr",
   [junit4]   2>   "node_name":"127.0.0.1:34159_solr",
   [junit4]   2>   "numShards":"1",
   [junit4]   2>   "state":"down",
   [junit4]   2>   "shard":"shard1",
   [junit4]   2>   "collection":"testschemaapi",
   [junit4]   2>   "operation":"state"} current state version: 0
   [junit4]   2> 741804 INFO  (qtp29144090-5296) [n:127.0.0.1:43078_solr c:testschemaapi s:shard1  x:testschemaapi_shard1_replica2] o.a.s.c.c.ZkStateReader Add data for [testschemaapi] ver [0]
   [junit4]   2> 741804 INFO  (qtp4763573-5301) [n:127.0.0.1:34159_solr c:testschemaapi s:shard1  x:testschemaapi_shard1_replica1] o.a.s.c.c.ZkStateReader Add data for [testschemaapi] ver [0]
   [junit4]   2> 741804 INFO  (OverseerStateUpdate-96098283897946117-127.0.0.1:34159_solr-n_0000000000) [n:127.0.0.1:34159_solr    ] o.a.s.c.o.ReplicaMutator Update state numShards=1 message={
   [junit4]   2>   "core":"testschemaapi_shard1_replica1",
   [junit4]   2>   "roles":null,
   [junit4]   2>   "base_url":"http://127.0.0.1:34159/solr",
   [junit4]   2>   "node_name":"127.0.0.1:34159_solr",
   [junit4]   2>   "numShards":"1",
   [junit4]   2>   "state":"down",
   [junit4]   2>   "shard":"shard1",
   [junit4]   2>   "collection":"testschemaapi",
   [junit4]   2>   "operation":"state"}
   [junit4]   2> 741804 INFO  (qtp29144090-5296) [n:127.0.0.1:43078_solr c:testschemaapi s:shard1  x:testschemaapi_shard1_replica2] o.a.s.c.ZkController look for our core node name
   [junit4]   2> 741804 INFO  (qtp4763573-5301) [n:127.0.0.1:34159_solr c:testschemaapi s:shard1  x:testschemaapi_shard1_replica1] o.a.s.c.ZkController look for our core node name
   [junit4]   2> 741805 INFO  (OverseerStateUpdate-96098283897946117-127.0.0.1:34159_solr-n_0000000000) [n:127.0.0.1:34159_solr    ] o.a.s.c.Overseer processMessage: queueSize: 1, message = {
   [junit4]   2>   "core":"testschemaapi_shard1_replica2",
   [junit4]   2>   "roles":null,
   [junit4]   2>   "base_url":"http://127.0.0.1:43078/solr",
   [junit4]   2>   "node_name":"127.0.0.1:43078_solr",
   [junit4]   2>   "numShards":"1",
   [junit4]   2>   "state":"down",
   [junit4]   2>   "shard":"shard1",
   [junit4]   2>   "collection":"testschemaapi",
   [junit4]   2>   "operation":"state"} current state version: 0
   [junit4]   2> 741806 INFO  (OverseerStateUpdate-96098283897946117-127.0.0.1:34159_solr-n_0000000000) [n:127.0.0.1:34159_solr    ] o.a.s.c.o.ReplicaMutator Update state numShards=1 message={
   [junit4]   2>   "core":"testschemaapi_shard1_replica2",
   [junit4]   2>   "roles":null,
   [junit4]   2>   "base_url":"http://127.0.0.1:43078/solr",
   [junit4]   2>   "node_name":"127.0.0.1:43078_solr",
   [junit4]   2>   "numShards":"1",
   [junit4]   2>   "state":"down",
   [junit4]   2>   "shard":"shard1",
   [junit4]   2>   "collection":"testschemaapi",
   [junit4]   2>   "operation":"state"}
   [junit4]   2> 741907 INFO  (OverseerStateUpdate-96098283897946117-127.0.0.1:34159_solr-n_0000000000) [n:127.0.0.1:34159_solr    ] o.a.s.c.o.ZkStateWriter going to update_collection /collections/testschemaapi/state.json version: 0
   [junit4]   2> 741908 INFO  (zkCallback-910-thread-1-processing-n:127.0.0.1:34159_solr) [n:127.0.0.1:34159_solr    ] o.a.s.c.c.ZkStateReader A cluster state change: [WatchedEvent state:SyncConnected type:NodeDataChanged path:/collections/testschemaapi/state.json] for collection [testschemaapi] has occurred - updating... (live nodes size: [2])
   [junit4]   2> 741908 INFO  (zkCallback-911-thread-1-processing-n:127.0.0.1:43078_solr) [n:127.0.0.1:43078_solr    ] o.a.s.c.c.ZkStateReader A cluster state change: [WatchedEvent state:SyncConnected type:NodeDataChanged path:/collections/testschemaapi/state.json] for collection [testschemaapi] has occurred - updating... (live nodes size: [2])
   [junit4]   2> 741908 INFO  (zkCallback-910-thread-1-processing-n:127.0.0.1:34159_solr) [n:127.0.0.1:34159_solr    ] o.a.s.c.c.ZkStateReader Updating data for [testschemaapi] from [0] to [1]
   [junit4]   2> 741908 INFO  (zkCallback-911-thread-1-processing-n:127.0.0.1:43078_solr) [n:127.0.0.1:43078_solr    ] o.a.s.c.c.ZkStateReader Updating data for [testschemaapi] from [0] to [1]
   [junit4]   2> 742804 INFO  (qtp29144090-5296) [n:127.0.0.1:43078_solr c:testschemaapi s:shard1  x:testschemaapi_shard1_replica2] o.a.s.c.ZkController waiting to find shard id in clusterstate for testschemaapi_shard1_replica2
   [junit4]   2> 742804 INFO  (qtp4763573-5301) [n:127.0.0.1:34159_solr c:testschemaapi s:shard1  x:testschemaapi_shard1_replica1] o.a.s.c.ZkController waiting to find shard id in clusterstate for testschemaapi_shard1_replica1
   [junit4]   2> 742804 INFO  (qtp29144090-5296) [n:127.0.0.1:43078_solr c:testschemaapi s:shard1  x:testschemaapi_shard1_replica2] o.a.s.c.ZkController Check for collection zkNode:testschemaapi
   [junit4]   2> 742805 INFO  (qtp4763573-5301) [n:127.0.0.1:34159_solr c:testschemaapi s:shard1  x:testschemaapi_shard1_replica1] o.a.s.c.ZkController Check for collection zkNode:testschemaapi
   [junit4]   2> 742805 INFO  (qtp29144090-5296) [n:127.0.0.1:43078_solr c:testschemaapi s:shard1  x:testschemaapi_shard1_replica2] o.a.s.c.ZkController Collection zkNode exists
   [junit4]   2> 742805 INFO  (qtp4763573-5301) [n:127.0.0.1:34159_solr c:testschemaapi s:shard1  x:testschemaapi_shard1_replica1] o.a.s.c.ZkController Collection zkNode exists
   [junit4]   2> 742805 INFO  (qtp29144090-5296) [n:127.0.0.1:43078_solr c:testschemaapi s:shard1  x:testschemaapi_shard1_replica2] o.a.s.c.c.ZkStateReader Load collection config from: [/collections/testschemaapi]
   [junit4]   2> 742805 INFO  (qtp4763573-5301) [n:127.0.0.1:34159_solr c:testschemaapi s:shard1  x:testschemaapi_shard1_replica1] o.a.s.c.c.ZkStateReader Load collection config from: [/collections/testschemaapi]
   [junit4]   2> 742806 INFO  (qtp29144090-5296) [n:127.0.0.1:43078_solr c:testschemaapi s:shard1  x:testschemaapi_shard1_replica2] o.a.s.c.c.ZkStateReader path=[/collections/testschemaapi] [configName]=[conf1] specified config exists in ZooKeeper
   [junit4]   2> 742806 INFO  (qtp4763573-5301) [n:127.0.0.1:34159_solr c:testschemaapi s:shard1  x:testschemaapi_shard1_replica1] o.a.s.c.c.ZkStateReader path=[/collections/testschemaapi] [configName]=[conf1] specified config exists in ZooKeeper
   [junit4]   2> 742806 INFO  (qtp29144090-5296) [n:127.0.0.1:43078_solr c:testschemaapi s:shard1  x:testschemaapi_shard1_replica2] o.a.s.c.SolrResourceLoader new SolrResourceLoader for directory: '/home/jenkins/workspace/Lucene-Solr-6.x-Linux/solr/build/solr-core/test/J0/temp/solr.schema.TestManagedSchemaAPI_EFE60EE1E8DAC4CE-001/tempDir-001/node2/testschemaapi_shard1_replica2'
   [junit4]   2> 742806 INFO  (qtp4763573-5301) [n:127.0.0.1:34159_solr c:testschemaapi s:shard1  x:testschemaapi_shard1_replica1] o.a.s.c.SolrResourceLoader new SolrResourceLoader for directory: '/home/jenkins/workspace/Lucene-Solr-6.x-Linux/solr/build/solr-core/test/J0/temp/solr.schema.TestManagedSchemaAPI_EFE60EE1E8DAC4CE-001/tempDir-001/node1/testschemaapi_shard1_replica1'
   [junit4]   2> 742806 INFO  (qtp29144090-5296) [n:127.0.0.1:43078_solr c:testschemaapi s:shard1  x:testschemaapi_shard1_replica2] o.a.s.c.SolrResourceLoader JNDI not configured for solr (NoInitialContextEx)
   [junit4]   2> 742806 INFO  (qtp4763573-5301) [n:127.0.0.1:34159_solr c:testschemaapi s:shard1  x:testschemaapi_shard1_replica1] o.a.s.c.SolrResourceLoader JNDI not configured for solr (NoInitialContextEx)
   [junit4]   2> 742806 INFO  (qtp29144090-5296) [n:127.0.0.1:43078_solr c:testschemaapi s:shard1  x:testschemaapi_shard1_replica2] o.a.s.c.SolrResourceLoader solr home defaulted to 'solr/' (could not find system property or JNDI)
   [junit4]   2> 742806 INFO  (qtp4763573-5301) [n:127.0.0.1:34159_solr c:testschemaapi s:shard1  x:testschemaapi_shard1_replica1] o.a.s.c.SolrResourceLoader solr home defaulted to 'solr/' (could not find system property or JNDI)
   [junit4]   2> 742807 INFO  (qtp29144090-5296) [n:127.0.0.1:43078_solr c:testschemaapi s:shard1  x:testschemaapi_shard1_replica2] o.a.s.c.Config loaded config solrconfig.xml with version 0 
   [junit4]   2> 742807 INFO  (qtp4763573-5301) [n:127.0.0.1:34159_solr c:testschemaapi s:shard1  x:testschemaapi_shard1_replica1] o.a.s.c.Config loaded config solrconfig.xml with version 0 
   [junit4]   2> 742814 INFO  (qtp29144090-5296) [n:127.0.0.1:43078_solr c:testschemaapi s:shard1  x:testschemaapi_shard1_replica2] o.a.s.c.SolrConfig current version of requestparams : -1
   [junit4]   2> 742814 INFO  (qtp4763573-5301) [n:127.0.0.1:34159_solr c:testschemaapi s:shard1  x:testschemaapi_shard1_replica1] o.a.s.c.SolrConfig current version of requestparams : -1
   [junit4]   2> 742817 INFO  (qtp4763573-5301) [n:127.0.0.1:34159_solr c:testschemaapi s:shard1  x:testschemaapi_shard1_replica1] o.a.s.c.SolrConfig Using Lucene MatchVersion: 6.2.0
   [junit4]   2> 742817 INFO  (qtp29144090-5296) [n:127.0.0.1:43078_solr c:testschemaapi s:shard1  x:testschemaapi_shard1_replica2] o.a.s.c.SolrConfig Using Lucene MatchVersion: 6.2.0
   [junit4]   2> 742832 INFO  (qtp4763573-5301) [n:127.0.0.1:34159_solr c:testschemaapi s:shard1  x:testschemaapi_shard1_replica1] o.a.s.c.SolrConfig Loaded SolrConfig: solrconfig.xml
   [junit4]   2> 742832 INFO  (qtp29144090-5296) [n:127.0.0.1:43078_solr c:testschemaapi s:shard1  x:testschemaapi_shard1_replica2] o.a.s.c.SolrConfig Loaded SolrConfig: solrconfig.xml
   [junit4]   2> 742837 INFO  (qtp29144090-5296) [n:127.0.0.1:43078_solr c:testschemaapi s:shard1  x:testschemaapi_shard1_replica2] o.a.s.s.IndexSchema [testschemaapi_shard1_replica2] Schema name=minimal
   [junit4]   2> 742837 INFO  (qtp4763573-5301) [n:127.0.0.1:34159_solr c:testschemaapi s:shard1  x:testschemaapi_shard1_replica1] o.a.s.s.IndexSchema [testschemaapi_shard1_replica1] Schema name=minimal
   [junit4]   2> 742841 INFO  (qtp4763573-5301) [n:127.0.0.1:34159_solr c:testschemaapi s:shard1  x:testschemaapi_shard1_replica1] o.a.s.s.IndexSchema unique key field: id
   [junit4]   2> 742841 INFO  (qtp29144090-5296) [n:127.0.0.1:43078_solr c:testschemaapi s:shard1  x:testschemaapi_shard1_replica2] o.a.s.s.IndexSchema unique key field: id
   [junit4]   2> 742842 INFO  (qtp4763573-5301) [n:127.0.0.1:34159_solr c:testschemaapi s:shard1  x:testschemaapi_shard1_replica1] o.a.s.c.ConfigSetProperties Did not find ConfigSet properties, assuming default properties: Can't find resource 'configsetprops.json' in classpath or '/configs/conf1', cwd=/home/jenkins/workspace/Lucene-Solr-6.x-Linux/solr/build/solr-core/test/J0
   [junit4]   2> 742842 INFO  (qtp29144090-5296) [n:127.0.0.1:43078_solr c:testschemaapi s:shard1  x:testschemaapi_shard1_replica2] o.a.s.c.ConfigSetProperties Did not find ConfigSet properties, assuming default properties: Can't find resource 'configsetprops.json' in classpath or '/configs/conf1', cwd=/home/jenkins/workspace/Lucene-Solr-6.x-Linux/solr/build/solr-core/test/J0
   [junit4]   2> 742842 INFO  (qtp4763573-5301) [n:127.0.0.1:34159_solr c:testschemaapi s:shard1  x:testschemaapi_shard1_replica1] o.a.s.c.CoreContainer Creating SolrCore 'testschemaapi_shard1_replica1' using configuration from collection testschemaapi
   [junit4]   2> 742842 INFO  (qtp29144090-5296) [n:127.0.0.1:43078_solr c:testschemaapi s:shard1  x:testschemaapi_shard1_replica2] o.a.s.c.CoreContainer Creating SolrCore 'testschemaapi_shard1_replica2' using configuration from collection testschemaapi
   [junit4]   2> 742843 INFO  (qtp29144090-5296) [n:127.0.0.1:43078_solr c:testschemaapi s:shard1 r:core_node2 x:testschemaapi_shard1_replica2] o.a.s.c.SolrCore org.apache.solr.core.MockDirectoryFactory
   [junit4]   2> 742843 INFO  (qtp4763573-5301) [n:127.0.0.1:34159_solr c:testschemaapi s:shard1 r:core_node1 x:testschemaapi_shard1_replica1] o.a.s.c.SolrCore org.apache.solr.core.MockDirectoryFactory
   [junit4]   2> 742843 INFO  (qtp4763573-5301) [n:127.0.0.1:34159_solr c:testschemaapi s:shard1 r:core_node1 x:testschemaapi_shard1_replica1] o.a.s.c.SolrCore [[testschemaapi_shard1_replica1] ] Opening new SolrCore at [/home/jenkins/workspace/Lucene-Solr-6.x-Linux/solr/build/solr-core/test/J0/temp/solr.schema.TestManagedSchemaAPI_EFE60EE1E8DAC4CE-001/tempDir-001/node1/testschemaapi_shard1_replica1], dataDir=[/home/jenkins/workspace/Lucene-Solr-6.x-Linux/solr/build/solr-core/test/J0/temp/solr.schema.TestManagedSchemaAPI_EFE60EE1E8DAC4CE-001/tempDir-001/node1/./testschemaapi_shard1_replica1/data/]
   [junit4]   2> 742843 INFO  (qtp29144090-5296) [n:127.0.0.1:43078_solr c:testschemaapi s:shard1 r:core_node2 x:testschemaapi_shard1_replica2] o.a.s.c.SolrCore [[testschemaapi_shard1_replica2] ] Opening new SolrCore at [/home/jenkins/workspace/Lucene-Solr-6.x-Linux/solr/build/solr-core/test/J0/temp/solr.schema.TestManagedSchemaAPI_EFE60EE1E8DAC4CE-001/tempDir-001/node2/testschemaapi_shard1_replica2], dataDir=[/home/jenkins/workspace/Lucene-Solr-6.x-Linux/solr/build/solr-core/test/J0/temp/solr.schema.TestManagedSchemaAPI_EFE60EE1E8DAC4CE-001/tempDir-001/node2/./testschemaapi_shard1_replica2/data/]
   [junit4]   2> 742843 INFO  (qtp4763573-5301) [n:127.0.0.1:34159_solr c:testschemaapi s:shard1 r:core_node1 x:testschemaapi_shard1_replica1] o.a.s.c.SolrCore JMX monitoring not detected for core: testschemaapi_shard1_replica1
   [junit4]   2> 742843 INFO  (qtp29144090-5296) [n:127.0.0.1:43078_solr c:testschemaapi s:shard1 r:core_node2 x:testschemaapi_shard1_replica2] o.a.s.c.SolrCore JMX monitoring not detected for core: testschemaapi_shard1_replica2
   [junit4]   2> 742844 INFO  (qtp4763573-5301) [n:127.0.0.1:34159_solr c:testschemaapi s:shard1 r:core_node1 x:testschemaapi_shard1_replica1] o.a.s.c.CachingDirectoryFactory return new directory for /home/jenkins/workspace/Lucene-Solr-6.x-Linux/solr/build/solr-core/test/J0/temp/solr.schema.TestManagedSchemaAPI_EFE60EE1E8DAC4CE-001/tempDir-001/node1/./testschemaapi_shard1_replica1/data
   [junit4]   2> 742844 INFO  (qtp4763573-5301) [n:127.0.0.1:34159_solr c:testschemaapi s:shard1 r:core_node1 x:testschemaapi_shard1_replica1] o.a.s.c.SolrCore New index directory detected: old=null new=/home/jenkins/workspace/Lucene-Solr-6.x-Linux/solr/build/solr-core/test/J0/temp/solr.schema.TestManagedSchemaAPI_EFE60EE1E8DAC4CE-001/tempDir-001/node1/./testschemaapi_shard1_replica1/data/index/
   [junit4]   2> 742844 INFO  (qtp29144090-5296) [n:127.0.0.1:43078_solr c:testschemaapi s:shard1 r:core_node2 x:testschemaapi_shard1_replica2] o.a.s.c.CachingDirectoryFactory return new directory for /home/jenkins/workspace/Lucene-Solr-6.x-Linux/solr/build/solr-core/test/J0/temp/solr.schema.TestManagedSchemaAPI_EFE60EE1E8DAC4CE-001/tempDir-001/node2/./testschemaapi_shard1_replica2/data
   [junit4]   2> 742844 WARN  (qtp4763573-5301) [n:127.0.0.1:34159_solr c:testschemaapi s:shard1 r:core_node1 x:testschemaapi_shard1_replica1] o.a.s.c.SolrCore [testschemaapi_shard1_replica1] Solr index directory '/home/jenkins/workspace/Lucene-Solr-6.x-Linux/solr/build/solr-core/test/J0/temp/solr.schema.TestManagedSchemaAPI_EFE60EE1E8DAC4CE-001/tempDir-001/node1/./testschemaapi_shard1_replica1/data/index' doesn't exist. Creating new index...
   [junit4]   2> 742844 INFO  (qtp29144090-5296) [n:127.0.0.1:43078_solr c:testschemaapi s:shard1 r:core_node2 x:testschemaapi_shard1_replica2] o.a.s.c.SolrCore New index directory detected: old=null new=/home/jenkins/workspace/Lucene-Solr-6.x-Linux/solr/build/solr-core/test/J0/temp/solr.schema.TestManagedSchemaAPI_EFE60EE1E8DAC4CE-001/tempDir-001/node2/./testschemaapi_shard1_replica2/data/index/
   [junit4]   2> 742844 WARN  (qtp29144090-5296) [n:127.0.0.1:43078_solr c:testschemaapi s:shard1 r:core_node2 x:testschemaapi_shard1_replica2] o.a.s.c.SolrCore [testschemaapi_shard1_replica2] Solr index directory '/home/jenkins/workspace/Lucene-Solr-6.x-Linux/solr/build/solr-core/test/J0/temp/solr.schema.TestManagedSchemaAPI_EFE60EE1E8DAC4CE-001/tempDir-001/node2/./testschemaapi_shard1_replica2/data/index' doesn't exist. Creating new index...
   [junit4]   2> 742845 INFO  (qtp4763573-5301) [n:127.0.0.1:34159_solr c:testschemaapi s:shard1 r:core_node1 x:testschemaapi_shard1_replica1] o.a.s.c.CachingDirectoryFactory return new directory for /home/jenkins/workspace/Lucene-Solr-6.x-Linux/solr/build/solr-core/test/J0/temp/solr.schema.TestManagedSchemaAPI_EFE60EE1E8DAC4CE-001/tempDir-001/node1/./testschemaapi_shard1_replica1/data/index
   [junit4]   2> 742845 INFO  (qtp29144090-5296) [n:127.0.0.1:43078_solr c:testschemaapi s:shard1 r:core_node2 x:testschemaapi_shard1_replica2] o.a.s.c.CachingDirectoryFactory return new directory for /home/jenkins/workspace/Lucene-Solr-6.x-Linux/solr/build/solr-core/test/J0/temp/solr.schema.TestManagedSchemaAPI_EFE60EE1E8DAC4CE-001/tempDir-001/node2/./testschemaapi_shard1_replica2/data/index
   [junit4]   2> 742846 INFO  (qtp4763573-5301) [n:127.0.0.1:34159_solr c:testschemaapi s:shard1 r:core_node1 x:testschemaapi_shard1_replica1] o.a.s.c.SolrDeletionPolicy SolrDeletionPolicy.onCommit: commits: num=1
   [junit4]   2> 	commit{dir=MockDirectoryWrapper(RAMDirectory@18b3f6f lockFactory=org.apache.lucene.store.SingleInstanceLockFactory@1f157f6),segFN=segments_1,generation=1}
   [junit4]   2> 742846 INFO  (qtp29144090-5296) [n:127.0.0.1:43078_solr c:testschemaapi s:shard1 r:core_node2 x:testschemaapi_shard1_replica2] o.a.s.c.SolrDeletionPolicy SolrDeletionPolicy.onCommit: commits: num=1
   [junit4]   2> 	commit{dir=MockDirectoryWrapper(RAMDirectory@2942f lockFactory=org.apache.lucene.store.SingleInstanceLockFactory@17ebe8a),segFN=segments_1,generation=1}
   [junit4]   2> 742846 INFO  (qtp4763573-5301) [n:127.0.0.1:34159_solr c:testschemaapi s:shard1 r:core_node1 x:testschemaapi_shard1_replica1] o.a.s.c.SolrDeletionPolicy newest commit generation = 1
   [junit4]   2> 742846 INFO  (qtp29144090-5296) [n:127.0.0.1:43078_solr c:testschemaapi s:shard1 r:core_node2 x:testschemaapi_shard1_replica2] o.a.s.c.SolrDeletionPolicy newest commit generation = 1
   [junit4]   2> 742846 INFO  (OldIndexDirectoryCleanupThreadForCore-testschemaapi_shard1_replica1) [n:127.0.0.1:34159_solr c:testschemaapi s:shard1 r:core_node1 x:testschemaapi_shard1_replica1] o.a.s.c.SolrCore Looking for old index directories to cleanup for core testschemaapi_shard1_replica1 in /home/jenkins/workspace/Lucene-Solr-6.x-Linux/solr/build/solr-core/test/J0/temp/solr.schema.TestManagedSchemaAPI_EFE60EE1E8DAC4CE-001/tempDir-001/node1/./testschemaapi_shard1_replica1/data/
   [junit4]   2> 742846 INFO  (OldIndexDirectoryCleanupThreadForCore-testschemaapi_shard1_replica2) [n:127.0.0.1:43078_solr c:testschemaapi s:shard1 r:core_node2 x:testschemaapi_shard1_replica2] o.a.s.c.SolrCore Looking for old index directories to cleanup for core testschemaapi_shard1_replica2 in /home/jenkins/workspace/Lucene-Solr-6.x-Linux/solr/build/solr-core/test/J0/temp/solr.schema.TestManagedSchemaAPI_EFE60EE1E8DAC4CE-001/tempDir-001/node2/./testschemaapi_shard1_replica2/data/
   [junit4]   2> 742846 WARN  (OldIndexDirectoryCleanupThreadForCore-testschemaapi_shard1_replica1) [n:127.0.0.1:34159_solr c:testschemaapi s:shard1 r:core_node1 x:testschemaapi_shard1_replica1] o.a.s.c.DirectoryFactory /home/jenkins/workspace/Lucene-Solr-6.x-Linux/solr/build/solr-core/test/J0/temp/solr.schema.TestManagedSchemaAPI_EFE60EE1E8DAC4CE-001/tempDir-001/node1/./testschemaapi_shard1_replica1/data/ does not point to a valid data directory; skipping clean-up of old index directories.
   [junit4]   2> 742846 WARN  (OldIndexDirectoryCleanupThreadForCore-testschemaapi_shard1_replica2) [n:127.0.0.1:43078_solr c:testschemaapi s:shard1 r:core_node2 x:testschemaapi_shard1_replica2] o.a.s.c.DirectoryFactory /home/jenkins/workspace/Lucene-Solr-6.x-Linux/solr/build/solr-core/test/J0/temp/solr.schema.TestManagedSchemaAPI_EFE60EE1E8DAC4CE-001/tempDir-001/node2/./testschemaapi_shard1_replica2/data/ does not point to a valid data directory; skipping clean-up of old index directories.
   [junit4]   2> 742848 INFO  (qtp4763573-5301) [n:127.0.0.1:34159_solr c:testschemaapi s:shard1 r:core_node1 x:testschemaapi_shard1_replica1] o.a.s.c.SolrCore no updateRequestProcessorChain defined as default, creating implicit default
   [junit4]   2> 742848 INFO  (qtp29144090-5296) [n:127.0.0.1:43078_solr c:testschemaapi s:shard1 r:core_node2 x:testschemaapi_shard1_replica2] o.a.s.c.SolrCore no updateRequestProcessorChain defined as default, creating implicit default
   [junit4]   2> 742850 INFO  (qtp29144090-5296) [n:127.0.0.1:43078_solr c:testschemaapi s:shard1 r:core_node2 x:testschemaapi_shard1_replica2] o.a.s.h.l.XMLLoader xsltCacheLifetimeSeconds=60
   [junit4]   2> 742850 INFO  (qtp4763573-5301) [n:127.0.0.1:34159_solr c:testschemaapi s:shard1 r:core_node1 x:testschemaapi_shard1_replica1] o.a.s.h.l.XMLLoader xsltCacheLifetimeSeconds=60
   [junit4]   2> 742851 INFO  (qtp29144090-5296) [n:127.0.0.1:43078_solr c:testschemaapi s:shard1 r:core_node2 x:testschemaapi_shard1_replica2] o.a.s.h.l.XMLLoader xsltCacheLifetimeSeconds=60
   [junit4]   2> 742851 INFO  (qtp4763573-5301) [n:127.0.0.1:34159_solr c:testschemaapi s:shard1 r:core_node1 x:testschemaapi_shard1_replica1] o.a.s.h.l.XMLLoader xsltCacheLifetimeSeconds=60
   [junit4]   2> 742852 INFO  (qtp4763573-5301) [n:127.0.0.1:34159_solr c:testschemaapi s:shard1 r:core_node1 x:testschemaapi_shard1_replica1] o.a.s.h.l.XMLLoader xsltCacheLifetimeSeconds=60
   [junit4]   2> 742852 INFO  (qtp29144090-5296) [n:127.0.0.1:43078_solr c:testschemaapi s:shard1 r:core_node2 x:testschemaapi_shard1_replica2] o.a.s.h.l.XMLLoader xsltCacheLifetimeSeconds=60
   [junit4]   2> 742853 INFO  (qtp4763573-5301) [n:127.0.0.1:34159_solr c:testschemaapi s:shard1 r:core_node1 x:testschemaapi_shard1_replica1] o.a.s.h.l.XMLLoader xsltCacheLifetimeSeconds=60
   [junit4]   2> 742853 INFO  (qtp29144090-5296) [n:127.0.0.1:43078_solr c:testschemaapi s:shard1 r:core_node2 x:testschemaapi_shard1_replica2] o.a.s.h.l.XMLLoader xsltCacheLifetimeSeconds=60
   [junit4]   2> 742855 INFO  (qtp4763573-5301) [n:127.0.0.1:34159_solr c:testschemaapi s:shard1 r:core_node1 x:testschemaapi_shard1_replica1] o.a.s.c.RequestHandlers Registered paths: /admin/mbeans,/update/csv,/sql,/update/json/docs,/admin/luke,/graph,/export,/select,/admin/segments,/get,/admin/system,/replication,/admin/properties,/config,/stream,/schema,/admin/plugins,/admin/logging,/update/json,/admin/ping,/admin/threads,/update,/admin/file
   [junit4]   2> 742855 INFO  (qtp29144090-5296) [n:127.0.0.1:43078_solr c:testschemaapi s:shard1 r:core_node2 x:testschemaapi_shard1_replica2] o.a.s.c.RequestHandlers Registered paths: /admin/mbeans,/update/csv,/sql,/update/json/docs,/admin/luke,/graph,/export,/select,/admin/segments,/get,/admin/system,/replication,/admin/properties,/config,/stream,/schema,/admin/plugins,/admin/logging,/update/json,/admin/ping,/admin/threads,/update,/admin/file
   [junit4]   2> 742855 INFO  (qtp4763573-5301) [n:127.0.0.1:34159_solr c:testschemaapi s:shard1 r:core_node1 x:testschemaapi_shard1_replica1] o.a.s.c.SolrCore Using default statsCache cache: org.apache.solr.search.stats.LocalStatsCache
   [junit4]   2> 742855 INFO  (qtp29144090-5296) [n:127.0.0.1:43078_solr c:testschemaapi s:shard1 r:core_node2 x:testschemaapi_shard1_replica2] o.a.s.c.SolrCore Using default statsCache cache: org.apache.solr.search.stats.LocalStatsCache
   [junit4]   2> 742855 INFO  (qtp4763573-5301) [n:127.0.0.1:34159_solr c:testschemaapi s:shard1 r:core_node1 x:testschemaapi_shard1_replica1] o.a.s.u.UpdateHandler Using UpdateLog implementation: org.apache.solr.update.UpdateLog
   [junit4]   2> 742856 INFO  (qtp29144090-5296) [n:127.0.0.1:43078_solr c:testschemaapi s:shard1 r:core_node2 x:testschemaapi_shard1_replica2] o.a.s.u.UpdateHandler Using UpdateLog implementation: org.apache.solr.update.UpdateLog
   [junit4]   2> 742856 INFO  (qtp4763573-5301) [n:127.0.0.1:34159_solr c:testschemaapi s:shard1 r:core_node1 x:testschemaapi_shard1_replica1] o.a.s.u.UpdateLog Initializing UpdateLog: dataDir=null defaultSyncLevel=FLUSH numRecordsToKeep=100 maxNumLogsToKeep=10 numVersionBuckets=65536
   [junit4]   2> 742856 INFO  (qtp29144090-5296) [n:127.0.0.1:43078_solr c:testschemaapi s:shard1 r:core_node2 x:testschemaapi_shard1_replica2] o.a.s.u.UpdateLog Initializing UpdateLog: dataDir=null defaultSyncLevel=FLUSH numRecordsToKeep=100 maxNumLogsToKeep=10 numVersionBuckets=65536
   [junit4]   2> 742857 INFO  (qtp4763573-5301) [n:127.0.0.1:34159_solr c:testschemaapi s:shard1 r:core_node1 x:testschemaapi_shard1_replica1] o.a.s.u.CommitTracker Hard AutoCommit: disabled
   [junit4]   2> 742857 INFO  (qtp29144090-5296) [n:127.0.0.1:43078_solr c:testschemaapi s:shard1 r:core_node2 x:testschemaapi_shard1_replica2] o.a.s.u.CommitTracker Hard AutoCommit: disabled
   [junit4]   2> 742857 INFO  (qtp4763573-5301) [n:127.0.0.1:34159_solr c:testschemaapi s:shard1 r:core_node1 x:testschemaapi_shard1_replica1] o.a.s.u.CommitTracker Soft AutoCommit: disabled
   [junit4]   2> 742857 INFO  (qtp29144090-5296) [n:127.0.0.1:43078_solr c:testschemaapi s:shard1 r:core_node2 x:testschemaapi_shard1_replica2] o.a.s.u.CommitTracker Soft AutoCommit: disabled
   [junit4]   2> 742857 INFO  (qtp29144090-5296) [n:127.0.0.1:43078_solr c:testschemaapi s:shard1 r:core_node2 x:testschemaapi_shard1_replica2] o.a.s.c.SolrDeletionPolicy SolrDeletionPolicy.onInit: commits: num=1
   [junit4]   2> 	commit{dir=MockDirectoryWrapper(RAMDirectory@2942f lockFactory=org.apache.lucene.store.SingleInstanceLockFactory@17ebe8a),segFN=segments_1,generation=1}
   [junit4]   2> 742857 INFO  (qtp29144090-5296) [n:127.0.0.1:43078_solr c:testschemaapi s:shard1 r:core_node2 x:testschemaapi_shard1_replica2] o.a.s.c.SolrDeletionPolicy newest commit generation = 1
   [junit4]   2> 742857 INFO  (qtp4763573-5301) [n:127.0.0.1:34159_solr c:testschemaapi s:shard1 r:core_node1 x:testschemaapi_shard1_replica1] o.a.s.c.SolrDeletionPolicy SolrDeletionPolicy.onInit: commits: num=1
   [junit4]   2> 	commit{dir=MockDirectoryWrapper(RAMDirectory@18b3f6f lockFactory=org.apache.lucene.store.SingleInstanceLockFactory@1f157f6),segFN=segments_1,generation=1}
   [junit4]   2> 742857 INFO  (qtp4763573-5301) [n:127.0.0.1:34159_solr c:testschemaapi s:shard1 r:core_node1 x:testschemaapi_shard1_replica1] o.a.s.c.SolrDeletionPolicy newest commit generation = 1
   [junit4]   2> 742857 INFO  (qtp29144090-5296) [n:127.0.0.1:43078_solr c:testschemaapi s:shard1 r:core_node2 x:testschemaapi_shard1_replica2] o.a.s.s.SolrIndexSearcher Opening [Searcher@e4a660[testschemaapi_shard1_replica2] main]
   [junit4]   2> 742858 INFO  (qtp4763573-5301) [n:127.0.0.1:34159_solr c:testschemaapi s:shard1 r:core_node1 x:testschemaapi_shard1_replica1] o.a.s.s.SolrIndexSearcher Opening [Searcher@182ba44[testschemaapi_shard1_replica1] main]
   [junit4]   2> 742858 INFO  (qtp29144090-5296) [n:127.0.0.1:43078_solr c:testschemaapi s:shard1 r:core_node2 x:testschemaapi_shard1_replica2] o.a.s.c.c.ZkStateReader Load collection config from: [/collections/testschemaapi]
   [junit4]   2> 742858 INFO  (qtp4763573-5301) [n:127.0.0.1:34159_solr c:testschemaapi s:shard1 r:core_node1 x:testschemaapi_shard1_replica1] o.a.s.c.c.ZkStateReader Load collection config from: [/collections/testschemaapi]
   [junit4]   2> 742858 INFO  (qtp4763573-5301) [n:127.0.0.1:34159_solr c:testschemaapi s:shard1 r:core_node1 x:testschemaapi_shard1_replica1] o.a.s.c.c.ZkStateReader path=[/collections/testschemaapi] [configName]=[conf1] specified config exists in ZooKeeper
   [junit4]   2> 742858 INFO  (qtp4763573-5301) [n:127.0.0.1:34159_solr c:testschemaapi s:shard1 r:core_node1 x:testschemaapi_shard1_replica1] o.a.s.r.ManagedResourceStorage Setting up ZooKeeper-based storage for the RestManager with znodeBase: /configs/conf1
   [junit4]   2> 742858 INFO  (qtp29144090-5296) [n:127.0.0.1:43078_solr c:testschemaapi s:shard1 r:core_node2 x:testschemaapi_shard1_replica2] o.a.s.c.c.ZkStateReader path=[/collections/testschemaapi] [configName]=[conf1] specified config exists in ZooKeeper
   [junit4]   2> 742858 INFO  (qtp29144090-5296) [n:127.0.0.1:43078_solr c:testschemaapi s:shard1 r:core_node2 x:testschemaapi_shard1_replica2] o.a.s.r.ManagedResourceStorage Setting up ZooKeeper-based storage for the RestManager with znodeBase: /configs/conf1
   [junit4]   2> 742859 INFO  (qtp4763573-5301) [n:127.0.0.1:34159_solr c:testschemaapi s:shard1 r:core_node1 x:testschemaapi_shard1_replica1] o.a.s.r.ManagedResourceStorage Configured ZooKeeperStorageIO with znodeBase: /configs/conf1
   [junit4]   2> 742859 INFO  (qtp4763573-5301) [n:127.0.0.1:34159_solr c:testschemaapi s:shard1 r:core_node1 x:testschemaapi_shard1_replica1] o.a.s.r.RestManager Initializing RestManager with initArgs: {}
   [junit4]   2> 742859 INFO  (qtp4763573-5301) [n:127.0.0.1:34159_solr c:testschemaapi s:shard1 r:core_node1 x:testschemaapi_shard1_replica1] o.a.s.r.ManagedResourceStorage Reading _rest_managed.json using ZooKeeperStorageIO:path=/configs/conf1
   [junit4]   2> 742859 INFO  (qtp29144090-5296) [n:127.0.0.1:43078_solr c:testschemaapi s:shard1 r:core_node2 x:testschemaapi_shard1_replica2] o.a.s.r.ManagedResourceStorage Configured ZooKeeperStorageIO with znodeBase: /configs/conf1
   [junit4]   2> 742860 INFO  (qtp29144090-5296) [n:127.0.0.1:43078_solr c:testschemaapi s:shard1 r:core_node2 x:testschemaapi_shard1_replica2] o.a.s.r.RestManager Initializing RestManager with initArgs: {}
   [junit4]   2> 742860 INFO  (qtp29144090-5296) [n:127.0.0.1:43078_solr c:testschemaapi s:shard1 r:core_node2 x:testschemaapi_shard1_replica2] o.a.s.r.ManagedResourceStorage Reading _rest_managed.json using ZooKeeperStorageIO:path=/configs/conf1
   [junit4]   2> 742860 INFO  (qtp4763573-5301) [n:127.0.0.1:34159_solr c:testschemaapi s:shard1 r:core_node1 x:testschemaapi_shard1_replica1] o.a.s.r.ManagedResourceStorage No data found for znode /configs/conf1/_rest_managed.json
   [junit4]   2> 742860 INFO  (qtp4763573-5301) [n:127.0.0.1:34159_solr c:testschemaapi s:shard1 r:core_node1 x:testschemaapi_shard1_replica1] o.a.s.r.ManagedResourceStorage Loaded null at path _rest_managed.json using ZooKeeperStorageIO:path=/configs/conf1
   [junit4]   2> 742860 INFO  (qtp4763573-5301) [n:127.0.0.1:34159_solr c:testschemaapi s:shard1 r:core_node1 x:testschemaapi_shard1_replica1] o.a.s.r.RestManager Initializing 0 registered ManagedResources
   [junit4]   2> 742860 INFO  (qtp29144090-5296) [n:127.0.0.1:43078_solr c:testschemaapi s:shard1 r:core_node2 x:testschemaapi_shard1_replica2] o.a.s.r.ManagedResourceStorage No data found for znode /configs/conf1/_rest_managed.json
   [junit4]   2> 742860 INFO  (qtp4763573-5301) [n:127.0.0.1:34159_solr c:testschemaapi s:shard1 r:core_node1 x:testschemaapi_shard1_replica1] o.a.s.s.ZkIndexSchemaReader Creating ZooKeeper watch for the managed schema at /configs/conf1/managed-schema
   [junit4]   2> 742860 INFO  (qtp29144090-5296) [n:127.0.0.1:43078_solr c:testschemaapi s:shard1 r:core_node2 x:testschemaapi_shard1_replica2] o.a.s.r.ManagedResourceStorage Loaded null at path _rest_managed.json using ZooKeeperStorageIO:path=/configs/conf1
   [junit4]   2> 742860 INFO  (qtp29144090-5296) [n:127.0.0.1:43078_solr c:testschemaapi s:shard1 r:core_node2 x:testschemaapi_shard1_replica2] o.a.s.r.RestManager Initializing 0 registered ManagedResources
   [junit4]   2> 742860 INFO  (qtp29144090-5296) [n:127.0.0.1:43078_solr c:testschemaapi s:shard1 r:core_node2 x:testschemaapi_shard1_replica2] o.a.s.s.ZkIndexSchemaReader Creating ZooKeeper watch for the managed schema at /configs/conf1/managed-schema
   [junit4]   2> 742860 INFO  (qtp4763573-5301) [n:127.0.0.1:34159_solr c:testschemaapi s:shard1 r:core_node1 x:testschemaapi_shard1_replica1] o.a.s.c.ZkController Added new OnReconnect listener ZkIndexSchemaReader: /configs/conf1/managed-schema, uniqueCoreId: testschemaapi_shard1_replica1:575187423772721
   [junit4]   2> 742860 INFO  (qtp4763573-5301) [n:127.0.0.1:34159_solr c:testschemaapi s:shard1 r:core_node1 x:testschemaapi_shard1_replica1] o.a.s.h.ReplicationHandler Commits will be reserved for  10000
   [junit4]   2> 742860 INFO  (qtp29144090-5296) [n:127.0.0.1:43078_solr c:testschemaapi s:shard1 r:core_node2 x:testschemaapi_shard1_replica2] o.a.s.c.ZkController Added new OnReconnect listener ZkIndexSchemaReader: /configs/conf1/managed-schema, uniqueCoreId: testschemaapi_shard1_replica2:575187423826271
   [junit4]   2> 742860 INFO  (qtp29144090-5296) [n:127.0.0.1:43078_solr c:testschemaapi s:shard1 r:core_node2 x:testschemaapi_shard1_replica2] o.a.s.h.ReplicationHandler Commits will be reserved for  10000
   [junit4]   2> 742860 INFO  (searcherExecutor-2597-thread-1-processing-n:127.0.0.1:34159_solr x:testschemaapi_shard1_replica1 s:shard1 c:testschemaapi r:core_node1) [n:127.0.0.1:34159_solr c:testschemaapi s:shard1 r:core_node1 x:testschemaapi_shard1_replica1] o.a.s.c.SolrCore [testschemaapi_shard1_replica1] Registered new searcher Searcher@182ba44[testschemaapi_shard1_replica1] main{ExitableDirectoryReader(UninvertingDirectoryReader())}
   [junit4]   2> 742861 INFO  (qtp4763573-5301) [n:127.0.0.1:34159_solr c:testschemaapi s:shard1 r:core_node1 x:testschemaapi_shard1_replica1] o.a.s.u.UpdateLog Looking up max value of version field to seed version buckets
   [junit4]   2> 742861 INFO  (searcherExecutor-2598-thread-1-processing-n:127.0.0.1:43078_solr x:testschemaapi_shard1_replica2 s:shard1 c:testschemaapi r:core_node2) [n:127.0.0.1:43078_solr c:testschemaapi s:shard1 r:core_node2 x:testschemaapi_shard1_replica2] o.a.s.c.SolrCore [testschemaapi_shard1_replica2] Registered new searcher Searcher@e4a660[testschemaapi_shard1_replica2] main{ExitableDirectoryReader(UninvertingDirectoryReader())}
   [junit4]   2> 742861 INFO  (qtp4763573-5301) [n:127.0.0.1:34159_solr c:testschemaapi s:shard1 r:core_node1 x:testschemaapi_shard1_replica1] o.a.s.u.VersionInfo Refreshing highest value of _version_ for 65536 version buckets from index
   [junit4]   2> 742861 INFO  (qtp29144090-5296) [n:127.0.0.1:43078_solr c:testschemaapi s:shard1 r:core_node2 x:testschemaapi_shard1_replica2] o.a.s.u.UpdateLog Looking up max value of version field to seed version buckets
   [junit4]   2> 742861 INFO  (qtp4763573-5301) [n:127.0.0.1:34159_solr c:testschemaapi s:shard1 r:core_node1 x:testschemaapi_shard1_replica1] o.a.s.u.VersionInfo No terms found for _version_, cannot seed version bucket highest value from index
   [junit4]   2> 742861 INFO  (qtp29144090-5296) [n:127.0.0.1:43078_solr c:testschemaapi s:shard1 r:core_node2 x:testschemaapi_shard1_replica2] o.a.s.u.VersionInfo Refreshing highest value of _version_ for 65536 version buckets from index
   [junit4]   2> 742861 INFO  (qtp4763573-5301) [n:127.0.0.1:34159_solr c:testschemaapi s:shard1 r:core_node1 x:testschemaapi_shard1_replica1] o.a.s.u.UpdateLog Could not find max version in index or recent updates, using new clock 1537572544870088704
   [junit4]   2> 742861 INFO  (qtp29144090-5296) [n:127.0.0.1:43078_solr c:testschemaapi s:shard1 r:core_node2 x:testschemaapi_shard1_replica2] o.a.s.u.VersionInfo No terms found for _version_, cannot seed version bucket highest value from index
   [junit4]   2> 742861 INFO  (qtp29144090-5296) [n:127.0.0.1:43078_solr c:testschemaapi s:shard1 r:core_node2 x:testschemaapi_shard1_replica2] o.a.s.u.UpdateLog Could not find max version in index or recent updates, using new clock 1537572544870088704
   [junit4]   2> 742862 INFO  (qtp4763573-5301) [n:127.0.0.1:34159_solr c:testschemaapi s:shard1 r:core_node1 x:testschemaapi_shard1_replica1] o.a.s.u.UpdateLog Took 1.0ms to seed version buckets with highest version 1537572544870088704
   [junit4]   2> 742863 INFO  (qtp4763573-5301) [n:127.0.0.1:34159_solr c:testschemaapi s:shard1 r:core_node1 x:testschemaapi_shard1_replica1] o.a.s.c.ZkController watch zkdir /configs/conf1
   [junit4]   2> 742863 INFO  (qtp29144090-5296) [n:127.0.0.1:43078_solr c:testschemaapi s:shard1 r:core_node2 x:testschemaapi_shard1_replica2] o.a.s.u.UpdateLog Took 2.0ms to seed version buckets with highest version 1537572544870088704
   [junit4]   2> 742863 INFO  (qtp29144090-5296) [n:127.0.0.1:43078_solr c:testschemaapi s:shard1 r:core_node2 x:testschemaapi_shard1_replica2] o.a.s.c.ZkController watch zkdir /configs/conf1
   [junit4]   2> 742863 INFO  (qtp29144090-5296) [n:127.0.0.1:43078_solr c:testschemaapi s:shard1 r:core_node2 x:testschemaapi_shard1_replica2] o.a.s.c.CoreContainer registering core: testschemaapi_shard1_replica2
   [junit4]   2> 742863 INFO  (qtp4763573-5301) [n:127.0.0.1:34159_solr c:testschemaapi s:shard1 r:core_node1 x:testschemaapi_shard1_replica1] o.a.s.c.CoreContainer registering core: testschemaapi_shard1_replica1
   [junit4]   2> 742864 INFO  (qtp29144090-5296) [n:127.0.0.1:43078_solr c:testschemaapi s:shard1 r:core_node2 x:testschemaapi_shard1_replica2] o.a.s.c.ZkController Register replica - core:testschemaapi_shard1_replica2 address:http://127.0.0.1:43078/solr collection:testschemaapi shard:shard1
   [junit4]   2> 742864 INFO  (qtp4763573-5301) [n:127.0.0.1:34159_solr c:testschemaapi s:shard1 r:core_node1 x:testschemaapi_shard1_replica1] o.a.s.c.ZkController Register replica - core:testschemaapi_shard1_replica1 address:http://127.0.0.1:34159/solr collection:testschemaapi shard:shard1
   [junit4]   2> 742864 INFO  (qtp29144090-5296) [n:127.0.0.1:43078_solr c:testschemaapi s:shard1 r:core_node2 x:testschemaapi_shard1_replica2] o.a.s.c.c.SolrZkClient makePath: /collections/testschemaapi/leader_elect/shard1/election
   [junit4]   2> 742864 INFO  (qtp4763573-5301) [n:127.0.0.1:34159_solr c:testschemaapi s:shard1 r:core_node1 x:testschemaapi_shard1_replica1] o.a.s.c.c.SolrZkClient makePath: /collections/testschemaapi/leader_elect/shard1/election
   [junit4]   2> 742866 INFO  (qtp4763573-5301) [n:127.0.0.1:34159_solr c:testschemaapi s:shard1 r:core_node1 x:testschemaapi_shard1_replica1] o.a.s.c.LeaderElector Joined leadership election with path: /collections/testschemaapi/leader_elect/shard1/election/96098283897946117-core_node1-n_0000000000
   [junit4]   2> 742866 INFO  (qtp29144090-5296) [n:127.0.0.1:43078_solr c:testschemaapi s:shard1 r:core_node2 x:testschemaapi_shard1_replica2] o.a.s.c.LeaderElector Joined leadership election with path: /collections/testschemaapi/leader_elect/shard1/election/96098283897946118-core_node2-n_0000000001
   [junit4]   2> 742866 INFO  (qtp4763573-5301) [n:127.0.0.1:34159_solr c:testschemaapi s:shard1 r:core_node1 x:testschemaapi_shard1_replica1] o.a.s.c.ShardLeaderElectionContext Running the leader process for shard=shard1 and weAreReplacement=false and leaderVoteWait=10000
   [junit4]   2> 742866 INFO  (qtp29144090-5296) [n:127.0.0.1:43078_solr c:testschemaapi s:shard1 r:core_node2 x:testschemaapi_shard1_replica2] o.a.s.c.LeaderElector Watching path /collections/testschemaapi/leader_elect/shard1/election/96098283897946117-core_node1-n_0000000000 to know if I could be the leader
   [junit4]   2> 742867 INFO  (qtp4763573-5301) [n:127.0.0.1:34159_solr c:testschemaapi s:shard1 r:core_node1 x:testschemaapi_shard1_replica1] o.a.s.c.ShardLeaderElectionContext Enough replicas found to continue.
   [junit4]   2> 742867 INFO  (qtp4763573-5301) [n:127.0.0.1:34159_solr c:testschemaapi s:shard1 r:core_node1 x:testschemaapi_shard1_replica1] o.a.s.c.ShardLeaderElectionContext I may be the new leader - try and sync
   [junit4]   2> 742867 INFO  (qtp4763573-5301) [n:127.0.0.1:34159_solr c:testschemaapi s:shard1 r:core_node1 x:testschemaapi_shard1_replica1] o.a.s.c.SyncStrategy Sync replicas to http://127.0.0.1:34159/solr/testschemaapi_shard1_replica1/
   [junit4]   2> 742868 INFO  (qtp4763573-5301) [n:127.0.0.1:34159_solr c:testschemaapi s:shard1 r:core_node1 x:testschemaapi_shard1_replica1] o.a.s.u.PeerSync PeerSync: core=testschemaapi_shard1_replica1 url=http://127.0.0.1:34159/solr START replicas=[http://127.0.0.1:43078/solr/testschemaapi_shard1_replica2/] nUpdates=100
   [junit4]   2> 742868 INFO  (OverseerStateUpdate-96098283897946117-127.0.0.1:34159_solr-n_0000000000) [n:127.0.0.1:34159_solr    ] o.a.s.c.Overseer processMessage: queueSize: 1, message = {
   [junit4]   2>   "operation":"leader",
   [junit4]   2>   "shard":"shard1",
   [junit4]   2>   "collection":"testschemaapi"} current state version: 0
   [junit4]   2> 742868 INFO  (qtp4763573-5301) [n:127.0.0.1:34159_solr c:testschemaapi s:shard1 r:core_node1 x:testschemaapi_shard1_replica1] o.a.s.u.PeerSync PeerSync: core=testschemaapi_shard1_replica1 url=http://127.0.0.1:34159/solr DONE.  We have no versions.  sync failed.
   [junit4]   2> 742868 INFO  (qtp4763573-5301) [n:127.0.0.1:34159_solr c:testschemaapi s:shard1 r:core_node1 x:testschemaapi_shard1_replica1] o.a.s.c.SyncStrategy Leader's attempt to sync with shard failed, moving to the next candidate
   [junit4]   2> 742868 INFO  (qtp4763573-5301) [n:127.0.0.1:34159_solr c:testschemaapi s:shard1 r:core_node1 x:testschemaapi_shard1_replica1] o.a.s.c.ShardLeaderElectionContext We failed sync, but we have no versions - we can't sync in that case - we were active before, so become leader anyway
   [junit4]   2> 742869 INFO  (qtp4763573-5301) [n:127.0.0.1:34159_solr c:testschemaapi s:shard1 r:core_node1 x:testschemaapi_shard1_replica1] o.a.s.c.c.SolrZkClient makePath: /collections/testschemaapi/leaders/shard1
   [junit4]   2> 742872 INFO  (qtp4763573-5301) [n:127.0.0.1:34159_solr c:testschemaapi s:shard1 r:core_node1 x:testschemaapi_shard1_replica1] o.a.s.c.ShardLeaderElectionContextBase Creating leader registration node /collections/testschemaapi/leaders/shard1/leader after winning as /collections/testschemaapi/leader_elect/shard1/election/96098283897946117-core_node1-n_0000000000
   [junit4]   2> 742872 INFO  (qtp29144090-5300) [n:127.0.0.1:43078_solr c:testschemaapi s:shard1 r:core_node2 x:testschemaapi_shard1_replica2] o.a.s.c.S.Request [testschemaapi_shard1_replica2]  webapp=/solr path=/get params={distrib=false&qt=/get&fingerprint=false&getVersions=100&wt=javabin&version=2} status=0 QTime=2
   [junit4]   2> 742874 INFO  (qtp4763573-5301) [n:127.0.0.1:34159_solr c:testschemaapi s:shard1 r:core_node1 x:testschemaapi_shard1_replica1] o.a.s.c.ShardLeaderElectionContext I am the new leader: http://127.0.0.1:34159/solr/testschemaapi_shard1_replica1/ shard1
   [junit4]   2> 742874 INFO  (OverseerStateUpdate-96098283897946117-127.0.0.1:34159_solr-n_0000000000) [n:127.0.0.1:34159_solr    ] o.a.s.c.Overseer processMessage: queueSize: 1, message = {
   [junit4]   2>   "operation":"leader",
   [junit4]   2>   "shard":"shard1",
   [junit4]   2>   "collection":"testschemaapi",
   [junit4]   2>   "base_url":"http://127.0.0.1:34159/solr",
   [junit4]   2>   "core":"testschemaapi_shard1_replica1",
   [junit4]   2>   "state":"active"} current state version: 0
   [junit4]   2> 742976 INFO  (OverseerStateUpdate-96098283897946117-127.0.0.1:34159_solr-n_0000000000) [n:127.0.0.1:34159_solr    ] o.a.s.c.o.ZkStateWriter going to update_collection /collections/testschemaapi/state.json version: 1
   [junit4]   2> 742976 INFO  (zkCallback-910-thread-2-processing-n:127.0.0.1:34159_solr) [n:127.0.0.1:34159_solr    ] o.a.s.c.c.ZkStateReader A cluster state change: [WatchedEvent state:SyncConnected type:NodeDataChanged path:/collections/testschemaapi/state.json] for collection [testschemaapi] has occurred - updating... (live nodes size: [2])
   [junit4]   2> 742976 INFO  (zkCallback-911-thread-1-processing-n:127.0.0.1:43078_solr) [n:127.0.0.1:43078_solr    ] o.a.s.c.c.ZkStateReader A cluster state change: [WatchedEvent state:SyncConnected type:NodeDataChanged path:/collections/testschemaapi/state.json] for collection [testschemaapi] has occurred - updating... (live nodes size: [2])
   [junit4]   2> 742977 INFO  (zkCallback-910-thread-2-processing-n:127.0.0.1:34159_solr) [n:127.0.0.1:34159_solr    ] o.a.s.c.c.ZkStateReader Updating data for [testschemaapi] from [1] to [2]
   [junit4]   2> 742977 INFO  (zkCallback-911-thread-1-processing-n:127.0.0.1:43078_solr) [n:127.0.0.1:43078_solr    ] o.a.s.c.c.ZkStateReader Updating data for [testschemaapi] from [1] to [2]
   [junit4]   2> 743024 INFO  (qtp4763573-5301) [n:127.0.0.1:34159_solr c:testschemaapi s:shard1 r:core_node1 x:testschemaapi_shard1_replica1] o.a.s.c.ZkController We are http://127.0.0.1:34159/solr/testschemaapi_shard1_replica1/ and leader is http://127.0.0.1:34159/solr/testschemaapi_shard1_replica1/
   [junit4]   2> 743025 INFO  (qtp4763573-5301) [n:127.0.0.1:34159_solr c:testschemaapi s:shard1 r:core_node1 x:testschemaapi_shard1_replica1] o.a.s.c.ZkController No LogReplay needed for core=testschemaapi_shard1_replica1 baseURL=http://127.0.0.1:34159/solr
   [junit4]   2> 743025 INFO  (qtp4763573-5301) [n:127.0.0.1:34159_solr c:testschemaapi s:shard1 r:core_node1 x:testschemaapi_shard1_replica1] o.a.s.c.ZkController I am the leader, no recovery necessary
   [junit4]   2> 743025 INFO  (qtp4763573-5301) [n:127.0.0.1:34159_solr c:testschemaapi s:shard1 r:core_node1 x:testschemaapi_shard1_replica1] o.a.s.c.ZkController publishing state=active
   [junit4]   2> 743026 INFO  (OverseerStateUpdate-96098283897946117-127.0.0.1:34159_solr-n_0000000000) [n:127.0.0.1:34159_solr    ] o.a.s.c.Overseer processMessage: queueSize: 1, message = {
   [junit4]   2>   "core":"testschemaapi_shard1_replica1",
   [junit4]   2>   "core_node_name":"core_node1",
   [junit4]   2>   "roles":null,
   [junit4]   2>   "base_url":"http://127.0.0.1:34159/solr",
   [junit4]   2>   "node_name":"127.0.0.1:34159_solr",
   [junit4]   2>   "numShards":"1",
   [junit4]   2>   "state":"active",
   [junit4]   2>   "shard":"shard1",
   [junit4]   2>   "collection":"testschemaapi",
   [junit4]   2>   "operation":"state"} current state version: 0
   [junit4]   2> 743026 INFO  (OverseerStateUpdate-96098283897946117-127.0.0.1:34159_solr-n_0000000000) [n:127.0.0.1:34159_solr    ] o.a.s.c.o.ReplicaMutator Update state numShards=1 message={
   [junit4]   2>   "core":"testschemaapi_shard1_replica1",
   [junit4]   2>   "core_node_name":"core_node1",
   [junit4]   2>   "roles":null,
   [junit4]   2>   "base_url":"http://127.0.0.1:34159/solr",
   [junit4]   2>   "node_name":"127.0.0.1:34159_solr",
   [junit4]   2>   "numShards":"1",
   [junit4]   2>   "state":"active",
   [junit4]   2>   "shard":"shard1",
   [junit4]   2>   "collection":"testschemaapi",
   [junit4]   2>   "operation":"state"}
   [junit4]   2> 743027 INFO  (qtp4763573-5301) [n:127.0.0.1:34159_solr c:testschemaapi s:shard1 r:core_node1 x:testschemaapi_shard1_replica1] o.a.s.s.HttpSolrCall [admin] webapp=null path=/admin/cores params={qt=/admin/cores&collection.configName=conf1&name=testschemaapi_shard

[...truncated too long message...]

/collection-queue-work
   [junit4]   2> 	4	/solr/overseer/queue-work
   [junit4]   2> 	3	/solr/live_nodes
   [junit4]   2> 	3	/solr/collections
   [junit4]   2> 
   [junit4]   2> 754670 INFO  (SUITE-TestManagedSchemaAPI-seed#[EFE60EE1E8DAC4CE]-worker) [    ] o.a.s.SolrTestCaseJ4 ###deleteCore
   [junit4]   2> NOTE: leaving temporary files on disk at: /home/jenkins/workspace/Lucene-Solr-6.x-Linux/solr/build/solr-core/test/J0/temp/solr.schema.TestManagedSchemaAPI_EFE60EE1E8DAC4CE-001
   [junit4]   2> Jun 19, 2016 1:37:37 PM com.carrotsearch.randomizedtesting.ThreadLeakControl checkThreadLeaks
   [junit4]   2> WARNING: Will linger awaiting termination of 3 leaked thread(s).
   [junit4]   2> 764660 WARN  (Thread-1975) [n:127.0.0.1:43078_solr    ] o.a.s.c.ZkController listener throws error
   [junit4]   2> org.apache.solr.common.SolrException: Unable to reload core [testschemaapi_shard1_replica2]
   [junit4]   2> 	at org.apache.solr.core.CoreContainer.reload(CoreContainer.java:919)
   [junit4]   2> 	at org.apache.solr.core.SolrCore.lambda$getConfListener$6(SolrCore.java:2509)
   [junit4]   2> 	at org.apache.solr.cloud.ZkController$4.run(ZkController.java:2405)
   [junit4]   2> Caused by: org.apache.solr.common.SolrException: Could not load conf for core testschemaapi_shard1_replica2: Unable to load reader for ConfigSet properties: configsetprops.json
   [junit4]   2> 	at org.apache.solr.core.ConfigSetService.getConfig(ConfigSetService.java:85)
   [junit4]   2> 	at org.apache.solr.core.CoreContainer.reload(CoreContainer.java:911)
   [junit4]   2> 	... 2 more
   [junit4]   2> Caused by: org.apache.solr.common.SolrException: Unable to load reader for ConfigSet properties: configsetprops.json
   [junit4]   2> 	at org.apache.solr.core.ConfigSetProperties.readFromResourceLoader(ConfigSetProperties.java:57)
   [junit4]   2> 	at org.apache.solr.core.ConfigSetService.createConfigSetProperties(ConfigSetService.java:117)
   [junit4]   2> 	at org.apache.solr.core.ConfigSetService.getConfig(ConfigSetService.java:79)
   [junit4]   2> 	... 3 more
   [junit4]   2> Caused by: java.io.IOException: We re-tried 10 times but was still unable to fetch resource=configsetprops.json from ZK
   [junit4]   2> 	at org.apache.solr.cloud.ZkSolrResourceLoader.openResource(ZkSolrResourceLoader.java:116)
   [junit4]   2> 	at org.apache.solr.core.ConfigSetProperties.readFromResourceLoader(ConfigSetProperties.java:52)
   [junit4]   2> 	... 5 more
   [junit4]   2> Caused by: org.apache.zookeeper.KeeperException$SessionExpiredException: KeeperErrorCode = Session expired for /configs/conf1/configsetprops.json
   [junit4]   2> 	at org.apache.zookeeper.KeeperException.create(KeeperException.java:127)
   [junit4]   2> 	at org.apache.zookeeper.KeeperException.create(KeeperException.java:51)
   [junit4]   2> 	at org.apache.zookeeper.ZooKeeper.exists(ZooKeeper.java:1045)
   [junit4]   2> 	at org.apache.solr.common.cloud.SolrZkClient$5.execute(SolrZkClient.java:313)
   [junit4]   2> 	at org.apache.solr.common.cloud.SolrZkClient$5.execute(SolrZkClient.java:310)
   [junit4]   2> 	at org.apache.solr.common.cloud.ZkCmdExecutor.retryOperation(ZkCmdExecutor.java:60)
   [junit4]   2> 	at org.apache.solr.common.cloud.SolrZkClient.exists(SolrZkClient.java:310)
   [junit4]   2> 	at org.apache.solr.cloud.ZkController.pathExists(ZkController.java:793)
   [junit4]   2> 	at org.apache.solr.cloud.ZkSolrResourceLoader.openResource(ZkSolrResourceLoader.java:89)
   [junit4]   2> 	... 6 more
   [junit4]   2> 764660 WARN  (Thread-1976) [n:127.0.0.1:34159_solr    ] o.a.s.c.ZkController listener throws error
   [junit4]   2> org.apache.solr.common.SolrException: Unable to reload core [testschemaapi_shard1_replica1]
   [junit4]   2> 	at org.apache.solr.core.CoreContainer.reload(CoreContainer.java:919)
   [junit4]   2> 	at org.apache.solr.core.SolrCore.lambda$getConfListener$6(SolrCore.java:2509)
   [junit4]   2> 	at org.apache.solr.cloud.ZkController$4.run(ZkController.java:2405)
   [junit4]   2> Caused by: org.apache.solr.common.SolrException: Could not load conf for core testschemaapi_shard1_replica1: Unable to load reader for ConfigSet properties: configsetprops.json
   [junit4]   2> 	at org.apache.solr.core.ConfigSetService.getConfig(ConfigSetService.java:85)
   [junit4]   2> 	at org.apache.solr.core.CoreContainer.reload(CoreContainer.java:911)
   [junit4]   2> 	... 2 more
   [junit4]   2> Caused by: org.apache.solr.common.SolrException: Unable to load reader for ConfigSet properties: configsetprops.json
   [junit4]   2> 	at org.apache.solr.core.ConfigSetProperties.readFromResourceLoader(ConfigSetProperties.java:57)
   [junit4]   2> 	at org.apache.solr.core.ConfigSetService.createConfigSetProperties(ConfigSetService.java:117)
   [junit4]   2> 	at org.apache.solr.core.ConfigSetService.getConfig(ConfigSetService.java:79)
   [junit4]   2> 	... 3 more
   [junit4]   2> Caused by: java.io.IOException: We re-tried 10 times but was still unable to fetch resource=configsetprops.json from ZK
   [junit4]   2> 	at org.apache.solr.cloud.ZkSolrResourceLoader.openResource(ZkSolrResourceLoader.java:116)
   [junit4]   2> 	at org.apache.solr.core.ConfigSetProperties.readFromResourceLoader(ConfigSetProperties.java:52)
   [junit4]   2> 	... 5 more
   [junit4]   2> Caused by: org.apache.zookeeper.KeeperException$SessionExpiredException: KeeperErrorCode = Session expired for /configs/conf1/configsetprops.json
   [junit4]   2> 	at org.apache.zookeeper.KeeperException.create(KeeperException.java:127)
   [junit4]   2> 	at org.apache.zookeeper.KeeperException.create(KeeperException.java:51)
   [junit4]   2> 	at org.apache.zookeeper.ZooKeeper.exists(ZooKeeper.java:1045)
   [junit4]   2> 	at org.apache.solr.common.cloud.SolrZkClient$5.execute(SolrZkClient.java:313)
   [junit4]   2> 	at org.apache.solr.common.cloud.SolrZkClient$5.execute(SolrZkClient.java:310)
   [junit4]   2> 	at org.apache.solr.common.cloud.ZkCmdExecutor.retryOperation(ZkCmdExecutor.java:60)
   [junit4]   2> 	at org.apache.solr.common.cloud.SolrZkClient.exists(SolrZkClient.java:310)
   [junit4]   2> 	at org.apache.solr.cloud.ZkController.pathExists(ZkController.java:793)
   [junit4]   2> 	at org.apache.solr.cloud.ZkSolrResourceLoader.openResource(ZkSolrResourceLoader.java:89)
   [junit4]   2> 	... 6 more
   [junit4]   2> NOTE: test params are: codec=Asserting(Lucene62): {_version_=FST50, id=PostingsFormat(name=Asserting), myNewField=FST50}, docValues:{}, maxPointsInLeafNode=641, maxMBSortInHeap=7.273002335446101, sim=RandomSimilarity(queryNorm=true,coord=crazy): {}, locale=da-DK, timezone=America/Dominica
   [junit4]   2> NOTE: Linux 4.4.0-24-generic i386/Oracle Corporation 1.8.0_92 (32-bit)/cpus=12,threads=1,free=122321584,total=243933184
   [junit4]   2> NOTE: All tests run in this JVM: [SolrCloudExampleTest, ZkNodePropsTest, TestSizeLimitedDistributedMap, QueryElevationComponentTest, QueryEqualityTest, QueryResultKeyTest, TestJsonFacets, TestLegacyFieldCache, CdcrVersionReplicationTest, ReplicationFactorTest, JavabinLoaderTest, TestJoin, TestSortByMinMaxFunction, TestComponentsName, TestBadConfig, SmileWriterTest, CdcrUpdateLogTest, DistributedQueryElevationComponentTest, TestSQLHandler, ActionThrottleTest, TestPerFieldSimilarityWithDefaultOverride, DeleteLastCustomShardedReplicaTest, TestIBSimilarityFactory, TestSolr4Spatial, TestStressLucene, TestMiniSolrCloudClusterSSL, LeaderInitiatedRecoveryOnCommitTest, CreateCollectionCleanupTest, TestHashQParserPlugin, PrimUtilsTest, TestLRUStatsCache, TestDistribDocBasedVersion, TestBulkSchemaConcurrent, TestHighlightDedupGrouping, TestLRUCache, TestConfigSetProperties, TestPseudoReturnFields, SolrRequestParserTest, HdfsUnloadDistributedZkTest, DistributedFacetPivotLongTailTest, SharedFSAutoReplicaFailoverTest, SSLMigrationTest, TestMergePolicyConfig, HdfsLockFactoryTest, TestDistributedSearch, JSONWriterTest, TestRTGBase, DeleteStatusTest, ResourceLoaderTest, TestAnalyzeInfixSuggestions, TestStressUserVersions, TestSha256AuthenticationProvider, TestUseDocValuesAsStored2, SortSpecParsingTest, TestFastOutputStream, SuggestComponentContextFilterQueryTest, DistributedDebugComponentTest, CopyFieldTest, TestRandomDVFaceting, UUIDFieldTest, BlockJoinFacetRandomTest, TestBulkSchemaAPI, TestLeaderElectionZkExpiry, TestSubQueryTransformer, DisMaxRequestHandlerTest, TestLazyCores, TestCloudSchemaless, OutputWriterTest, BlobRepositoryCloudTest, URLClassifyProcessorTest, CloneFieldUpdateProcessorFactoryTest, TolerantUpdateProcessorTest, CoreAdminCreateDiscoverTest, StandardRequestHandlerTest, HdfsRecoverLeaseTest, PathHierarchyTokenizerFactoryTest, CursorPagingTest, BasicZkTest, TestManagedSchemaAPI]
   [junit4] Completed [198/615 (1!)] on J0 in 24.27s, 1 test, 1 error <<< FAILURES!

[...truncated 1356 lines...]
BUILD FAILED
/home/jenkins/workspace/Lucene-Solr-6.x-Linux/build.xml:740: The following error occurred while executing this line:
/home/jenkins/workspace/Lucene-Solr-6.x-Linux/build.xml:684: The following error occurred while executing this line:
/home/jenkins/workspace/Lucene-Solr-6.x-Linux/build.xml:59: The following error occurred while executing this line:
/home/jenkins/workspace/Lucene-Solr-6.x-Linux/solr/build.xml:233: The following error occurred while executing this line:
/home/jenkins/workspace/Lucene-Solr-6.x-Linux/solr/common-build.xml:531: The following error occurred while executing this line:
/home/jenkins/workspace/Lucene-Solr-6.x-Linux/lucene/common-build.xml:1427: The following error occurred while executing this line:
/home/jenkins/workspace/Lucene-Solr-6.x-Linux/lucene/common-build.xml:984: There were test failures: 615 suites (10 ignored), 2591 tests, 1 error, 116 ignored (72 assumptions) [seed: EFE60EE1E8DAC4CE]

Total time: 70 minutes 39 seconds
Build step 'Invoke Ant' marked build as failure
Archiving artifacts
[WARNINGS] Skipping publisher since build result is FAILURE
Recording test results
Email was triggered for: Failure - Any
Sending email for trigger: Failure - Any