You are viewing a plain text version of this content. The canonical link for it is here.
Posted to dev@lucene.apache.org by Apache Jenkins Server <je...@builds.apache.org> on 2013/06/12 12:34:18 UTC

[JENKINS] Lucene-Solr-Tests-4.x-Java6 - Build # 1703 - Failure

Build: https://builds.apache.org/job/Lucene-Solr-Tests-4.x-Java6/1703/

1 tests failed.
REGRESSION:  org.apache.solr.cloud.SyncSliceTest.testDistribSearch

Error Message:
shard1 is not consistent.  Got 305 from http://127.0.0.1:39279/sbp/vt/collection1lastClient and got 5 from http://127.0.0.1:39307/sbp/vt/collection1

Stack Trace:
java.lang.AssertionError: shard1 is not consistent.  Got 305 from http://127.0.0.1:39279/sbp/vt/collection1lastClient and got 5 from http://127.0.0.1:39307/sbp/vt/collection1
	at __randomizedtesting.SeedInfo.seed([7D15A019C63B019C:FCF32E01B16461A0]:0)
	at org.junit.Assert.fail(Assert.java:93)
	at org.apache.solr.cloud.AbstractFullDistribZkTestBase.checkShardConsistency(AbstractFullDistribZkTestBase.java:963)
	at org.apache.solr.cloud.SyncSliceTest.doTest(SyncSliceTest.java:238)
	at org.apache.solr.BaseDistributedSearchTestCase.testDistribSearch(BaseDistributedSearchTestCase.java:815)
	at sun.reflect.NativeMethodAccessorImpl.invoke0(Native Method)
	at sun.reflect.NativeMethodAccessorImpl.invoke(NativeMethodAccessorImpl.java:57)
	at sun.reflect.DelegatingMethodAccessorImpl.invoke(DelegatingMethodAccessorImpl.java:43)
	at java.lang.reflect.Method.invoke(Method.java:616)
	at com.carrotsearch.randomizedtesting.RandomizedRunner.invoke(RandomizedRunner.java:1559)
	at com.carrotsearch.randomizedtesting.RandomizedRunner.access$600(RandomizedRunner.java:79)
	at com.carrotsearch.randomizedtesting.RandomizedRunner$6.evaluate(RandomizedRunner.java:737)
	at com.carrotsearch.randomizedtesting.RandomizedRunner$7.evaluate(RandomizedRunner.java:773)
	at com.carrotsearch.randomizedtesting.RandomizedRunner$8.evaluate(RandomizedRunner.java:787)
	at com.carrotsearch.randomizedtesting.rules.SystemPropertiesRestoreRule$1.evaluate(SystemPropertiesRestoreRule.java:53)
	at org.apache.lucene.util.TestRuleSetupTeardownChained$1.evaluate(TestRuleSetupTeardownChained.java:50)
	at org.apache.lucene.util.TestRuleFieldCacheSanity$1.evaluate(TestRuleFieldCacheSanity.java:51)
	at org.apache.lucene.util.AbstractBeforeAfterRule$1.evaluate(AbstractBeforeAfterRule.java:46)
	at com.carrotsearch.randomizedtesting.rules.SystemPropertiesInvariantRule$1.evaluate(SystemPropertiesInvariantRule.java:55)
	at org.apache.lucene.util.TestRuleThreadAndTestName$1.evaluate(TestRuleThreadAndTestName.java:49)
	at org.apache.lucene.util.TestRuleIgnoreAfterMaxFailures$1.evaluate(TestRuleIgnoreAfterMaxFailures.java:70)
	at org.apache.lucene.util.TestRuleMarkFailure$1.evaluate(TestRuleMarkFailure.java:48)
	at com.carrotsearch.randomizedtesting.rules.StatementAdapter.evaluate(StatementAdapter.java:36)
	at com.carrotsearch.randomizedtesting.ThreadLeakControl$StatementRunner.run(ThreadLeakControl.java:358)
	at com.carrotsearch.randomizedtesting.ThreadLeakControl.forkTimeoutingTask(ThreadLeakControl.java:782)
	at com.carrotsearch.randomizedtesting.ThreadLeakControl$3.evaluate(ThreadLeakControl.java:442)
	at com.carrotsearch.randomizedtesting.RandomizedRunner.runSingleTest(RandomizedRunner.java:746)
	at com.carrotsearch.randomizedtesting.RandomizedRunner$3.evaluate(RandomizedRunner.java:648)
	at com.carrotsearch.randomizedtesting.RandomizedRunner$4.evaluate(RandomizedRunner.java:682)
	at com.carrotsearch.randomizedtesting.RandomizedRunner$5.evaluate(RandomizedRunner.java:693)
	at com.carrotsearch.randomizedtesting.rules.StatementAdapter.evaluate(StatementAdapter.java:36)
	at com.carrotsearch.randomizedtesting.rules.SystemPropertiesRestoreRule$1.evaluate(SystemPropertiesRestoreRule.java:53)
	at org.apache.lucene.util.AbstractBeforeAfterRule$1.evaluate(AbstractBeforeAfterRule.java:46)
	at org.apache.lucene.util.TestRuleStoreClassName$1.evaluate(TestRuleStoreClassName.java:42)
	at com.carrotsearch.randomizedtesting.rules.SystemPropertiesInvariantRule$1.evaluate(SystemPropertiesInvariantRule.java:55)
	at com.carrotsearch.randomizedtesting.rules.NoShadowingOrOverridesOnMethodsRule$1.evaluate(NoShadowingOrOverridesOnMethodsRule.java:39)
	at com.carrotsearch.randomizedtesting.rules.NoShadowingOrOverridesOnMethodsRule$1.evaluate(NoShadowingOrOverridesOnMethodsRule.java:39)
	at com.carrotsearch.randomizedtesting.rules.StatementAdapter.evaluate(StatementAdapter.java:36)
	at org.apache.lucene.util.TestRuleAssertionsRequired$1.evaluate(TestRuleAssertionsRequired.java:43)
	at org.apache.lucene.util.TestRuleMarkFailure$1.evaluate(TestRuleMarkFailure.java:48)
	at org.apache.lucene.util.TestRuleIgnoreAfterMaxFailures$1.evaluate(TestRuleIgnoreAfterMaxFailures.java:70)
	at org.apache.lucene.util.TestRuleIgnoreTestSuites$1.evaluate(TestRuleIgnoreTestSuites.java:55)
	at com.carrotsearch.randomizedtesting.rules.StatementAdapter.evaluate(StatementAdapter.java:36)
	at com.carrotsearch.randomizedtesting.ThreadLeakControl$StatementRunner.run(ThreadLeakControl.java:358)
	at java.lang.Thread.run(Thread.java:679)




Build Log:
[...truncated 9240 lines...]
[junit4:junit4] Suite: org.apache.solr.cloud.SyncSliceTest
[junit4:junit4]   2> 957839 T2599 oas.BaseDistributedSearchTestCase.initHostContext Setting hostContext system property: /sbp/vt
[junit4:junit4]   2> 957844 T2599 oas.SolrTestCaseJ4.setUp ###Starting testDistribSearch
[junit4:junit4]   2> Creating dataDir: /usr/home/hudson/hudson-slave/workspace/Lucene-Solr-Tests-4.x-Java6/solr/build/solr-core/test/J1/./solrtest-SyncSliceTest-1371032070401
[junit4:junit4]   2> 957846 T2599 oasc.ZkTestServer.run STARTING ZK TEST SERVER
[junit4:junit4]   2> 957846 T2600 oasc.ZkTestServer$ZKServerMain.runFromConfig Starting server
[junit4:junit4]   2> 957947 T2599 oasc.ZkTestServer.run start zk server on port:59366
[junit4:junit4]   2> 957948 T2599 oascc.ConnectionManager.waitForConnected Waiting for client to connect to ZooKeeper
[junit4:junit4]   2> 957951 T2606 oascc.ConnectionManager.process Watcher org.apache.solr.common.cloud.ConnectionManager@1278ec1d name:ZooKeeperConnection Watcher:127.0.0.1:59366 got event WatchedEvent state:SyncConnected type:None path:null path:null type:None
[junit4:junit4]   2> 957951 T2599 oascc.ConnectionManager.waitForConnected Client is connected to ZooKeeper
[junit4:junit4]   2> 957952 T2599 oascc.SolrZkClient.makePath makePath: /solr
[junit4:junit4]   2> 957964 T2599 oascc.ConnectionManager.waitForConnected Waiting for client to connect to ZooKeeper
[junit4:junit4]   2> 957966 T2608 oascc.ConnectionManager.process Watcher org.apache.solr.common.cloud.ConnectionManager@96ced27 name:ZooKeeperConnection Watcher:127.0.0.1:59366/solr got event WatchedEvent state:SyncConnected type:None path:null path:null type:None
[junit4:junit4]   2> 957966 T2599 oascc.ConnectionManager.waitForConnected Client is connected to ZooKeeper
[junit4:junit4]   2> 957967 T2599 oascc.SolrZkClient.makePath makePath: /collections/collection1
[junit4:junit4]   2> 957976 T2599 oascc.SolrZkClient.makePath makePath: /collections/collection1/shards
[junit4:junit4]   2> 957979 T2599 oascc.SolrZkClient.makePath makePath: /collections/control_collection
[junit4:junit4]   2> 957981 T2599 oascc.SolrZkClient.makePath makePath: /collections/control_collection/shards
[junit4:junit4]   2> 957989 T2599 oasc.AbstractZkTestCase.putConfig put /usr/home/hudson/hudson-slave/workspace/Lucene-Solr-Tests-4.x-Java6/solr/build/solr-core/test-files/solr/collection1/conf/solrconfig-tlog.xml to /configs/conf1/solrconfig.xml
[junit4:junit4]   2> 957990 T2599 oascc.SolrZkClient.makePath makePath: /configs/conf1/solrconfig.xml
[junit4:junit4]   2> 958003 T2599 oasc.AbstractZkTestCase.putConfig put /usr/home/hudson/hudson-slave/workspace/Lucene-Solr-Tests-4.x-Java6/solr/build/solr-core/test-files/solr/collection1/conf/schema.xml to /configs/conf1/schema.xml
[junit4:junit4]   2> 958003 T2599 oascc.SolrZkClient.makePath makePath: /configs/conf1/schema.xml
[junit4:junit4]   2> 958107 T2599 oasc.AbstractZkTestCase.putConfig put /usr/home/hudson/hudson-slave/workspace/Lucene-Solr-Tests-4.x-Java6/solr/build/solr-core/test-files/solr/collection1/conf/stopwords.txt to /configs/conf1/stopwords.txt
[junit4:junit4]   2> 958108 T2599 oascc.SolrZkClient.makePath makePath: /configs/conf1/stopwords.txt
[junit4:junit4]   2> 958111 T2599 oasc.AbstractZkTestCase.putConfig put /usr/home/hudson/hudson-slave/workspace/Lucene-Solr-Tests-4.x-Java6/solr/build/solr-core/test-files/solr/collection1/conf/protwords.txt to /configs/conf1/protwords.txt
[junit4:junit4]   2> 958112 T2599 oascc.SolrZkClient.makePath makePath: /configs/conf1/protwords.txt
[junit4:junit4]   2> 958122 T2599 oasc.AbstractZkTestCase.putConfig put /usr/home/hudson/hudson-slave/workspace/Lucene-Solr-Tests-4.x-Java6/solr/build/solr-core/test-files/solr/collection1/conf/currency.xml to /configs/conf1/currency.xml
[junit4:junit4]   2> 958123 T2599 oascc.SolrZkClient.makePath makePath: /configs/conf1/currency.xml
[junit4:junit4]   2> 958126 T2599 oasc.AbstractZkTestCase.putConfig put /usr/home/hudson/hudson-slave/workspace/Lucene-Solr-Tests-4.x-Java6/solr/build/solr-core/test-files/solr/collection1/conf/open-exchange-rates.json to /configs/conf1/open-exchange-rates.json
[junit4:junit4]   2> 958127 T2599 oascc.SolrZkClient.makePath makePath: /configs/conf1/open-exchange-rates.json
[junit4:junit4]   2> 958130 T2599 oasc.AbstractZkTestCase.putConfig put /usr/home/hudson/hudson-slave/workspace/Lucene-Solr-Tests-4.x-Java6/solr/build/solr-core/test-files/solr/collection1/conf/mapping-ISOLatin1Accent.txt to /configs/conf1/mapping-ISOLatin1Accent.txt
[junit4:junit4]   2> 958130 T2599 oascc.SolrZkClient.makePath makePath: /configs/conf1/mapping-ISOLatin1Accent.txt
[junit4:junit4]   2> 958133 T2599 oasc.AbstractZkTestCase.putConfig put /usr/home/hudson/hudson-slave/workspace/Lucene-Solr-Tests-4.x-Java6/solr/build/solr-core/test-files/solr/collection1/conf/old_synonyms.txt to /configs/conf1/old_synonyms.txt
[junit4:junit4]   2> 958134 T2599 oascc.SolrZkClient.makePath makePath: /configs/conf1/old_synonyms.txt
[junit4:junit4]   2> 958141 T2599 oasc.AbstractZkTestCase.putConfig put /usr/home/hudson/hudson-slave/workspace/Lucene-Solr-Tests-4.x-Java6/solr/build/solr-core/test-files/solr/collection1/conf/synonyms.txt to /configs/conf1/synonyms.txt
[junit4:junit4]   2> 958142 T2599 oascc.SolrZkClient.makePath makePath: /configs/conf1/synonyms.txt
[junit4:junit4]   2> 958397 T2599 oejs.Server.doStart jetty-8.1.10.v20130312
[junit4:junit4]   2> 958402 T2599 oejs.AbstractConnector.doStart Started SocketConnector@127.0.0.1:60562
[junit4:junit4]   2> 958403 T2599 oass.SolrDispatchFilter.init SolrDispatchFilter.init()
[junit4:junit4]   2> 958404 T2599 oasc.SolrResourceLoader.locateSolrHome JNDI not configured for solr (NoInitialContextEx)
[junit4:junit4]   2> 958404 T2599 oasc.SolrResourceLoader.locateSolrHome using system property solr.solr.home: /usr/home/hudson/hudson-slave/workspace/Lucene-Solr-Tests-4.x-Java6/solr/build/solr-core/test/J1/./org.apache.solr.cloud.SyncSliceTest-controljetty-1371032070702
[junit4:junit4]   2> 958404 T2599 oasc.CoreContainer$Initializer.initialize looking for solr config file: /usr/home/hudson/hudson-slave/workspace/Lucene-Solr-Tests-4.x-Java6/solr/build/solr-core/test/J1/./org.apache.solr.cloud.SyncSliceTest-controljetty-1371032070702/solr.xml
[junit4:junit4]   2> 958405 T2599 oasc.CoreContainer.<init> New CoreContainer 1544822024
[junit4:junit4]   2> 958406 T2599 oasc.CoreContainer.load Loading CoreContainer using Solr Home: '/usr/home/hudson/hudson-slave/workspace/Lucene-Solr-Tests-4.x-Java6/solr/build/solr-core/test/J1/./org.apache.solr.cloud.SyncSliceTest-controljetty-1371032070702/'
[junit4:junit4]   2> 958406 T2599 oasc.SolrResourceLoader.<init> new SolrResourceLoader for directory: '/usr/home/hudson/hudson-slave/workspace/Lucene-Solr-Tests-4.x-Java6/solr/build/solr-core/test/J1/./org.apache.solr.cloud.SyncSliceTest-controljetty-1371032070702/'
[junit4:junit4]   2> 958527 T2599 oashc.HttpShardHandlerFactory.getParameter Setting socketTimeout to: 120000
[junit4:junit4]   2> 958528 T2599 oashc.HttpShardHandlerFactory.getParameter Setting urlScheme to: http://
[junit4:junit4]   2> 958528 T2599 oashc.HttpShardHandlerFactory.getParameter Setting connTimeout to: 15000
[junit4:junit4]   2> 958529 T2599 oashc.HttpShardHandlerFactory.getParameter Setting maxConnectionsPerHost to: 20
[junit4:junit4]   2> 958530 T2599 oashc.HttpShardHandlerFactory.getParameter Setting corePoolSize to: 0
[junit4:junit4]   2> 958530 T2599 oashc.HttpShardHandlerFactory.getParameter Setting maximumPoolSize to: 2147483647
[junit4:junit4]   2> 958530 T2599 oashc.HttpShardHandlerFactory.getParameter Setting maxThreadIdleTime to: 5
[junit4:junit4]   2> 958531 T2599 oashc.HttpShardHandlerFactory.getParameter Setting sizeOfQueue to: -1
[junit4:junit4]   2> 958531 T2599 oashc.HttpShardHandlerFactory.getParameter Setting fairnessPolicy to: false
[junit4:junit4]   2> 958532 T2599 oascsi.HttpClientUtil.createClient Creating new http client, config:maxConnectionsPerHost=20&maxConnections=10000&socketTimeout=120000&connTimeout=15000&retry=false
[junit4:junit4]   2> 958549 T2599 oasl.LogWatcher.newRegisteredLogWatcher Registering Log Listener
[junit4:junit4]   2> 958549 T2599 oasc.ZkContainer.initZooKeeper Zookeeper client=127.0.0.1:59366/solr
[junit4:junit4]   2> 958550 T2599 oasc.ZkController.checkChrootPath zkHost includes chroot
[junit4:junit4]   2> 958551 T2599 oascc.ConnectionManager.waitForConnected Waiting for client to connect to ZooKeeper
[junit4:junit4]   2> 958554 T2619 oascc.ConnectionManager.process Watcher org.apache.solr.common.cloud.ConnectionManager@472df117 name:ZooKeeperConnection Watcher:127.0.0.1:59366 got event WatchedEvent state:SyncConnected type:None path:null path:null type:None
[junit4:junit4]   2> 958555 T2599 oascc.ConnectionManager.waitForConnected Client is connected to ZooKeeper
[junit4:junit4]   2> 958564 T2599 oascsi.HttpClientUtil.createClient Creating new http client, config:maxConnections=500&maxConnectionsPerHost=16&socketTimeout=120000&connTimeout=15000
[junit4:junit4]   2> 958575 T2599 oascc.ConnectionManager.waitForConnected Waiting for client to connect to ZooKeeper
[junit4:junit4]   2> 958577 T2621 oascc.ConnectionManager.process Watcher org.apache.solr.common.cloud.ConnectionManager@40df3701 name:ZooKeeperConnection Watcher:127.0.0.1:59366/solr got event WatchedEvent state:SyncConnected type:None path:null path:null type:None
[junit4:junit4]   2> 958577 T2599 oascc.ConnectionManager.waitForConnected Client is connected to ZooKeeper
[junit4:junit4]   2> 958584 T2599 oascc.SolrZkClient.makePath makePath: /overseer/queue
[junit4:junit4]   2> 958588 T2599 oascc.SolrZkClient.makePath makePath: /overseer/collection-queue-work
[junit4:junit4]   2> 958598 T2599 oascc.SolrZkClient.makePath makePath: /live_nodes
[junit4:junit4]   2> 958600 T2599 oasc.ZkController.createEphemeralLiveNode Register node as live in ZooKeeper:/live_nodes/127.0.0.1:60562_sbp%2Fvt
[junit4:junit4]   2> 958608 T2599 oascc.SolrZkClient.makePath makePath: /live_nodes/127.0.0.1:60562_sbp%2Fvt
[junit4:junit4]   2> 958611 T2599 oascc.SolrZkClient.makePath makePath: /overseer_elect/election
[junit4:junit4]   2> 958628 T2599 oascc.SolrZkClient.makePath makePath: /overseer_elect/leader
[junit4:junit4]   2> 958630 T2599 oasc.Overseer.start Overseer (id=89851957766258691-127.0.0.1:60562_sbp%2Fvt-n_0000000000) starting
[junit4:junit4]   2> 958642 T2599 oascc.SolrZkClient.makePath makePath: /overseer/queue-work
[junit4:junit4]   2> 958653 T2623 oasc.OverseerCollectionProcessor.run Process current queue of collection creations
[junit4:junit4]   2> 958654 T2599 oascc.SolrZkClient.makePath makePath: /clusterstate.json
[junit4:junit4]   2> 958657 T2599 oascc.SolrZkClient.makePath makePath: /aliases.json
[junit4:junit4]   2> 958659 T2599 oascc.ZkStateReader.createClusterStateWatchersAndUpdate Updating cluster state from ZooKeeper... 
[junit4:junit4]   2> 958661 T2622 oasc.Overseer$ClusterStateUpdater.run Starting to work on the main queue
[junit4:junit4]   2> 958665 T2624 oasc.ZkController.publish publishing core=collection1 state=down
[junit4:junit4]   2> 958665 T2624 oasc.ZkController.publish numShards not found on descriptor - reading it from system property
[junit4:junit4]   2> 960164 T2622 oascc.ZkStateReader.updateClusterState Updating cloud state from ZooKeeper... 
[junit4:junit4]   2> 960165 T2622 oasc.Overseer$ClusterStateUpdater.updateState Update state numShards=1 message={
[junit4:junit4]   2> 	  "operation":"state",
[junit4:junit4]   2> 	  "core_node_name":null,
[junit4:junit4]   2> 	  "numShards":"1",
[junit4:junit4]   2> 	  "shard":null,
[junit4:junit4]   2> 	  "roles":null,
[junit4:junit4]   2> 	  "state":"down",
[junit4:junit4]   2> 	  "shard_state":"active",
[junit4:junit4]   2> 	  "core":"collection1",
[junit4:junit4]   2> 	  "collection":"control_collection",
[junit4:junit4]   2> 	  "shard_range":null,
[junit4:junit4]   2> 	  "node_name":"127.0.0.1:60562_sbp%2Fvt",
[junit4:junit4]   2> 	  "base_url":"http://127.0.0.1:60562/sbp/vt"}
[junit4:junit4]   2> 960166 T2622 oasc.Overseer$ClusterStateUpdater.createCollection Create collection control_collection with numShards 1
[junit4:junit4]   2> 960166 T2622 oasc.Overseer$ClusterStateUpdater.updateState Assigning new node to shard=shard1
[junit4:junit4]   2> 960180 T2621 oascc.ZkStateReader$2.process A cluster state change: WatchedEvent state:SyncConnected type:NodeDataChanged path:/clusterstate.json, has occurred - updating... (live nodes size: 1)
[junit4:junit4]   2> 960668 T2624 oasc.CoreContainer.create Creating SolrCore 'collection1' using instanceDir: /usr/home/hudson/hudson-slave/workspace/Lucene-Solr-Tests-4.x-Java6/solr/build/solr-core/test/J1/./org.apache.solr.cloud.SyncSliceTest-controljetty-1371032070702/collection1
[junit4:junit4]   2> 960668 T2624 oasc.ZkController.createCollectionZkNode Check for collection zkNode:control_collection
[junit4:junit4]   2> 960669 T2624 oasc.ZkController.createCollectionZkNode Collection zkNode exists
[junit4:junit4]   2> 960669 T2624 oasc.ZkController.readConfigName Load collection config from:/collections/control_collection
[junit4:junit4]   2> 960671 T2624 oasc.SolrResourceLoader.<init> new SolrResourceLoader for directory: '/usr/home/hudson/hudson-slave/workspace/Lucene-Solr-Tests-4.x-Java6/solr/build/solr-core/test/J1/./org.apache.solr.cloud.SyncSliceTest-controljetty-1371032070702/collection1/'
[junit4:junit4]   2> 960672 T2624 oasc.SolrResourceLoader.replaceClassLoader Adding 'file:/usr/home/hudson/hudson-slave/workspace/Lucene-Solr-Tests-4.x-Java6/solr/build/solr-core/test/J1/org.apache.solr.cloud.SyncSliceTest-controljetty-1371032070702/collection1/lib/classes/' to classloader
[junit4:junit4]   2> 960673 T2624 oasc.SolrResourceLoader.replaceClassLoader Adding 'file:/usr/home/hudson/hudson-slave/workspace/Lucene-Solr-Tests-4.x-Java6/solr/build/solr-core/test/J1/org.apache.solr.cloud.SyncSliceTest-controljetty-1371032070702/collection1/lib/README' to classloader
[junit4:junit4]   2> 960727 T2624 oasc.SolrConfig.<init> Using Lucene MatchVersion: LUCENE_44
[junit4:junit4]   2> 960786 T2624 oasc.SolrConfig.<init> Loaded SolrConfig: solrconfig.xml
[junit4:junit4]   2> 960887 T2624 oass.IndexSchema.readSchema Reading Solr Schema from schema.xml
[junit4:junit4]   2> 960893 T2624 oass.IndexSchema.readSchema [collection1] Schema name=test
[junit4:junit4]   2> 961506 T2624 oass.OpenExchangeRatesOrgProvider.init Initialized with rates=open-exchange-rates.json, refreshInterval=1440.
[junit4:junit4]   2> 961519 T2624 oass.IndexSchema.readSchema default search field in schema is text
[junit4:junit4]   2> 961523 T2624 oass.IndexSchema.readSchema unique key field: id
[junit4:junit4]   2> 961536 T2624 oass.FileExchangeRateProvider.reload Reloading exchange rates from file currency.xml
[junit4:junit4]   2> 961541 T2624 oass.FileExchangeRateProvider.reload Reloading exchange rates from file currency.xml
[junit4:junit4]   2> 961546 T2624 oass.OpenExchangeRatesOrgProvider.reload Reloading exchange rates from open-exchange-rates.json
[junit4:junit4]   2> 961546 T2624 oass.OpenExchangeRatesOrgProvider$OpenExchangeRates.<init> WARN Unknown key IMPORTANT NOTE
[junit4:junit4]   2> 961547 T2624 oass.OpenExchangeRatesOrgProvider$OpenExchangeRates.<init> WARN Expected key, got STRING
[junit4:junit4]   2> 961547 T2624 oass.OpenExchangeRatesOrgProvider.reload Reloading exchange rates from open-exchange-rates.json
[junit4:junit4]   2> 961548 T2624 oass.OpenExchangeRatesOrgProvider$OpenExchangeRates.<init> WARN Unknown key IMPORTANT NOTE
[junit4:junit4]   2> 961548 T2624 oass.OpenExchangeRatesOrgProvider$OpenExchangeRates.<init> WARN Expected key, got STRING
[junit4:junit4]   2> 961549 T2624 oasc.SolrCore.initDirectoryFactory solr.NRTCachingDirectoryFactory
[junit4:junit4]   2> 961549 T2624 oasc.SolrCore.<init> [collection1] Opening new SolrCore at /usr/home/hudson/hudson-slave/workspace/Lucene-Solr-Tests-4.x-Java6/solr/build/solr-core/test/J1/./org.apache.solr.cloud.SyncSliceTest-controljetty-1371032070702/collection1/, dataDir=./org.apache.solr.cloud.SyncSliceTest-1371032070401/control/data/
[junit4:junit4]   2> 961549 T2624 oasc.JmxMonitoredMap.<init> JMX monitoring is enabled. Adding Solr mbeans to JMX Server: com.sun.jmx.mbeanserver.JmxMBeanServer@64d22462
[junit4:junit4]   2> 961550 T2624 oasc.SolrCore.initDirectoryFactory solr.NRTCachingDirectoryFactory
[junit4:junit4]   2> 961551 T2624 oasc.CachingDirectoryFactory.get return new directory for /usr/home/hudson/hudson-slave/workspace/Lucene-Solr-Tests-4.x-Java6/solr/build/solr-core/test/J1/org.apache.solr.cloud.SyncSliceTest-1371032070401/control/data
[junit4:junit4]   2> 961552 T2624 oasc.SolrCore.getNewIndexDir New index directory detected: old=null new=./org.apache.solr.cloud.SyncSliceTest-1371032070401/control/data/index/
[junit4:junit4]   2> 961553 T2624 oasc.SolrCore.initIndex WARN [collection1] Solr index directory './org.apache.solr.cloud.SyncSliceTest-1371032070401/control/data/index' doesn't exist. Creating new index...
[junit4:junit4]   2> 961554 T2624 oasc.CachingDirectoryFactory.get return new directory for /usr/home/hudson/hudson-slave/workspace/Lucene-Solr-Tests-4.x-Java6/solr/build/solr-core/test/J1/org.apache.solr.cloud.SyncSliceTest-1371032070401/control/data/index
[junit4:junit4]   2> 961591 T2624 oasc.SolrDeletionPolicy.onCommit SolrDeletionPolicy.onCommit: commits: num=1
[junit4:junit4]   2> 		commit{dir=NRTCachingDirectory(org.apache.lucene.store.NIOFSDirectory@/usr/home/hudson/hudson-slave/workspace/Lucene-Solr-Tests-4.x-Java6/solr/build/solr-core/test/J1/org.apache.solr.cloud.SyncSliceTest-1371032070401/control/data/index lockFactory=org.apache.lucene.store.NativeFSLockFactory@72ebb88e; maxCacheMB=48.0 maxMergeSizeMB=4.0),segFN=segments_1,generation=1}
[junit4:junit4]   2> 961591 T2624 oasc.SolrDeletionPolicy.updateCommits newest commit generation = 1
[junit4:junit4]   2> 961594 T2624 oasup.UpdateRequestProcessorChain.init inserting DistributedUpdateProcessorFactory into updateRequestProcessorChain "dedupe"
[junit4:junit4]   2> 961594 T2624 oasup.UpdateRequestProcessorChain.init inserting DistributedUpdateProcessorFactory into updateRequestProcessorChain "stored_sig"
[junit4:junit4]   2> 961595 T2624 oasup.UpdateRequestProcessorChain.init inserting DistributedUpdateProcessorFactory into updateRequestProcessorChain "distrib-dup-test-chain-implicit"
[junit4:junit4]   2> 961595 T2624 oasc.RequestHandlers.initHandlersFromConfig created standard: solr.StandardRequestHandler
[junit4:junit4]   2> 961596 T2624 oasc.RequestHandlers.initHandlersFromConfig created /get: solr.RealTimeGetHandler
[junit4:junit4]   2> 961596 T2624 oasc.RequestHandlers.initHandlersFromConfig adding lazy requestHandler: solr.ReplicationHandler
[junit4:junit4]   2> 961597 T2624 oasc.RequestHandlers.initHandlersFromConfig created /replication: solr.ReplicationHandler
[junit4:junit4]   2> 961597 T2624 oasc.RequestHandlers.initHandlersFromConfig created /update: solr.UpdateRequestHandler
[junit4:junit4]   2> 961597 T2624 oasc.RequestHandlers.initHandlersFromConfig created /admin/: org.apache.solr.handler.admin.AdminHandlers
[junit4:junit4]   2> 961607 T2624 oashl.XMLLoader.init xsltCacheLifetimeSeconds=60
[junit4:junit4]   2> 961616 T2624 oass.SolrIndexSearcher.<init> Opening Searcher@682b222b main
[junit4:junit4]   2> 961617 T2624 oasu.CommitTracker.<init> Hard AutoCommit: disabled
[junit4:junit4]   2> 961618 T2624 oasu.CommitTracker.<init> Soft AutoCommit: disabled
[junit4:junit4]   2> 961621 T2625 oasc.SolrCore.registerSearcher [collection1] Registered new searcher Searcher@682b222b main{StandardDirectoryReader(segments_1:1)}
[junit4:junit4]   2> 961623 T2624 oasc.CoreContainer.registerCore registering core: collection1
[junit4:junit4]   2> 961623 T2624 oasc.ZkController.register Register replica - core:collection1 address:http://127.0.0.1:60562/sbp/vt collection:control_collection shard:shard1
[junit4:junit4]   2> 961624 T2624 oascc.SolrZkClient.makePath makePath: /collections/control_collection/leader_elect/shard1/election
[junit4:junit4]   2> 961640 T2624 oasc.ShardLeaderElectionContext.runLeaderProcess Running the leader process.
[junit4:junit4]   2> 961651 T2624 oasc.ShardLeaderElectionContext.waitForReplicasToComeUp Enough replicas found to continue.
[junit4:junit4]   2> 961651 T2624 oasc.ShardLeaderElectionContext.runLeaderProcess I may be the new leader - try and sync
[junit4:junit4]   2> 961651 T2624 oasc.SyncStrategy.sync Sync replicas to http://127.0.0.1:60562/sbp/vt/collection1/
[junit4:junit4]   2> 961652 T2624 oasc.SyncStrategy.syncReplicas Sync Success - now sync replicas to me
[junit4:junit4]   2> 961652 T2624 oasc.SyncStrategy.syncToMe http://127.0.0.1:60562/sbp/vt/collection1/ has no replicas
[junit4:junit4]   2> 961652 T2624 oasc.ShardLeaderElectionContext.runLeaderProcess I am the new leader: http://127.0.0.1:60562/sbp/vt/collection1/
[junit4:junit4]   2> 961653 T2624 oascc.SolrZkClient.makePath makePath: /collections/control_collection/leaders/shard1
[junit4:junit4]   2> 961684 T2622 oascc.ZkStateReader.updateClusterState Updating cloud state from ZooKeeper... 
[junit4:junit4]   2> 961713 T2621 oascc.ZkStateReader$2.process A cluster state change: WatchedEvent state:SyncConnected type:NodeDataChanged path:/clusterstate.json, has occurred - updating... (live nodes size: 1)
[junit4:junit4]   2> 961770 T2624 oasc.ZkController.register We are http://127.0.0.1:60562/sbp/vt/collection1/ and leader is http://127.0.0.1:60562/sbp/vt/collection1/
[junit4:junit4]   2> 961770 T2624 oasc.ZkController.register No LogReplay needed for core=collection1 baseURL=http://127.0.0.1:60562/sbp/vt
[junit4:junit4]   2> 961770 T2624 oasc.ZkController.checkRecovery I am the leader, no recovery necessary
[junit4:junit4]   2> 961770 T2624 oasc.ZkController.publish publishing core=collection1 state=active
[junit4:junit4]   2> 961771 T2624 oasc.ZkController.publish numShards not found on descriptor - reading it from system property
[junit4:junit4]   2> 961772 T2624 oascc.ZkStateReader.updateClusterState Updating cloud state from ZooKeeper... 
[junit4:junit4]   2> 961773 T2599 oass.SolrDispatchFilter.init user.dir=/usr/home/hudson/hudson-slave/workspace/Lucene-Solr-Tests-4.x-Java6/solr/build/solr-core/test/J1
[junit4:junit4]   2> 961774 T2599 oass.SolrDispatchFilter.init SolrDispatchFilter.init() done
[junit4:junit4]   2> 961775 T2599 oascsi.HttpClientUtil.createClient Creating new http client, config:maxConnections=128&maxConnectionsPerHost=32&followRedirects=false
[junit4:junit4]   2> 961790 T2599 oascsi.HttpClientUtil.createClient Creating new http client, config:
[junit4:junit4]   2> 961791 T2599 oascc.ConnectionManager.waitForConnected Waiting for client to connect to ZooKeeper
[junit4:junit4]   2> 961793 T2628 oascc.ConnectionManager.process Watcher org.apache.solr.common.cloud.ConnectionManager@5623b98f name:ZooKeeperConnection Watcher:127.0.0.1:59366/solr got event WatchedEvent state:SyncConnected type:None path:null path:null type:None
[junit4:junit4]   2> 961794 T2599 oascc.ConnectionManager.waitForConnected Client is connected to ZooKeeper
[junit4:junit4]   2> 961796 T2599 oascc.ZkStateReader.createClusterStateWatchersAndUpdate Updating cluster state from ZooKeeper... 
[junit4:junit4]   2> 961798 T2599 oasc.ChaosMonkey.monkeyLog monkey: init - expire sessions:true cause connection loss:true
[junit4:junit4]   2> 962061 T2599 oejs.Server.doStart jetty-8.1.10.v20130312
[junit4:junit4]   2> 962064 T2599 oejs.AbstractConnector.doStart Started SocketConnector@127.0.0.1:52168
[junit4:junit4]   2> 962064 T2599 oass.SolrDispatchFilter.init SolrDispatchFilter.init()
[junit4:junit4]   2> 962065 T2599 oasc.SolrResourceLoader.locateSolrHome JNDI not configured for solr (NoInitialContextEx)
[junit4:junit4]   2> 962065 T2599 oasc.SolrResourceLoader.locateSolrHome using system property solr.solr.home: /usr/home/hudson/hudson-slave/workspace/Lucene-Solr-Tests-4.x-Java6/solr/build/solr-core/test/J1/./org.apache.solr.cloud.SyncSliceTest-jetty1-1371032074354
[junit4:junit4]   2> 962066 T2599 oasc.CoreContainer$Initializer.initialize looking for solr config file: /usr/home/hudson/hudson-slave/workspace/Lucene-Solr-Tests-4.x-Java6/solr/build/solr-core/test/J1/./org.apache.solr.cloud.SyncSliceTest-jetty1-1371032074354/solr.xml
[junit4:junit4]   2> 962066 T2599 oasc.CoreContainer.<init> New CoreContainer 1056627466
[junit4:junit4]   2> 962067 T2599 oasc.CoreContainer.load Loading CoreContainer using Solr Home: '/usr/home/hudson/hudson-slave/workspace/Lucene-Solr-Tests-4.x-Java6/solr/build/solr-core/test/J1/./org.apache.solr.cloud.SyncSliceTest-jetty1-1371032074354/'
[junit4:junit4]   2> 962067 T2599 oasc.SolrResourceLoader.<init> new SolrResourceLoader for directory: '/usr/home/hudson/hudson-slave/workspace/Lucene-Solr-Tests-4.x-Java6/solr/build/solr-core/test/J1/./org.apache.solr.cloud.SyncSliceTest-jetty1-1371032074354/'
[junit4:junit4]   2> 962184 T2599 oashc.HttpShardHandlerFactory.getParameter Setting socketTimeout to: 120000
[junit4:junit4]   2> 962185 T2599 oashc.HttpShardHandlerFactory.getParameter Setting urlScheme to: http://
[junit4:junit4]   2> 962186 T2599 oashc.HttpShardHandlerFactory.getParameter Setting connTimeout to: 15000
[junit4:junit4]   2> 962186 T2599 oashc.HttpShardHandlerFactory.getParameter Setting maxConnectionsPerHost to: 20
[junit4:junit4]   2> 962187 T2599 oashc.HttpShardHandlerFactory.getParameter Setting corePoolSize to: 0
[junit4:junit4]   2> 962187 T2599 oashc.HttpShardHandlerFactory.getParameter Setting maximumPoolSize to: 2147483647
[junit4:junit4]   2> 962188 T2599 oashc.HttpShardHandlerFactory.getParameter Setting maxThreadIdleTime to: 5
[junit4:junit4]   2> 962188 T2599 oashc.HttpShardHandlerFactory.getParameter Setting sizeOfQueue to: -1
[junit4:junit4]   2> 962189 T2599 oashc.HttpShardHandlerFactory.getParameter Setting fairnessPolicy to: false
[junit4:junit4]   2> 962189 T2599 oascsi.HttpClientUtil.createClient Creating new http client, config:maxConnectionsPerHost=20&maxConnections=10000&socketTimeout=120000&connTimeout=15000&retry=false
[junit4:junit4]   2> 962204 T2599 oasl.LogWatcher.newRegisteredLogWatcher Registering Log Listener
[junit4:junit4]   2> 962205 T2599 oasc.ZkContainer.initZooKeeper Zookeeper client=127.0.0.1:59366/solr
[junit4:junit4]   2> 962205 T2599 oasc.ZkController.checkChrootPath zkHost includes chroot
[junit4:junit4]   2> 962206 T2599 oascc.ConnectionManager.waitForConnected Waiting for client to connect to ZooKeeper
[junit4:junit4]   2> 962209 T2639 oascc.ConnectionManager.process Watcher org.apache.solr.common.cloud.ConnectionManager@3dae6d43 name:ZooKeeperConnection Watcher:127.0.0.1:59366 got event WatchedEvent state:SyncConnected type:None path:null path:null type:None
[junit4:junit4]   2> 962210 T2599 oascc.ConnectionManager.waitForConnected Client is connected to ZooKeeper
[junit4:junit4]   2> 962224 T2599 oascsi.HttpClientUtil.createClient Creating new http client, config:maxConnections=500&maxConnectionsPerHost=16&socketTimeout=120000&connTimeout=15000
[junit4:junit4]   2> 962235 T2599 oascc.ConnectionManager.waitForConnected Waiting for client to connect to ZooKeeper
[junit4:junit4]   2> 962237 T2641 oascc.ConnectionManager.process Watcher org.apache.solr.common.cloud.ConnectionManager@2f03c9a2 name:ZooKeeperConnection Watcher:127.0.0.1:59366/solr got event WatchedEvent state:SyncConnected type:None path:null path:null type:None
[junit4:junit4]   2> 962237 T2599 oascc.ConnectionManager.waitForConnected Client is connected to ZooKeeper
[junit4:junit4]   2> 962248 T2599 oascc.ZkStateReader.createClusterStateWatchersAndUpdate Updating cluster state from ZooKeeper... 
[junit4:junit4]   2> 963227 T2622 oascc.ZkStateReader.updateClusterState Updating cloud state from ZooKeeper... 
[junit4:junit4]   2> 963228 T2622 oasc.Overseer$ClusterStateUpdater.updateState Update state numShards=1 message={
[junit4:junit4]   2> 	  "operation":"state",
[junit4:junit4]   2> 	  "core_node_name":"127.0.0.1:60562_sbp%2Fvt_collection1",
[junit4:junit4]   2> 	  "numShards":"1",
[junit4:junit4]   2> 	  "shard":"shard1",
[junit4:junit4]   2> 	  "roles":null,
[junit4:junit4]   2> 	  "state":"active",
[junit4:junit4]   2> 	  "shard_state":"active",
[junit4:junit4]   2> 	  "core":"collection1",
[junit4:junit4]   2> 	  "collection":"control_collection",
[junit4:junit4]   2> 	  "shard_range":null,
[junit4:junit4]   2> 	  "node_name":"127.0.0.1:60562_sbp%2Fvt",
[junit4:junit4]   2> 	  "base_url":"http://127.0.0.1:60562/sbp/vt"}
[junit4:junit4]   2> 963240 T2641 oascc.ZkStateReader$2.process A cluster state change: WatchedEvent state:SyncConnected type:NodeDataChanged path:/clusterstate.json, has occurred - updating... (live nodes size: 1)
[junit4:junit4]   2> 963240 T2628 oascc.ZkStateReader$2.process A cluster state change: WatchedEvent state:SyncConnected type:NodeDataChanged path:/clusterstate.json, has occurred - updating... (live nodes size: 1)
[junit4:junit4]   2> 963240 T2621 oascc.ZkStateReader$2.process A cluster state change: WatchedEvent state:SyncConnected type:NodeDataChanged path:/clusterstate.json, has occurred - updating... (live nodes size: 1)
[junit4:junit4]   2> 963252 T2599 oasc.ZkController.createEphemeralLiveNode Register node as live in ZooKeeper:/live_nodes/127.0.0.1:52168_sbp%2Fvt
[junit4:junit4]   2> 963254 T2599 oascc.SolrZkClient.makePath makePath: /live_nodes/127.0.0.1:52168_sbp%2Fvt
[junit4:junit4]   2> 963256 T2628 oascc.ZkStateReader$3.process Updating live nodes... (2)
[junit4:junit4]   2> 963256 T2621 oascc.ZkStateReader$3.process Updating live nodes... (2)
[junit4:junit4]   2> 963256 T2641 oascc.ZkStateReader$3.process Updating live nodes... (2)
[junit4:junit4]   2> 963256 T2621 oascc.ZkStateReader$2.process A cluster state change: WatchedEvent state:SyncConnected type:NodeChildrenChanged path:/live_nodes, has occurred - updating... (live nodes size: 2)
[junit4:junit4]   2> 963256 T2628 oascc.ZkStateReader$2.process A cluster state change: WatchedEvent state:SyncConnected type:NodeChildrenChanged path:/live_nodes, has occurred - updating... (live nodes size: 2)
[junit4:junit4]   2> 963257 T2641 oascc.ZkStateReader$2.process A cluster state change: WatchedEvent state:SyncConnected type:NodeChildrenChanged path:/live_nodes, has occurred - updating... (live nodes size: 2)
[junit4:junit4]   2> 963263 T2642 oasc.ZkController.publish publishing core=collection1 state=down
[junit4:junit4]   2> 963263 T2642 oasc.ZkController.publish numShards not found on descriptor - reading it from system property
[junit4:junit4]   2> 964745 T2622 oascc.ZkStateReader.updateClusterState Updating cloud state from ZooKeeper... 
[junit4:junit4]   2> 964746 T2622 oasc.Overseer$ClusterStateUpdater.updateState Update state numShards=1 message={
[junit4:junit4]   2> 	  "operation":"state",
[junit4:junit4]   2> 	  "core_node_name":null,
[junit4:junit4]   2> 	  "numShards":"1",
[junit4:junit4]   2> 	  "shard":null,
[junit4:junit4]   2> 	  "roles":null,
[junit4:junit4]   2> 	  "state":"down",
[junit4:junit4]   2> 	  "shard_state":"active",
[junit4:junit4]   2> 	  "core":"collection1",
[junit4:junit4]   2> 	  "collection":"collection1",
[junit4:junit4]   2> 	  "shard_range":null,
[junit4:junit4]   2> 	  "node_name":"127.0.0.1:52168_sbp%2Fvt",
[junit4:junit4]   2> 	  "base_url":"http://127.0.0.1:52168/sbp/vt"}
[junit4:junit4]   2> 964746 T2622 oasc.Overseer$ClusterStateUpdater.createCollection Create collection collection1 with numShards 1
[junit4:junit4]   2> 964747 T2622 oasc.Overseer$ClusterStateUpdater.updateState Assigning new node to shard=shard1
[junit4:junit4]   2> 964761 T2621 oascc.ZkStateReader$2.process A cluster state change: WatchedEvent state:SyncConnected type:NodeDataChanged path:/clusterstate.json, has occurred - updating... (live nodes size: 2)
[junit4:junit4]   2> 964761 T2641 oascc.ZkStateReader$2.process A cluster state change: WatchedEvent state:SyncConnected type:NodeDataChanged path:/clusterstate.json, has occurred - updating... (live nodes size: 2)
[junit4:junit4]   2> 964761 T2628 oascc.ZkStateReader$2.process A cluster state change: WatchedEvent state:SyncConnected type:NodeDataChanged path:/clusterstate.json, has occurred - updating... (live nodes size: 2)
[junit4:junit4]   2> 965266 T2642 oasc.CoreContainer.create Creating SolrCore 'collection1' using instanceDir: /usr/home/hudson/hudson-slave/workspace/Lucene-Solr-Tests-4.x-Java6/solr/build/solr-core/test/J1/./org.apache.solr.cloud.SyncSliceTest-jetty1-1371032074354/collection1
[junit4:junit4]   2> 965266 T2642 oasc.ZkController.createCollectionZkNode Check for collection zkNode:collection1
[junit4:junit4]   2> 965267 T2642 oasc.ZkController.createCollectionZkNode Collection zkNode exists
[junit4:junit4]   2> 965267 T2642 oasc.ZkController.readConfigName Load collection config from:/collections/collection1
[junit4:junit4]   2> 965269 T2642 oasc.SolrResourceLoader.<init> new SolrResourceLoader for directory: '/usr/home/hudson/hudson-slave/workspace/Lucene-Solr-Tests-4.x-Java6/solr/build/solr-core/test/J1/./org.apache.solr.cloud.SyncSliceTest-jetty1-1371032074354/collection1/'
[junit4:junit4]   2> 965270 T2642 oasc.SolrResourceLoader.replaceClassLoader Adding 'file:/usr/home/hudson/hudson-slave/workspace/Lucene-Solr-Tests-4.x-Java6/solr/build/solr-core/test/J1/org.apache.solr.cloud.SyncSliceTest-jetty1-1371032074354/collection1/lib/README' to classloader
[junit4:junit4]   2> 965271 T2642 oasc.SolrResourceLoader.replaceClassLoader Adding 'file:/usr/home/hudson/hudson-slave/workspace/Lucene-Solr-Tests-4.x-Java6/solr/build/solr-core/test/J1/org.apache.solr.cloud.SyncSliceTest-jetty1-1371032074354/collection1/lib/classes/' to classloader
[junit4:junit4]   2> 965326 T2642 oasc.SolrConfig.<init> Using Lucene MatchVersion: LUCENE_44
[junit4:junit4]   2> 965390 T2642 oasc.SolrConfig.<init> Loaded SolrConfig: solrconfig.xml
[junit4:junit4]   2> 965491 T2642 oass.IndexSchema.readSchema Reading Solr Schema from schema.xml
[junit4:junit4]   2> 965497 T2642 oass.IndexSchema.readSchema [collection1] Schema name=test
[junit4:junit4]   2> 966139 T2642 oass.OpenExchangeRatesOrgProvider.init Initialized with rates=open-exchange-rates.json, refreshInterval=1440.
[junit4:junit4]   2> 966152 T2642 oass.IndexSchema.readSchema default search field in schema is text
[junit4:junit4]   2> 966156 T2642 oass.IndexSchema.readSchema unique key field: id
[junit4:junit4]   2> 966169 T2642 oass.FileExchangeRateProvider.reload Reloading exchange rates from file currency.xml
[junit4:junit4]   2> 966174 T2642 oass.FileExchangeRateProvider.reload Reloading exchange rates from file currency.xml
[junit4:junit4]   2> 966178 T2642 oass.OpenExchangeRatesOrgProvider.reload Reloading exchange rates from open-exchange-rates.json
[junit4:junit4]   2> 966180 T2642 oass.OpenExchangeRatesOrgProvider$OpenExchangeRates.<init> WARN Unknown key IMPORTANT NOTE
[junit4:junit4]   2> 966180 T2642 oass.OpenExchangeRatesOrgProvider$OpenExchangeRates.<init> WARN Expected key, got STRING
[junit4:junit4]   2> 966180 T2642 oass.OpenExchangeRatesOrgProvider.reload Reloading exchange rates from open-exchange-rates.json
[junit4:junit4]   2> 966181 T2642 oass.OpenExchangeRatesOrgProvider$OpenExchangeRates.<init> WARN Unknown key IMPORTANT NOTE
[junit4:junit4]   2> 966182 T2642 oass.OpenExchangeRatesOrgProvider$OpenExchangeRates.<init> WARN Expected key, got STRING
[junit4:junit4]   2> 966182 T2642 oasc.SolrCore.initDirectoryFactory solr.NRTCachingDirectoryFactory
[junit4:junit4]   2> 966182 T2642 oasc.SolrCore.<init> [collection1] Opening new SolrCore at /usr/home/hudson/hudson-slave/workspace/Lucene-Solr-Tests-4.x-Java6/solr/build/solr-core/test/J1/./org.apache.solr.cloud.SyncSliceTest-jetty1-1371032074354/collection1/, dataDir=./org.apache.solr.cloud.SyncSliceTest-1371032070401/jetty1/
[junit4:junit4]   2> 966183 T2642 oasc.JmxMonitoredMap.<init> JMX monitoring is enabled. Adding Solr mbeans to JMX Server: com.sun.jmx.mbeanserver.JmxMBeanServer@64d22462
[junit4:junit4]   2> 966183 T2642 oasc.SolrCore.initDirectoryFactory solr.NRTCachingDirectoryFactory
[junit4:junit4]   2> 966184 T2642 oasc.CachingDirectoryFactory.get return new directory for /usr/home/hudson/hudson-slave/workspace/Lucene-Solr-Tests-4.x-Java6/solr/build/solr-core/test/J1/org.apache.solr.cloud.SyncSliceTest-1371032070401/jetty1
[junit4:junit4]   2> 966185 T2642 oasc.SolrCore.getNewIndexDir New index directory detected: old=null new=./org.apache.solr.cloud.SyncSliceTest-1371032070401/jetty1/index/
[junit4:junit4]   2> 966186 T2642 oasc.SolrCore.initIndex WARN [collection1] Solr index directory './org.apache.solr.cloud.SyncSliceTest-1371032070401/jetty1/index' doesn't exist. Creating new index...
[junit4:junit4]   2> 966187 T2642 oasc.CachingDirectoryFactory.get return new directory for /usr/home/hudson/hudson-slave/workspace/Lucene-Solr-Tests-4.x-Java6/solr/build/solr-core/test/J1/org.apache.solr.cloud.SyncSliceTest-1371032070401/jetty1/index
[junit4:junit4]   2> 966197 T2642 oasc.SolrDeletionPolicy.onCommit SolrDeletionPolicy.onCommit: commits: num=1
[junit4:junit4]   2> 		commit{dir=NRTCachingDirectory(org.apache.lucene.store.NIOFSDirectory@/usr/home/hudson/hudson-slave/workspace/Lucene-Solr-Tests-4.x-Java6/solr/build/solr-core/test/J1/org.apache.solr.cloud.SyncSliceTest-1371032070401/jetty1/index lockFactory=org.apache.lucene.store.NativeFSLockFactory@76002e16; maxCacheMB=48.0 maxMergeSizeMB=4.0),segFN=segments_1,generation=1}
[junit4:junit4]   2> 966198 T2642 oasc.SolrDeletionPolicy.updateCommits newest commit generation = 1
[junit4:junit4]   2> 966201 T2642 oasup.UpdateRequestProcessorChain.init inserting DistributedUpdateProcessorFactory into updateRequestProcessorChain "dedupe"
[junit4:junit4]   2> 966201 T2642 oasup.UpdateRequestProcessorChain.init inserting DistributedUpdateProcessorFactory into updateRequestProcessorChain "stored_sig"
[junit4:junit4]   2> 966202 T2642 oasup.UpdateRequestProcessorChain.init inserting DistributedUpdateProcessorFactory into updateRequestProcessorChain "distrib-dup-test-chain-implicit"
[junit4:junit4]   2> 966203 T2642 oasc.RequestHandlers.initHandlersFromConfig created standard: solr.StandardRequestHandler
[junit4:junit4]   2> 966203 T2642 oasc.RequestHandlers.initHandlersFromConfig created /get: solr.RealTimeGetHandler
[junit4:junit4]   2> 966203 T2642 oasc.RequestHandlers.initHandlersFromConfig adding lazy requestHandler: solr.ReplicationHandler
[junit4:junit4]   2> 966204 T2642 oasc.RequestHandlers.initHandlersFromConfig created /replication: solr.ReplicationHandler
[junit4:junit4]   2> 966204 T2642 oasc.RequestHandlers.initHandlersFromConfig created /update: solr.UpdateRequestHandler
[junit4:junit4]   2> 966205 T2642 oasc.RequestHandlers.initHandlersFromConfig created /admin/: org.apache.solr.handler.admin.AdminHandlers
[junit4:junit4]   2> 966214 T2642 oashl.XMLLoader.init xsltCacheLifetimeSeconds=60
[junit4:junit4]   2> 966223 T2642 oass.SolrIndexSearcher.<init> Opening Searcher@2d2993a9 main
[junit4:junit4]   2> 966225 T2642 oasu.CommitTracker.<init> Hard AutoCommit: disabled
[junit4:junit4]   2> 966225 T2642 oasu.CommitTracker.<init> Soft AutoCommit: disabled
[junit4:junit4]   2> 966229 T2643 oasc.SolrCore.registerSearcher [collection1] Registered new searcher Searcher@2d2993a9 main{StandardDirectoryReader(segments_1:1)}
[junit4:junit4]   2> 966231 T2642 oasc.CoreContainer.registerCore registering core: collection1
[junit4:junit4]   2> 966231 T2642 oasc.ZkController.register Register replica - core:collection1 address:http://127.0.0.1:52168/sbp/vt collection:collection1 shard:shard1
[junit4:junit4]   2> 966232 T2642 oascc.SolrZkClient.makePath makePath: /collections/collection1/leader_elect/shard1/election
[junit4:junit4]   2> 966248 T2642 oasc.ShardLeaderElectionContext.runLeaderProcess Running the leader process.
[junit4:junit4]   2> 966259 T2642 oasc.ShardLeaderElectionContext.waitForReplicasToComeUp Enough replicas found to continue.
[junit4:junit4]   2> 966260 T2642 oasc.ShardLeaderElectionContext.runLeaderProcess I may be the new leader - try and sync
[junit4:junit4]   2> 966260 T2642 oasc.SyncStrategy.sync Sync replicas to http://127.0.0.1:52168/sbp/vt/collection1/
[junit4:junit4]   2> 966260 T2642 oasc.SyncStrategy.syncReplicas Sync Success - now sync replicas to me
[junit4:junit4]   2> 966260 T2642 oasc.SyncStrategy.syncToMe http://127.0.0.1:52168/sbp/vt/collection1/ has no replicas
[junit4:junit4]   2> 966261 T2642 oasc.ShardLeaderElectionContext.runLeaderProcess I am the new leader: http://127.0.0.1:52168/sbp/vt/collection1/
[junit4:junit4]   2> 966261 T2642 oascc.SolrZkClient.makePath makePath: /collections/collection1/leaders/shard1
[junit4:junit4]   2> 966274 T2622 oascc.ZkStateReader.updateClusterState Updating cloud state from ZooKeeper... 
[junit4:junit4]   2> 966281 T2641 oascc.ZkStateReader$2.process A cluster state change: WatchedEvent state:SyncConnected type:NodeDataChanged path:/clusterstate.json, has occurred - updating... (live nodes size: 2)
[junit4:junit4]   2> 966281 T2628 oascc.ZkStateReader$2.process A cluster state change: WatchedEvent state:SyncConnected type:NodeDataChanged path:/clusterstate.json, has occurred - updating... (live nodes size: 2)
[junit4:junit4]   2> 966281 T2621 oascc.ZkStateReader$2.process A cluster state change: WatchedEvent state:SyncConnected type:NodeDataChanged path:/clusterstate.json, has occurred - updating... (live nodes size: 2)
[junit4:junit4]   2> 966326 T2642 oasc.ZkController.register We are http://127.0.0.1:52168/sbp/vt/collection1/ and leader is http://127.0.0.1:52168/sbp/vt/collection1/
[junit4:junit4]   2> 966326 T2642 oasc.ZkController.register No LogReplay needed for core=collection1 baseURL=http://127.0.0.1:52168/sbp/vt
[junit4:junit4]   2> 966326 T2642 oasc.ZkController.checkRecovery I am the leader, no recovery necessary
[junit4:junit4]   2> 966326 T2642 oasc.ZkController.publish publishing core=collection1 state=active
[junit4:junit4]   2> 966327 T2642 oasc.ZkController.publish numShards not found on descriptor - reading it from system property
[junit4:junit4]   2> 966328 T2642 oascc.ZkStateReader.updateClusterState Updating cloud state from ZooKeeper... 
[junit4:junit4]   2> 966330 T2599 oass.SolrDispatchFilter.init user.dir=/usr/home/hudson/hudson-slave/workspace/Lucene-Solr-Tests-4.x-Java6/solr/build/solr-core/test/J1
[junit4:junit4]   2> 966330 T2599 oass.SolrDispatchFilter.init SolrDispatchFilter.init() done
[junit4:junit4]   2> 966331 T2599 oascsi.HttpClientUtil.createClient Creating new http client, config:maxConnections=128&maxConnectionsPerHost=32&followRedirects=false
[junit4:junit4]   2> 966598 T2599 oejs.Server.doStart jetty-8.1.10.v20130312
[junit4:junit4]   2> 966601 T2599 oejs.AbstractConnector.doStart Started SocketConnector@127.0.0.1:39271
[junit4:junit4]   2> 966602 T2599 oass.SolrDispatchFilter.init SolrDispatchFilter.init()
[junit4:junit4]   2> 966602 T2599 oasc.SolrResourceLoader.locateSolrHome JNDI not configured for solr (NoInitialContextEx)
[junit4:junit4]   2> 966603 T2599 oasc.SolrResourceLoader.locateSolrHome using system property solr.solr.home: /usr/home/hudson/hudson-slave/workspace/Lucene-Solr-Tests-4.x-Java6/solr/build/solr-core/test/J1/./org.apache.solr.cloud.SyncSliceTest-jetty2-1371032078903
[junit4:junit4]   2> 966604 T2599 oasc.CoreContainer$Initializer.initialize looking for solr config file: /usr/home/hudson/hudson-slave/workspace/Lucene-Solr-Tests-4.x-Java6/solr/build/solr-core/test/J1/./org.apache.solr.cloud.SyncSliceTest-jetty2-1371032078903/solr.xml
[junit4:junit4]   2> 966604 T2599 oasc.CoreContainer.<init> New CoreContainer 1571669858
[junit4:junit4]   2> 966605 T2599 oasc.CoreContainer.load Loading CoreContainer using Solr Home: '/usr/home/hudson/hudson-slave/workspace/Lucene-Solr-Tests-4.x-Java6/solr/build/solr-core/test/J1/./org.apache.solr.cloud.SyncSliceTest-jetty2-1371032078903/'
[junit4:junit4]   2> 966605 T2599 oasc.SolrResourceLoader.<init> new SolrResourceLoader for directory: '/usr/home/hudson/hudson-slave/workspace/Lucene-Solr-Tests-4.x-Java6/solr/build/solr-core/test/J1/./org.apache.solr.cloud.SyncSliceTest-jetty2-1371032078903/'
[junit4:junit4]   2> 966715 T2599 oashc.HttpShardHandlerFactory.getParameter Setting socketTimeout to: 120000
[junit4:junit4]   2> 966715 T2599 oashc.HttpShardHandlerFactory.getParameter Setting urlScheme to: http://
[junit4:junit4]   2> 966716 T2599 oashc.HttpShardHandlerFactory.getParameter Setting connTimeout to: 15000
[junit4:junit4]   2> 966716 T2599 oashc.HttpShardHandlerFactory.getParameter Setting maxConnectionsPerHost to: 20
[junit4:junit4]   2> 966717 T2599 oashc.HttpShardHandlerFactory.getParameter Setting corePoolSize to: 0
[junit4:junit4]   2> 966717 T2599 oashc.HttpShardHandlerFactory.getParameter Setting maximumPoolSize to: 2147483647
[junit4:junit4]   2> 966718 T2599 oashc.HttpShardHandlerFactory.getParameter Setting maxThreadIdleTime to: 5
[junit4:junit4]   2> 966718 T2599 oashc.HttpShardHandlerFactory.getParameter Setting sizeOfQueue to: -1
[junit4:junit4]   2> 966719 T2599 oashc.HttpShardHandlerFactory.getParameter Setting fairnessPolicy to: false
[junit4:junit4]   2> 966719 T2599 oascsi.HttpClientUtil.createClient Creating new http client, config:maxConnectionsPerHost=20&maxConnections=10000&socketTimeout=120000&connTimeout=15000&retry=false
[junit4:junit4]   2> 966736 T2599 oasl.LogWatcher.newRegisteredLogWatcher Registering Log Listener
[junit4:junit4]   2> 966736 T2599 oasc.ZkContainer.initZooKeeper Zookeeper client=127.0.0.1:59366/solr
[junit4:junit4]   2> 966737 T2599 oasc.ZkController.checkChrootPath zkHost includes chroot
[junit4:junit4]   2> 966738 T2599 oascc.ConnectionManager.waitForConnected Waiting for client to connect to ZooKeeper
[junit4:junit4]   2> 966741 T2655 oascc.ConnectionManager.process Watcher org.apache.solr.common.cloud.ConnectionManager@680369da name:ZooKeeperConnection Watcher:127.0.0.1:59366 got event WatchedEvent state:SyncConnected type:None path:null path:null type:None
[junit4:junit4]   2> 966742 T2599 oascc.ConnectionManager.waitForConnected Client is connected to ZooKeeper
[junit4:junit4]   2> 966754 T2599 oascsi.HttpClientUtil.createClient Creating new http client, config:maxConnections=500&maxConnectionsPerHost=16&socketTimeout=120000&connTimeout=15000
[junit4:junit4]   2> 966766 T2599 oascc.ConnectionManager.waitForConnected Waiting for client to connect to ZooKeeper
[junit4:junit4]   2> 966768 T2657 oascc.ConnectionManager.process Watcher org.apache.solr.common.cloud.ConnectionManager@2defac6e name:ZooKeeperConnection Watcher:127.0.0.1:59366/solr got event WatchedEvent state:SyncConnected type:None path:null path:null type:None
[junit4:junit4]   2> 966768 T2599 oascc.ConnectionManager.waitForConnected Client is connected to ZooKeeper
[junit4:junit4]   2> 966780 T2599 oascc.ZkStateReader.createClusterStateWatchersAndUpdate Updating cluster state from ZooKeeper... 
[junit4:junit4]   2> 967783 T2599 oasc.ZkController.createEphemeralLiveNode Register node as live in ZooKeeper:/live_nodes/127.0.0.1:39271_sbp%2Fvt
[junit4:junit4]   2> 967788 T2599 oascc.SolrZkClient.makePath makePath: /live_nodes/127.0.0.1:39271_sbp%2Fvt
[junit4:junit4]   2> 967789 T2622 oascc.ZkStateReader.updateClusterState Updating cloud state from ZooKeeper... 
[junit4:junit4]   2> 967792 T2622 oasc.Overseer$ClusterStateUpdater.updateState Update state numShards=1 message={
[junit4:junit4]   2> 	  "operation":"state",
[junit4:junit4]   2> 	  "core_node_name":"127.0.0.1:52168_sbp%2Fvt_collection1",
[junit4:junit4]   2> 	  "numShards":"1",
[junit4:junit4]   2> 	  "shard":"shard1",
[junit4:junit4]   2> 	  "roles":null,
[junit4:junit4]   2> 	  "state":"active",
[junit4:junit4]   2> 	  "shard_state":"active",
[junit4:junit4]   2> 	  "core":"collection1",
[junit4:junit4]   2> 	  "collection":"collection1",
[junit4:junit4]   2> 	  "shard_range":null,
[junit4:junit4]   2> 	  "node_name":"127.0.0.1:52168_sbp%2Fvt",
[junit4:junit4]   2> 	  "base_url":"http://127.0.0.1:52168/sbp/vt"}
[junit4:junit4]   2> 967792 T2628 oascc.ZkStateReader$3.process Updating live nodes... (3)
[junit4:junit4]   2> 967792 T2657 oascc.ZkStateReader$3.process Updating live nodes... (3)
[junit4:junit4]   2> 967792 T2641 oascc.ZkStateReader$3.process Updating live nodes... (3)
[junit4:junit4]   2> 967792 T2628 oascc.ZkStateReader$2.process A cluster state change: WatchedEvent state:SyncConnected type:NodeChildrenChanged path:/live_nodes, has occurred - updating... (live nodes size: 3)
[junit4:junit4]   2> 967793 T2641 oascc.ZkStateReader$2.process A cluster state change: WatchedEvent state:SyncConnected type:NodeChildrenChanged path:/live_nodes, has occurred - updating... (live nodes size: 3)
[junit4:junit4]   2> 967817 T2641 oascc.ZkStateReader$2.process A cluster state change: WatchedEvent state:SyncConnected type:NodeDataChanged path:/clusterstate.json, has occurred - updating... (live nodes size: 3)
[junit4:junit4]   2> 967817 T2657 oascc.ZkStateReader$2.process A cluster state change: WatchedEvent state:SyncConnected type:NodeDataChanged path:/clusterstate.json, has occurred - updating... (live nodes size: 3)
[junit4:junit4]   2> 967817 T2628 oascc.ZkStateReader$2.process A cluster state change: WatchedEvent state:SyncConnected type:NodeDataChanged path:/clusterstate.json, has occurred - updating... (live nodes size: 3)
[junit4:junit4]   2> 967820 T2621 oascc.ZkStateReader$3.process Updating live nodes... (3)
[junit4:junit4]   2> 967820 T2621 oascc.ZkStateReader$2.process A cluster state change: WatchedEvent state:SyncConnected type:NodeChildrenChanged path:/live_nodes, has occurred - updating... (live nodes size: 3)
[junit4:junit4]   2> 967821 T2621 oascc.ZkStateReader$2.process A cluster state change: WatchedEvent state:SyncConnected type:NodeDataChanged path:/clusterstate.json, has occurred - updating... (live nodes size: 3)
[junit4:junit4]   2> 967822 T2658 oasc.ZkController.publish publishing core=collection1 state=down
[junit4:junit4]   2> 967822 T2658 oasc.ZkController.publish numShards not found on descriptor - reading it from system property
[junit4:junit4]   2> 969322 T2622 oascc.ZkStateReader.updateClusterState Updating cloud state from ZooKeeper... 
[junit4:junit4]   2> 969323 T2622 oasc.Overseer$ClusterStateUpdater.updateState Update state numShards=1 message={
[junit4:junit4]   2> 	  "operation":"state",
[junit4:junit4]   2> 	  "core_node_name":null,
[junit4:junit4]   2> 	  "numShards":"1",
[junit4:junit4]   2> 	  "shard":null,
[junit4:junit4]   2> 	  "roles":null,
[junit4:junit4]   2> 	  "state":"down",
[junit4:junit4]   2> 	  "shard_state":"active",
[junit4:junit4]   2> 	  "core":"collection1",
[junit4:junit4]   2> 	  "collection":"collection1",
[junit4:junit4]   2> 	  "shard_range":null,
[junit4:junit4]   2> 	  "node_name":"127.0.0.1:39271_sbp%2Fvt",
[junit4:junit4]   2> 	  "base_url":"http://127.0.0.1:39271/sbp/vt"}
[junit4:junit4]   2> 969324 T2622 oasc.Overseer$ClusterStateUpdater.updateState Collection already exists with numShards=1
[junit4:junit4]   2> 969324 T2622 oasc.Overseer$ClusterStateUpdater.updateState Assigning new node to shard=shard1
[junit4:junit4]   2> 969338 T2641 oascc.ZkStateReader$2.process A cluster state change: WatchedEvent state:SyncConnected type:NodeDataChanged path:/clusterstate.json, has occurred - updating... (live nodes size: 3)
[junit4:junit4]   2> 969338 T2657 oascc.ZkStateReader$2.process A cluster state change: WatchedEvent state:SyncConnected type:NodeDataChanged path:/clusterstate.json, has occurred - updating... (live nodes size: 3)
[junit4:junit4]   2> 969338 T2628 oascc.ZkStateReader$2.process A cluster state change: WatchedEvent state:SyncConnected type:NodeDataChanged path:/clusterstate.json, has occurred - updating... (live nodes size: 3)
[junit4:junit4]   2> 969338 T2621 oascc.ZkStateReader$2.process A cluster state change: WatchedEvent state:SyncConnected type:NodeDataChanged path:/clusterstate.json, has occurred - updating... (live nodes size: 3)
[junit4:junit4]   2> 969826 T2658 oasc.CoreContainer.create Creating SolrCore 'collection1' using instanceDir: /usr/home/hudson/hudson-slave/workspace/Lucene-Solr-Tests-4.x-Java6/solr/build/solr-core/test/J1/./org.apache.solr.cloud.SyncSliceTest-jetty2-1371032078903/collection1
[junit4:junit4]   2> 969826 T2658 oasc.ZkController.createCollectionZkNode Check for collection zkNode:collection1
[junit4:junit4]   2> 969827 T2658 oasc.ZkController.createCollectionZkNode Collection zkNode exists
[junit4:junit4]   2> 969827 T2658 oasc.ZkController.readConfigName Load collection config from:/collections/collection1
[junit4:junit4]   2> 969828 T2658 oasc.SolrResourceLoader.<init> new SolrResourceLoader for directory: '/usr/home/hudson/hudson-slave/workspace/Lucene-Solr-Tests-4.x-Java6/solr/build/solr-core/test/J1/./org.apache.solr.cloud.SyncSliceTest-jetty2-1371032078903/collection1/'
[junit4:junit4]   2> 969830 T2658 oasc.SolrResourceLoader.replaceClassLoader Adding 'file:/usr/home/hudson/hudson-slave/workspace/Lucene-Solr-Tests-4.x-Java6/solr/build/solr-core/test/J1/org.apache.solr.cloud.SyncSliceTest-jetty2-1371032078903/collection1/lib/README' to classloader
[junit4:junit4]   2> 969830 T2658 oasc.SolrResourceLoader.replaceClassLoader Adding 'file:/usr/home/hudson/hudson-slave/workspace/Lucene-Solr-Tests-4.x-Java6/solr/build/solr-core/test/J1/org.apache.solr.cloud.SyncSliceTest-jetty2-1371032078903/collection1/lib/classes/' to classloader
[junit4:junit4]   2> 969881 T2658 oasc.SolrConfig.<init> Using Lucene MatchVersion: LUCENE_44
[junit4:junit4]   2> 969938 T2658 oasc.SolrConfig.<init> Loaded SolrConfig: solrconfig.xml
[junit4:junit4]   2> 970039 T2658 oass.IndexSchema.readSchema Reading Solr Schema from schema.xml
[junit4:junit4]   2> 970045 T2658 oass.IndexSchema.readSchema [collection1] Schema name=test
[junit4:junit4]   2> 970665 T2658 oass.OpenExchangeRatesOrgProvider.init Initialized with rates=open-exchange-rates.json, refreshInterval=1440.
[junit4:junit4]   2> 970677 T2658 oass.IndexSchema.readSchema default search field in schema is text
[junit4:junit4]   2> 970682 T2658 oass.IndexSchema.readSchema unique key field: id
[junit4:junit4]   2> 970695 T2658 oass.FileExchangeRateProvider.reload Reloading exchange rates from file currency.xml
[junit4:junit4]   2> 970700 T2658 oass.FileExchangeRateProvider.reload Reloading exchange rates from file currency.xml
[junit4:junit4]   2> 970705 T2658 oass.OpenExchangeRatesOrgProvider.reload Reloading exchange rates from open-exchange-rates.json
[junit4:junit4]   2> 970706 T2658 oass.OpenExchangeRatesOrgProvider$OpenExchangeRates.<init> WARN Unknown key IMPORTANT NOTE
[junit4:junit4]   2> 970706 T2658 oass.OpenExchangeRatesOrgProvider$OpenExchangeRates.<init> WARN Expected key, got STRING
[junit4:junit4]   2> 970707 T2658 oass.OpenExchangeRatesOrgProvider.reload Reloading exchange rates from open-exchange-rates.json
[junit4:junit4]   2> 970708 T2658 oass.OpenExchangeRatesOrgProvider$OpenExchangeRates.<init> WARN Unknown key IMPORTANT NOTE
[junit4:junit4]   2> 970708 T2658 oass.OpenExchangeRatesOrgProvider$OpenExchangeRates.<init> WARN Expected key, got STRING
[junit4:junit4]   2> 970708 T2658 oasc.SolrCore.initDirectoryFactory solr.NRTCachingDirectoryFactory
[junit4:junit4]   2> 970709 T2658 oasc.SolrCore.<init> [collection1] Opening new SolrCore at /usr/home/hudson/hudson-slave/workspace/Lucene-Solr-Tests-4.x-Java6/solr/build/solr-core/test/J1/./org.apache.solr.cloud.SyncSliceTest-jetty2-1371032078903/collection1/, dataDir=./org.apache.solr.cloud.SyncSliceTest-1371032070401/jetty2/
[junit4:junit4]   2> 970709 T2658 oasc.JmxMonitoredMap.<init> JMX monitoring is enabled. Adding Solr mbeans to JMX Server: com.sun.jmx.mbeanserver.JmxMBeanServer@64d22462
[junit4:junit4]   2> 970709 T2658 oasc.SolrCore.initDirectoryFactory solr.NRTCachingDirectoryFactory
[junit4:junit4]   2> 970710 T2658 oasc.CachingDirectoryFactory.get return new directory for /usr/home/hudson/hudson-slave/workspace/Lucene-Solr-Tests-4.x-Java6/solr/build/solr-core/test/J1/org.apache.solr.cloud.SyncSliceTest-1371032070401/jetty2
[junit4:junit4]   2> 970711 T2658 oasc.SolrCore.getNewIndexDir New index directory detected: old=null new=./org.apache.solr.cloud.SyncSliceTest-1371032070401/jetty2/index/
[junit4:junit4]   2> 970712 T2658 oasc.SolrCore.initIndex WARN [collection1] Solr index directory './org.apache.solr.cloud.SyncSliceTest-1371032070401/jetty2/index' doesn't exist. Creating new index...
[junit4:junit4]   2> 970713 T2658 oasc.CachingDirectoryFactory.get return new directory for /usr/home/hudson/hudson-slave/workspace/Lucene-Solr-Tests-4.x-Java6/solr/build/solr-core/test/J1/org.apache.solr.cloud.SyncSliceTest-1371032070401/jetty2/index
[junit4:junit4]   2> 970752 T2658 oasc.SolrDeletionPolicy.onCommit SolrDeletionPolicy.onCommit: commits: num=1
[junit4:junit4]   2> 		commit{dir=NRTCachingDirectory(org.apache.lucene.store.NIOFSDirectory@/usr/home/hudson/hudson-slave/workspace/Lucene-Solr-Tests-4.x-Java6/solr/build/solr-core/test/J1/org.apache.solr.cloud.SyncSliceTest-1371032070401/jetty2/index lockFactory=org.apache.lucene.store.NativeFSLockFactory@5ed171d0; maxCacheMB=48.0 maxMergeSizeMB=4.0),segFN=segments_1,generation=1}
[junit4:junit4]   2> 970752 T2658 oasc.SolrDeletionPolicy.updateCommits newest commit generation = 1
[junit4:junit4]   2> 970755 T2658 oasup.UpdateRequestProcessorChain.init inserting DistributedUpdateProcessorFactory into updateRequestProcessorChain "dedupe"
[junit4:junit4]   2> 970755 T2658 oasup.UpdateRequestProcessorChain.init inserting DistributedUpdateProcessorFactory into updateRequestProcessorChain "stored_sig"
[junit4:junit4]   2> 970756 T2658 oasup.UpdateRequestProcessorChain.init inserting DistributedUpdateProcessorFactory into updateRequestProcessorChain "distrib-dup-test-chain-implicit"
[junit4:junit4]   2> 970757 T2658 oasc.RequestHandlers.initHandlersFromConfig created standard: solr.StandardRequestHandler
[junit4:junit4]   2> 970757 T2658 oasc.RequestHandlers.initHandlersFromConfig created /get: solr.RealTimeGetHandler
[junit4:junit4]   2> 970758 T2658 oasc.RequestHandlers.initHandlersFromConfig adding lazy requestHandler: solr.ReplicationHandler
[junit4:junit4]   2> 970758 T2658 oasc.RequestHandlers.initHandlersFromConfig created /replication: solr.ReplicationHandler
[junit4:junit4]   2> 970759 T2658 oasc.RequestHandlers.initHandlersFromConfig created /update: solr.UpdateRequestHandler
[junit4:junit4]   2> 970759 T2658 oasc.RequestHandlers.initHandlersFromConfig created /admin/: org.apache.solr.handler.admin.AdminHandlers
[junit4:junit4]   2> 970769 T2658 oashl.XMLLoader.init xsltCacheLifetimeSeconds=60
[junit4:junit4]   2> 970778 T2658 oass.SolrIndexSearcher.<init> Opening Searcher@3ca6b2e9 main
[junit4:junit4]   2> 970779 T2658 oasu.CommitTracker.<init> Hard AutoCommit: disabled
[junit4:junit4]   2> 970780 T2658 oasu.CommitTracker.<init> Soft AutoCommit: disabled
[junit4:junit4]   2> 970784 T2659 oasc.SolrCore.registerSearcher [collection1] Registered new searcher Searcher@3ca6b2e9 main{StandardDirectoryReader(segments_1:1)}
[junit4:junit4]   2> 970786 T2658 oasc.CoreContainer.registerCore registering core: collection1
[junit4:junit4]   2> 970787 T2658 oasc.ZkController.register Register replica - core:collection1 address:http://127.0.0.1:39271/sbp/vt collection:collection1 shard:shard1
[junit4:junit4]   2> 970790 T2658 oasc.ZkController.register We are http://127.0.0.1:39271/sbp/vt/collection1/ and leader is http://127.0.0.1:52168/sbp/vt/collection1/
[junit4:junit4]   2> 970790 T2658 oasc.ZkController.register No LogReplay needed for core=collection1 baseURL=http://127.0.0.1:39271/sbp/vt
[junit4:junit4]   2> 970791 T2658 oasc.ZkController.checkRecovery Core needs to recover:collection1
[junit4:junit4]   2> 970791 T2658 oasu.DefaultSolrCoreState.doRecovery Running recovery - first canceling any ongoing recovery
[junit4:junit4]   2> ASYNC  NEW_CORE C1610 name=collection1 org.apache.solr.core.SolrCore@1dd44625 url=http://127.0.0.1:39271/sbp/vt/collection1 node=127.0.0.1:39271_sbp%2Fvt C1610_STATE=coll:collection1 core:collection1 props:{state=down, core=collection1, collection=collection1, node_name=127.0.0.1:39271_sbp%2Fvt, base_url=http://127.0.0.1:39271/sbp/vt}
[junit4:junit4]   2> 970791 T2660 C1610 P39271 oasc.RecoveryStrategy.run Starting recovery process.  core=collection1 recoveringAfterStartup=true
[junit4:junit4]   2> 970792 T2660 C1610 P39271 oasc.RecoveryStrategy.doRecovery ###### startupVersions=[]
[junit4:junit4]   2> 970792 T2658 oascc.ZkStateReader.updateClusterState Updating cloud state from ZooKeeper... 
[junit4:junit4]   2> 970792 T2660 C1610 P39271 oasc.ZkController.publish publishing core=collection1 state=recovering
[junit4:junit4]   2> 970792 T2660 C1610 P39271 oasc.ZkController.publish numShards not found on descriptor - reading it from system property
[junit4:junit4]   2> 970793 T2599 oass.SolrDispatchFilter.init user.dir=/usr/home/hudson/hudson-slave/workspace/Lucene-Solr-Tests-4.x-Java6/solr/build/solr-core/test/J1
[junit4:junit4]   2> 970793 T2599 oass.SolrDispatchFilter.init SolrDispatchFilter.init() done
[junit4:junit4]   2> 970793 T2660 C1610 P39271 oascsi.HttpClientUtil.createClient Creating new http client, config:maxConnections=128&maxConnectionsPerHost=32&followRedirects=false
[junit4:junit4]   2> 970794 T2599 oascsi.HttpClientUtil.createClient Creating new http client, config:maxConnections=128&maxConnectionsPerHost=32&followRedirects=false
[junit4:junit4]   2> 970818 T2631 oasha.CoreAdminHandler.handleWaitForStateAction Going to wait for coreNodeName: 127.0.0.1:39271_sbp%2Fvt_collection1, state: recovering, checkLive: true, onlyIfLeader: true
[junit4:junit4]   2> 970845 T2622 oascc.ZkStateReader.updateClusterState Updating cloud state from ZooKeeper... 
[junit4:junit4]   2> 970846 T2622 oasc.Overseer$ClusterStateUpdater.updateState Update state numShards=1 message={
[junit4:junit4]   2> 	  "operation":"state",
[junit4:junit4]   2> 	  "core_node_name":"127.0.0.1:39271_sbp%2Fvt_collection1",
[junit4:junit4]   2> 	  "numShards":"1",
[junit4:junit4]   2> 	  "shard":"shard1",
[junit4:junit4]   2> 	  "roles":null,
[junit4:junit4]   2> 	  "state":"recovering",
[junit4:junit4]   2> 	  "shard_state":"active",
[junit4:junit4]   2> 	  "core":"collection1",
[junit4:junit4]   2> 	  "collection":"collection1",
[junit4:junit4]   2> 	  "shard_range":null,
[junit4:junit4]   2> 	  "node_name":"127.0.0.1:39271_sbp%2Fvt",
[junit4:junit4]   2> 	  "base_url":"http://127.0.0.1:39271/sbp/vt"}
[junit4:junit4]   2> 970915 T2641 oascc.ZkStateReader$2.process A cluster state change: WatchedEvent state:SyncConnected type:NodeDataChanged path:/clusterstate.json, has occurred - updating... (live nodes size: 3)
[junit4:junit4]   2> 970915 T2657 oascc.ZkStateReader$2.process A cluster state change: WatchedEvent state:SyncConnected type:NodeDataChanged path:/clusterstate.json, has occurred - updating... (live nodes size: 3)
[junit4:junit4]   2> 970915 T2621 oascc.ZkStateReader$2.process A cluster state change: WatchedEvent state:SyncConnected type:NodeDataChanged path:/clusterstate.json, has occurred - updating... (live nodes size: 3)
[junit4:junit4]   2> 970915 T2628 oascc.ZkStateReader$2.process A cluster state change: WatchedEvent state:SyncConnected type:NodeDataChanged path:/clusterstate.json, has occurred - updating... (live nodes size: 3)
[junit4:junit4]   2> 971070 T2599 oejs.Server.doStart jetty-8.1.10.v20130312
[junit4:junit4]   2> 971073 T2599 oejs.AbstractConnector.doStart Started SocketConnector@127.0.0.1:39279
[junit4:junit4]   2> 971074 T2599 oass.SolrDispatchFilter.init SolrDispatchFilter.init()
[junit4:junit4]   2> 971075 T2599 oasc.SolrResourceLoader.locateSolrHome JNDI not configured for solr (NoInitialContextEx)
[junit4:junit4]   2> 971075 T2599 oasc.SolrResourceLoader.locateSolrHome using system property solr.solr.home: /usr/home/hudson/hudson-slave/workspace/Lucene-Solr-Tests-4.x-Java6/solr/build/solr-core/test/J1/./org.apache.solr.cloud.SyncSliceTest-jetty3-1371032083373
[junit4:junit4]   2> 971076 T2599 oasc.CoreContainer$Initializer.initialize looking for solr config file: /usr/home/hudson/hudson-slave/workspace/Lucene-Solr-Tests-4.x-Java6/solr/build/solr-core/test/J1/./org.apache.solr.cloud.SyncSliceTest-jetty3-1371032083373/solr.xml
[junit4:junit4]   2> 971076 T2599 oasc.CoreContainer.<init> New CoreContainer 263526821
[junit4:junit4]   2> 971077 T2599 oasc.CoreContainer.load Loading CoreContainer using Solr Home: '/usr/home/hudson/hudson-slave/workspace/Lucene-Solr-Tests-4.x-Java6/solr/build/solr-core/test/J1/./org.apache.solr.cloud.SyncSliceTest-jetty3-1371032083373/'
[junit4:junit4]   2> 971078 T2599 oasc.SolrResourceLoader.<init> new SolrResourceLoader for directory: '/usr/home/hudson/hudson-slave/workspace/Lucene-Solr-Tests-4.x-Java6/solr/build/solr-core/test/J1/./org.apache.solr.cloud.SyncSliceTest-jetty3-1371032083373/'
[junit4:junit4]   2> 971188 T2599 oashc.HttpShardHandlerFactory.getParameter Setting socketTimeout to: 120000
[junit4:junit4]   2> 971188 T2599 oashc.HttpShardHandlerFactory.getParameter Setting urlScheme to: http://
[junit4:junit4]   2> 971189 T2599 oashc.HttpShardHandlerFactory.getParameter Setting connTimeout to: 15000
[junit4:junit4]   2> 971189 T2599 oashc.HttpShardHandlerFactory.getParameter Setting maxConnectionsPerHost to: 20
[junit4:junit4]   2> 971190 T2599 oashc.HttpShardHandlerFactory.getParameter Setting corePoolSize to: 0
[junit4:junit4]   2> 971190 T2599 oashc.HttpShardHandlerFactory.getParameter Setting maximumPoolSize to: 2147483647
[junit4:junit4]   2> 971191 T2599 oashc.HttpShardHandlerFactory.getParameter Setting maxThreadIdleTime to: 5
[junit4:junit4]   2> 971191 T2599 oashc.HttpShardHandlerFactory.getParameter Setting sizeOfQueue to: -1
[junit4:junit4]   2> 971192 T2599 oashc.HttpShardHandlerFactory.getParameter Setting fairnessPolicy to: false
[junit4:junit4]   2> 971192 T2599 oascsi.HttpClientUtil.createClient Creating new http client, config:maxConnectionsPerHost=20&maxConnections=10000&socketTimeout=120000&connTimeout=15000&retry=false
[junit4:junit4]   2> 971207 T2599 oasl.LogWatcher.newRegisteredLogWatcher Registering Log Listener
[junit4:junit4]   2> 971208 T2599 oasc.ZkContainer.initZooKeeper Zookeeper client=127.0.0.1:59366/solr
[junit4:junit4]   2> 971208 T2599 oasc.ZkController.checkChrootPath zkHost includes chroot
[junit4:junit4]   2> 971209 T2599 oascc.ConnectionManager.waitForConnected Waiting for client to connect to ZooKeeper
[junit4:junit4]   2> 971212 T2672 oascc.ConnectionManager.process Watcher org.apache.solr.common.cloud.ConnectionManager@134b738c name:ZooKeeperConnection Watcher:127.0.0.1:59366 got event WatchedEvent state:SyncConnected type:None path:null path:null type:None
[junit4:junit4]   2> 971213 T2599 oascc.ConnectionManager.waitForConnected Client is connected to ZooKeeper
[junit4:junit4]   2> 971244 T2599 oascsi.HttpClientUtil.createClient Creating new http client, config:maxConnections=500&maxConnectionsPerHost=16&socketTimeout=120000&connTimeout=15000
[junit4:junit4]   2> 971254 T2599 oascc.ConnectionManager.waitForConnected Waiting for client to connect to ZooKeeper
[junit4:junit4]   2> 971257 T2674 oascc.ConnectionManager.process Watcher org.apache.solr.common.cloud.ConnectionManager@30f7cf40 name:ZooKeeperConnection Watcher:127.0.0.1:59366/solr got event WatchedEvent state:SyncConnected type:None path:null path:null type:None
[junit4:junit4]   2> 971257 T2599 oascc.ConnectionManager.waitForConnected Client is connected to ZooKeeper
[junit4:junit4]   2> 971268 T2599 oascc.ZkStateReader.createClusterStateWatchersAndUpdate Updating cluster state from ZooKeeper... 
[junit4:junit4]   2> 971821 T2631 oasha.CoreAdminHandler.handleWaitForStateAction Waited coreNodeName: 127.0.0.1:39271_sbp%2Fvt_collection1, state: recovering, checkLive: true, onlyIfLeader: true for: 1 seconds.
[junit4:junit4]   2> 971821 T2631 oass.SolrDispatchFilter.handleAdminRequest [admin] webapp=null path=/admin/cores params={coreNodeName=127.0.0.1:39271_sbp%252Fvt_collection1&state=recovering&nodeName=127.0.0.1:39271_sbp%252Fvt&action=PREPRECOVERY&checkLive=true&core=collection1&wt=javabin&onlyIfLeader=true&version=2} status=0 QTime=1003 
[junit4:junit4]   2> 972272 T2599 oasc.ZkController.createEphemeralLiveNode Register node as live in ZooKeeper:/live_nodes/127.0.0.1:39279_sbp%2Fvt
[junit4:junit4]   2> 972274 T2599 oascc.SolrZkClient.makePath makePath: /live_nodes/127.0.0.1:39279_sbp%2Fvt
[junit4:junit4]   2> 972277 T2628 oascc.ZkStateReader$3.process Updating live nodes... (4)
[junit4:junit4]   2> 972278 T2674 oascc.ZkStateReader$3.process Updating live nodes... (4)
[junit4:junit4]   2> 972278 T2628 oascc.ZkStateReader$2.process A cluster state change: WatchedEvent state:SyncConnected type:NodeChildrenChanged path:/live_nodes, has occurred - updating... (live nodes size: 4)
[junit4:junit4]   2> 972278 T2621 oascc.ZkStateReader$3.process Updating live nodes... (4)
[junit4:junit4]   2> 972277 T2657 oascc.ZkStateReader$3.process Updating live nodes... (4)
[junit4:junit4]   2> 972277 T2641 oascc.ZkStateReader$3.process Updating live nodes... (4)
[junit4:junit4]   2> 972279 T2657 oascc.ZkStateReader$2.process A cluster state change: WatchedEvent state:SyncConnected type:NodeChildrenChanged path:/live_nodes, has occurred - updating... (live nodes size: 4)
[junit4:junit4]   2> 972278 T2621 oascc.ZkStateReader$2.process A cluster state change: WatchedEvent state:SyncConnected type:NodeChildrenChanged path:/live_nodes, has occurred - updating... (live nodes size: 4)
[junit4:junit4]   2> 972279 T2641 oascc.ZkStateReader$2.process A cluster state change: WatchedEvent state:SyncConnected type:NodeChildrenChanged path:/live_nodes, has occurred - updating... (live nodes size: 4)
[junit4:junit4]   2> 972290 T2675 oasc.ZkController.publish publishing core=collection1 state=down
[junit4:junit4]   2> 972290 T2675 oasc.ZkController.publish numShards not found on descriptor - reading it from system property
[junit4:junit4]   2> 972495 T2622 oascc.ZkStateReader.updateClusterState Updating cloud state from ZooKeeper... 
[junit4:junit4]   2> 972496 T2622 oasc.Overseer$ClusterStateUpdater.updateState Update state numShards=1 message={
[junit4:junit4]   2> 	  "operation":"state",
[junit4:junit4]   2> 	  "core_node_name":null,
[junit4:junit4]   2> 	  "numShards":"1",
[junit4:junit4]   2> 	  "shard":null,
[junit4:junit4]   2> 	  "roles":null,
[junit4:junit4]   2> 	  "state":"down",
[junit4:junit4]   2> 	  "shard_state":"active",
[junit4:junit4]   2> 	  "core":"collection1",
[junit4:junit4]   2> 	  "collection":"collection1",
[junit4:junit4]   2> 	  "shard_range":null,
[junit4:junit4]   2> 	  "node_name":"127.0.0.1:39279_sbp%2Fvt",
[junit4:junit4]   2> 	  "base_url":"http://127.0.0.1:39279/sbp/vt"}
[junit4:junit4]   2> 972496 T2622 oasc.Overseer$ClusterStateUpdater.updateState Collection already exists with numShards=1
[junit4:junit4]   2> 972496 T2622 oasc.Overseer$ClusterStateUpdater.updateState Assigning new node to shard=shard1
[junit4:junit4]   2> 972508 T2641 oascc.ZkStateReader$2.process A cluster state change: WatchedEvent state:SyncConnected type:NodeDataChanged path:/clusterstate.json, has occurred - updating... (live nodes size: 4)
[junit4:junit4]   2> 972508 T2657 oascc.ZkStateReader$2.process A cluster state change: WatchedEvent state:SyncConnected type:NodeDataChanged path:/clusterstate.json, has occurred - updating... (live nodes size: 4)
[junit4:junit4]   2> 972508 T2621 oascc.ZkStateReader$2.process A cluster state change: WatchedEvent state:SyncConnected type:NodeDataChanged path:/clusterstate.json, has occurred - updating... (live nodes size: 4)
[junit4:junit4]   2> 972508 T2674 oascc.ZkStateReader$2.process A cluster state change: WatchedEvent state:SyncConnected type:NodeDataChanged path:/clusterstate.json, has occurred - updating... (live nodes size: 4)
[junit4:junit4]   2> 972508 T2628 oascc.ZkStateReader$2.process A cluster state change: WatchedEvent state:SyncConnected type:NodeDataChanged path:/clusterstate.json, has occurred - updating... (live nodes size: 4)
[junit4:junit4]   2> 973294 T2675 oasc.CoreContainer.create Creating SolrCore 'collection1' using instanceDir: /usr/home/hudson/hudson-slave/workspace/Lucene-Solr-Tests-4.x-Java6/solr/build/solr-core/test/J1/./org.apache.solr.cloud.SyncSliceTest-jetty3-1371032083373/collection1
[junit4:junit4]   2> 973294 T2675 oasc.ZkController.createCollectionZkNode Check for collection zkNode:collection1
[junit4:junit4]   2> 973295 T2675 oasc.ZkController.createCollectionZkNode Collection zkNode exists
[junit4:junit4]   2> 973295 T2675 oasc.ZkController.readConfigName Load collection config from:/collections/collection1
[junit4:junit4]   2> 973297 T2675 oasc.SolrResourceLoader.<init> new SolrResourceLoader for directory: '/usr/home/hudson/hudson-slave/workspace/Lucene-Solr-Tests-4.x-Java6/solr/build/solr-core/test/J1/./org.apache.solr.cloud.SyncSliceTest-jetty3-1371032083373/collection1/'
[junit4:junit4]   2> 973298 T2675 oasc.SolrResourceLoader.replaceClassLoader Adding 'file:/usr/home/hudson/hudson-slave/workspace/Lucene-Solr-Tests-4.x-Java6/solr/build/solr-core/test/J1/org.apache.solr.cloud.SyncSliceTest-jetty3-1371032083373/collection1/lib/README' to classloader
[junit4:junit4]   2> 973299 T2675 oasc.SolrResourceLoader.replaceClassLoader Adding 'file:/usr/home/hudson/hudson-slave/workspace/Lucene-Solr-Tests-4.x-Java6/solr/build/solr-core/test/J1/org.apache.solr.cloud.SyncSliceTest-jetty3-1371032083373/collection1/lib/classes/' to classloader
[junit4:junit4]   2> 973349 T2675 oasc.SolrConfig.<init> Using Lucene MatchVersion: LUCENE_44
[junit4:junit4]   2> 973407 T2675 oasc.SolrConfig.<init> Loaded SolrConfig: solrconfig.xml
[junit4:junit4]   2> 973509 T2675 oass.IndexSchema.readSchema Reading Solr Schema from schema.xml
[junit4:junit4]   2> 973515 T2675 oass.IndexSchema.readSchema [collection1] Schema name=test
[junit4:junit4]   2> ASYNC  NEW_CORE C1611 name=collection1 org.apache.solr.core.SolrCore@1dd44625 url=http://127.0.0.1:39271/sbp/vt/collection1 node=127.0.0.1:39271_sbp%2Fvt C1611_STATE=coll:collection1 core:collection1 props:{shard=shard1, state=recovering, core=collection1, collection=collection1, node_name=127.0.0.1:39271_sbp%2Fvt, base_url=http://127.0.0.1:39271/sbp/vt}
[junit4:junit4]   2> 973824 T2660 C1611 P39271 oasc.RecoveryStrategy.doRecovery Attempting to PeerSync from http://127.0.0.1:52168/sbp/vt/collection1/ core=collection1 - recoveringAfterStartup=true
[junit4:junit4]   2> 973824 T2660 C1611 P39271 oasu.PeerSync.sync PeerSync: core=collection1 url=http://127.0.0.1:39271/sbp/vt START replicas=[http://127.0.0.1:52168/sbp/vt/collection1/] nUpdates=100
[junit4:junit4]   2> 973825 T2660 C1611 P39271 oasu.PeerSync.sync WARN no frame of reference to tell of we've missed updates
[junit4:junit4]   2> 973826 T2660 C1611 P39271 oasc.RecoveryStrategy.doRecovery PeerSync Recovery was not successful - trying replication. core=collection1
[junit4:junit4]   2> 973826 T2660 C1611 P39271 oasc.RecoveryStrategy.doRecovery Starting Replication Recovery. core=collection1
[junit4:junit4]   2> 973826 T2660 C1611 P39271 oasc.RecoveryStrategy.doRecovery Begin buffering updates. core=collection1
[junit4:junit4]   2> 973827 T2660 C1611 P39271 oasu.UpdateLog.bufferUpdates Starting to buffer updates. FSUpdateLog{state=ACTIVE, tlog=null}
[junit4:junit4]   2> 973827 T2660 C1611 P39271 oasc.RecoveryStrategy.replicate Attempting to replicate from http://127.0.0.1:52168/sbp/vt/collection1/. core=collection1
[junit4:junit4]   2> 973827 T2660 C1611 P39271 oascsi.HttpClientUtil.createClient Creating new http client, config:maxConnections=128&maxConnectionsPerHost=32&followRedirects=false
[junit4:junit4]   2> ASYNC  NEW_CORE C1612 name=collection1 org.apache.solr.core.SolrCore@3c488812 url=http://127.0.0.1:52168/sbp/vt/collection1 node=127.0.0.1:52168_sbp%2Fvt C1612_STATE=coll:collection1 core:collection1 props:{shard=shard1, state=active, core=collection1, collection=collection1, node_name=127.0.0.1:52168_sbp%2Fvt, base_url=http://127.0.0.1:52168/sbp/vt, leader=true}
[junit4:junit4]   2> 973834 T2632 C1612 P52168 oasc.SolrCore.execute [collection1] webapp=/sbp/vt path=/get params={getVersions=100&distrib=false&wt=javabin&qt=/get&version=2} status=0 QTime=0 
[junit4:junit4]   2> 973839 T2633 C1612 P52168 oasu.DirectUpdateHandler2.commit start commit{,optimize=false,openSearcher=false,waitSearcher=true,expungeDeletes=false,softCommit=false,prepareCommit=false}
[junit4:junit4]   2> 973845 T2633 C1612 P52168 oasc.SolrDeletionPolicy.onInit SolrDeletionPolicy.onInit: commits: num=1
[junit4:junit4]   2> 		commit{dir=NRTCachingDirectory(org.apache.lucene.store.NIOFSDirectory@/usr/home/hudson/hudson-slave/workspace/Lucene-Solr-Tests-4.x-Java6/solr/build/solr-core/test/J1/org.apache.solr.cloud.SyncSliceTest-1371032070401/jetty1/index lockFactory=org.apache.lucene.store.NativeFSLockFactory@76002e16; maxCacheMB=48.0 maxMergeSizeMB=4.0),segFN=segments_1,generation=1}
[junit4:junit4]   2> 973845 T2633 C1612 P52168 oasc.SolrDeletionPolicy.updateCommits newest commit generation = 1
[junit4:junit4]   2> 973850 T2633 C1612 P52168 oasc.SolrDeletionPolicy.onCommit SolrDeletionPolicy.onCommit: commits: num=2
[junit4:junit4]   2> 		commit{dir=NRTCachingDirectory(org.apache.lucene.store.NIOFSDirectory@/usr/home/hudson/hudson-slave/workspace/Lucene-Solr-Tests-4.x-Java6/solr/build/solr-core/test/J1/org.apache.solr.cloud.SyncSliceTest-1371032070401/jetty1/index lockFactory=org.apache.lucene.store.NativeFSLockFactory@76002e16; maxCacheMB=48.0 maxMergeSizeMB=4.0),segFN=segments_1,generation=1}
[junit4:junit4]   2> 		commit{dir=NRTCachingDirectory(org.apache.lucene.store.NIOFSDirectory@/usr/home/hudson/hudson-slave/workspace/Lucene-Solr-Tests-4.x-Java6/solr/build/solr-core/test/J1/org.apache.solr.cloud.SyncSliceTest-1371032070401/jetty1/index lockFactory=org.apache.lucene.store.NativeFSLockFactory@76002e16; maxCacheMB=48.0 maxMergeSizeMB=4.0),segFN=segments_2,generation=2}
[junit4:junit4]   2> 973851 T2633 C1612 P52168 oasc.SolrDeletionPolicy.updateCommits newest commit generation = 2
[junit4:junit4]   2> 973853 T2633 C1612 P52168 oass.SolrIndexSearcher.<init> Opening Searcher@7e52055c realtime
[junit4:junit4]   2> 973853 T2633 C1612 P52168 oasu.DirectUpdateHandler2.commit end_commit_flush
[junit4:junit4]   2> 973853 T2633 C1612 P52168 oasup.LogUpdateProcessor.finish [collection1] webapp=/sbp/vt path=/update params={waitSearcher=true&openSearcher=false&commit=true&wt=javabin&commit_end_point=true&version=2&softCommit=false} {commit=} 0 14
[junit4:junit4]   2> 973854 T2660 C1611 P39271 oash.ReplicationHandler.inform Commits will be reserved for  10000
[junit4:junit4]   2> 973854 T2660 C1611 P39271 oash.SnapPuller.<init>  No value set for 'pollInterval'. Timer Task not started.
[junit4:junit4]   2> 973856 T2634 C1612 P52168 oash.ReplicationHandler.inform Commits will be reserved for  10000
[junit4:junit4]   2> 973856 T2634 C1612 P52168 oasc.SolrCore.execute [collection1] webapp=/sbp/vt path=/replication params={command=indexversion&qt=/replication&wt=javabin&version=2} status=0 QTime=1 
[junit4:junit4]   2> 973857 T2660 C1611 P39271 oash.SnapPuller.fetchLatestIndex Master's generation: 2
[junit4:junit4]   2> 973857 T2660 C1611 P39271 oash.SnapPuller.fetchLatestIndex Slave's generation: 1
[junit4:junit4]   2> 973857 T2660 C1611 P39271 oash.SnapPuller.fetchLatestIndex Starting replication process
[junit4:junit4]   2> 973860 T2634 C1612 P52168 oasc.SolrCore.execute [collection1] webapp=/sbp/vt path=/replication params={command=filelist&qt=/replication&wt=javabin&generation=2&version=2} status=0 QTime=1 
[junit4:junit4]   2> 973860 T2660 C1611 P39271 oash.SnapPuller.fetchLatestIndex Number of files in latest index in master: 1
[junit4:junit4]   2> 973862 T2660 C1611 P39271 oasc.CachingDirectoryFactory.get return new directory for /usr/home/hudson/hudson-slave/workspace/Lucene-Solr-Tests-4.x-Java6/solr/build/solr-core/test/J1/org.apache.solr.cloud.SyncSliceTest-1371032070401/jetty2/index.20130612041446417
[junit4:junit4]   2> 973863 T2660 C1611 P39271 oash.SnapPuller.fetchLatestIndex Starting download to NRTCachingDirectory(org.apache.lucene.store.NIOFSDirectory@/usr/home/hudson/hudson-slave/workspace/Lucene-Solr-Tests-4.x-Java6/solr/build/solr-core/test/J1/org.apache.solr.cloud.SyncSliceTest-1371032070401/jetty2/index.20130612041446417 lockFactory=org.apache.lucene.store.NativeFSLockFactory@72966508; maxCacheMB=48.0 maxMergeSizeMB=4.0) fullCopy=false
[junit4:junit4]   2> 973867 T2634 C1612 P52168 oasc.SolrCore.execute [collection1] webapp=/sbp/vt path=/replication params={file=segments_2&command=filecontent&checksum=true&wt=filestream&qt=/replication&generation=2} status=0 QTime=0 
[junit4:junit4]   2> 973868 T2660 C1611 P39271 oash.SnapPuller.fetchLatestIndex Total time taken for download : 0 secs
[junit4:junit4]   2> ASYNC  NEW_CORE C1613 name=collection1 org.apache.solr.core.SolrCore@1dd44625 url=http://127.0.0.1:39271/sbp/vt/collection1 node=127.0.0.1:39271_sbp%2Fvt C1613_STATE=coll:collection1 core:collection1 props:{shard=shard1, state=recovering, core=collection1, collection=collection1, node_name=127.0.0.1:39271_sbp%2Fvt, base_url=http://127.0.0.1:39271/sbp/vt}
[junit4:junit4]   2> 973879 T2660 C1613 P39271 oasu.DefaultSolrCoreState.newIndexWriter Creating new IndexWriter...
[junit4:junit4]   2> 973879 T2660 C1613 P39271 oasu.DefaultSolrCoreState.newIndexWriter Waiting until IndexWriter is unused... core=collection1
[junit4:junit4]   2> 973884 T2660 C1613 P39271 oasc.SolrDeletionPolicy.onInit SolrDeletionPolicy.onInit: commits: num=2
[junit4:junit4]   2> 		commit{dir=NRTCachingDirectory(org.apache.lucene.store.NIOFSDirectory@/usr/home/hudson/hudson-slave/workspace/Lucene-Solr-Tests-4.x-Java6/solr/build/solr-core/test/J1/org.apache.solr.cloud.SyncSliceTest-1371032070401/jetty2/index lockFactory=org.apache.lucene.store.NativeFSLockFactory@5ed171d0; maxCacheMB=48.0 maxMergeSizeMB=4.0),segFN=segments_1,generation=1}
[junit4:junit4]   2> 		commit{dir=NRTCachingDirectory(org.apache.lucene.store.NIOFSDirectory@/usr/home/hudson/hudson-slave/workspace/Lucene-Solr-Tests-4.x-Java6/solr/build/solr-core/test/J1/org.apache.solr.cloud.SyncSliceTest-1371032070401/jetty2/index lockFactory=org.apache.lucene.store.NativeFSLockFactory@5ed171d0; maxCacheMB=48.0 maxMergeSizeMB=4.0),segFN=segments_2,generation=2}
[junit4:junit4]   2> 973885 T2660 C1613 P39271 oasc.SolrDeletionPolicy.updateCommits newest commit generation = 2
[junit4:junit4]   2> 973885 T2660 C1613 P39271 oasu.DefaultSolrCoreState.newIndexWriter New IndexWriter is ready to be used.
[junit4:junit4]   2> 973886 T2660 C1613 P39271 oass.SolrIndexSearcher.<init> Opening Searcher@4c299e82 main
[junit4:junit4]   2> 973888 T2659 oasc.SolrCore.registerSearcher [collection1] Registered new searcher Searcher@4c299e82 main{StandardDirectoryReader(segments_2:1:nrt)}
[junit4:junit4]   2> 973888 T2660 C1613 P39271 oasc.CachingDirectoryFactory.closeCacheValue looking to close /usr/home/hudson/hudson-slave/workspace/Lucene-Solr-Tests-4.x-Java6/solr/build/solr-core/test/J1/org.apache.solr.cloud.SyncSliceTest-1371032070401/jetty2/index.20130612041446417 [CachedDir<<refCount=0;path=/usr/home/hudson/hudson-slave/workspace/Lucene-Solr-Tests-4.x-Java6/solr/build/solr-core/test/J1/org.apache.solr.cloud.SyncSliceTest-1371032070401/jetty2/index.20130612041446417;done=true>>]
[junit4:junit4]   2> 973889 T2660 C1613 P39271 oasc.CachingDirectoryFactory.close Closing directory: /usr/home/hudson/hudson-slave/workspace/Lucene-Solr-Tests-4.x-Java6/solr/build/solr-core/test/J1/org.apache.solr.cloud.SyncSliceTest-1371032070401/jetty2/index.20130612041446417
[junit4:junit4]   2> 973889 T2660 C1613 P39271 oasc.CachingDirectoryFactory.closeCacheValue Removing directory before core close: /usr/home/hudson/hudson-slave/workspace/Lucene-Solr-Tests-4.x-Java6/solr/build/solr-core/test/J1/org.apache.solr.cloud.SyncSliceTest-1371032070401/jetty2/index.20130612041446417
[junit4:junit4]   2> 973890 T2660 C1613 P39271 oasc.RecoveryStrategy.replay No replay needed. core=collection1
[junit4:junit4]   2> 973890 T2660 C1613 P39271 oasc.RecoveryStrategy.doRecovery Replication Recovery was successful - registering as Active. core=collection1
[junit4:junit4]   2> 973890 T2660 C1613 P39271 oasc.ZkController.publish publishing core=collection1 state=active
[junit4:junit4]   2> 973891 T2660 C1613 P39271 oasc.ZkController.publish numShards not found on descriptor - reading it from system property
[junit4:junit4]   2> 973892 T2660 C1613 P39271 oasc.RecoveryStrategy.doRecovery Finished recovery process. core=collection1
[junit4:junit4]   2> 974014 T2622 oascc.ZkStateReader.updateClusterState Updating cloud state from ZooKeeper... 
[junit4:junit4]   2> 974016 T2622 oasc.Overseer$ClusterStateUpdater.updateState Update state numShards=1 message={
[junit4:junit4]   2> 	  "operation":"state",
[junit4:junit4]   2> 	  "core_node_name":"127.0.0.1:39271_sbp%2Fvt_collection1",
[junit4:junit4]   2> 	  "numShards":"1",
[junit4:junit4]   2> 	  "shard":"shard1",
[junit4:junit4]   2> 	  "roles":null,
[junit4:junit4]   2> 	  "state":"active",
[junit4:junit4]   2> 	  "shard_state":"active",
[junit4:junit4]   2> 	  "core":"collection1",
[junit4:junit4]   2> 	  "collection":"collection1",
[junit4:junit4]   2> 	  "shard_range":null,
[junit4:junit4]   2> 	  "node_name":"127.0.0.1:39271_sbp%2Fvt",
[junit4:junit4]   2> 	  "base_url":"http://127.0.0.1:39271/sbp/vt"}
[junit4:junit4]   2> 974027 T2674 oascc.ZkStateReader$2.process A cluster state change: WatchedEvent state:SyncConnected type:NodeDataChanged path:/clusterstate.json, has occurred - updating... (live nodes size: 4)
[junit4:junit4]   2> 974028 T2657 oascc.ZkStateReader$2.process A cluster state change: WatchedEvent state:SyncConnected type:NodeDataChanged path:/clusterstate.json, has occurred - updating... (live nodes size: 4)
[junit4:junit4]   2> 974027 T2641 oascc.ZkStateReader$2.process A cluster state change: WatchedEvent state:SyncConnected type:NodeDataChanged path:/clusterstate.json, has occurred - updating... (live nodes size: 4)
[junit4:junit4]   2> 974027 T2621 oascc.ZkStateReader$2.process A cluster state change: WatchedEvent state:SyncConnected type:NodeDataChanged path:/clusterstate.json, has occurred - updating... (live nodes size: 4)
[junit4:junit4]   2> 974027 T2628 oascc.ZkStateReader$2.process A cluster state change: WatchedEvent state:SyncConnected type:NodeDataChanged path:/clusterstate.json, has occurred - updating... (live nodes size: 4)
[junit4:junit4]   2> 974346 T2675 oass.OpenExchangeRatesOrgProvider.init Initialized with rates=open-exchange-rates.json, refreshInterval=1440.
[junit4:junit4]   2> 974390 T2675 oass.IndexSchema.readSchema default search field in schema is text
[junit4:junit4]   2> 974401 T2675 oass.IndexSchema.readSchema unique key field: id
[junit4:junit4]   2> 974424 T2675 oass.FileExchangeRateProvider.reload Reloading exchange rates from file currency.xml
[junit4:junit4]   2> 974507 T2675 oass.FileExchangeRateProvider.reload Reloading exchange rates from file currency.xml
[junit4:junit4]   2> 974523 T2675 oass.OpenExchangeRatesOrgProvider.reload Reloading exchange rates from open-exchange-rates.json
[junit4:junit4]   2> 974526 T2675 oass.OpenExchangeRatesOrgProvider$OpenExchangeRates.<init> WARN Unknown key IMPORTANT NOTE
[junit4:junit4]   2> 974527 T2675 oass.OpenExchangeRatesOrgProvider$OpenExchangeRates.<init> WARN Expected key, got STRING
[junit4:junit4]   2> 974528 T2675 oass.OpenExchangeRatesOrgProvider.reload Reloading exchange rates from open-exchange-rates.json
[junit4:junit4]   2> 974530 T2675 oass.OpenExchangeRatesOrgProvider$OpenExchangeRates.<init> WARN Unknown key IMPORTANT NOTE
[junit4:junit4]   2> 974530 T2675 oass.OpenExchangeRatesOrgProvider$OpenExchangeRates.<init> WARN Expected key, got STRING
[junit4:junit4]   2> 974531 T2675 oasc.SolrCore.initDirectoryFactory solr.NRTCachingDirectoryFactory
[junit4:junit4]   2> 974531 T2675 oasc.SolrCore.<init> [collection1] Opening new SolrCore at /usr/home/hudson/hudson-slave/workspace/Lucene-Solr-Tests-4.x-Java6/solr/build/solr-core/test/J1/./org.apache.solr.cloud.SyncSliceTest-jetty3-1371032083373/collection1/, dataDir=./org.apache.solr.cloud.SyncSliceTest-1371032070401/jetty3/
[junit4:junit4]   2> 974531 T2675 oasc.JmxMonitoredMap.<init> JMX monitoring is enabled. Adding Solr mbeans to JMX Server: com.sun.jmx.mbeanserver.JmxMBeanServer@64d22462
[junit4:junit4]   2> 974532 T2675 oasc.SolrCore.initDirectoryFactory solr.NRTCachingDirectoryFactory
[junit4:junit4]   2> 974539 T2675 oasc.CachingDirectoryFactory.get return new directory for /usr/home/hudson/hudson-slave/workspace/Lucene-Solr-Tests-4.x-Java6/solr/build/solr-core/test/J1/org.apache.solr.cloud.SyncSliceTest-1371032070401/jetty3
[junit4:junit4]   2> 974544 T2675 oasc.SolrCore.getNewIndexDir New index directory detected: old=null new=./org.apache.solr.cloud.SyncSliceTest-1371032070401/jetty3/index/
[junit4:junit4]   2> 974548 T2675 oasc.SolrCore.initIndex WARN [collection1] Solr index directory './org.apache.solr.cloud.SyncSliceTest-1371032070401/jetty3/index' doesn't exist. Creating new index...
[junit4:junit4]   2> 974553 T2675 oasc.CachingDirectoryFactory.get return new directory for /usr/home/hudson/hudson-slave/workspace/Lucene-Solr-Tests-4.x-Java6/solr/build/solr-core/test/J1/org.apache.solr.cloud.SyncSliceTest-1371032070401/jetty3/index
[junit4:junit4]   2> 974570 T2675 oasc.SolrDeletionPolicy.onCommit SolrDeletionPolicy.onCommit: commits: num=1
[junit4:junit4]   2> 		commit{dir=NRTCachingDirectory(org.apache.lucene.store.NIOFSDirectory@/usr/home/hudson/hudson-slave/workspace/Lucene-Solr-Tests-4.x-Java6/solr/build/solr-core/test/J1/org.apache.solr.cloud.SyncSliceTest-1371032070401/jetty3/index lockFactory=org.apache.lucene.store.NativeFSLockFactory@40d137ab; maxCacheMB=48.0 maxMergeSizeMB=4.0),segFN=segments_1,generation=1}
[junit4:junit4]   2> 974570 T2675 oasc.SolrDeletionPolicy.updateCommits newest commit generation = 1
[junit4:junit4]   2> 974579 T2675 oasup.UpdateRequestProcessorChain.init inserting DistributedUpdateProcessorFactory into updateRequestProcessorChain "dedupe"
[junit4:junit4]   2> 974579 T2675 oasup.UpdateRequestProcessorChain.init inserting DistributedUpdateProcessorFactory into updateRequestProcessorChain "stored_sig"
[junit4:junit4]   2> 974580 T2675 oasup.UpdateRequestProcessorChain.init inserting DistributedUpdateProcessorFactory into updateRequestProcessorChain "distrib-dup-test-chain-implicit"
[junit4:junit4]   2> 974581 T2675 oasc.RequestHandlers.initHandlersFromConfig created standard: solr.StandardRequestHandler
[junit4:junit4]   2> 974582 T2675 oasc.RequestHandlers.initHandlersFromConfig created /get: solr.RealTimeGetHandler
[junit4:junit4]   2> 974582 T2675 oasc.RequestHandlers.initHandlersFromConfig adding lazy requestHandler: solr.ReplicationHandler
[junit4:junit4]   2> 974600 T2675 oasc.RequestHandlers.initHandlersFromConfig created /replication: solr.ReplicationHandler
[junit4:junit4]   2> 974601 T2675 oasc.RequestHandlers.initHandlersFromConfig created /update: solr.UpdateRequestHandler
[junit4:junit4]   2> 974602 T2675 oasc.RequestHandlers.initHandlersFromConfig created /admin/: org.apache.solr.handler.admin.AdminHandlers
[junit4:junit4]   2> 974675 T2675 oashl.XMLLoader.init xsltCacheLifetimeSeconds=60
[junit4:junit4]   2> 974718 T2675 oass.SolrIndexSearcher.<init> Opening Searcher@26edfa6d main
[junit4:junit4]   2> 974719 T2675 oasu.CommitTracker.<init> Hard AutoCommit: disabled
[junit4:junit4]   2> 974720 T2675 oasu.CommitTracker.<init> Soft AutoCommit: disabled
[junit4:junit4]   2> 974724 T2678 oasc.SolrCore.registerSearcher [collection1] Registered new searcher Searcher@26edfa6d main{StandardDirectoryReader(segments_1:1)}
[junit4:junit4]   2> 974726 T2675 oasc.CoreContainer.registerCore registering core: collection1
[junit4:junit4]   2> 974727 T2675 oasc.ZkController.register Register replica - core:collection1 address:http://127.0.0.1:39279/sbp/vt collection:collection1 shard:shard1
[junit4:junit4]   2> 974732 T2675 oasc.ZkController.register We are http://127.0.0.1:39279/sbp/vt/collection1/ and leader is http://127.0.0.1:52168/sbp/vt/collection1/
[junit4:junit4]   2> 974732 T2675 oasc.ZkController.register No LogReplay needed for core=collection1 baseURL=http://127.0.0.1:39279/sbp/vt
[junit4:junit4]   2> 974732 T2675 oasc.ZkController.checkRecovery Core needs to recover:collection1
[junit4:junit4]   2> 974733 T2675 oasu.DefaultSolrCoreState.doRecovery Running recovery - first canceling any ongoing recovery
[junit4:junit4]   2> ASYNC  NEW_CORE C1614 name=collection1 org.apache.solr.core.SolrCore@74e71d58 url=http://127.0.0.1:39279/sbp/vt/collection1 node=127.0.0.1:39279_sbp%2Fvt C1614_STATE=coll:collection1 core:collection1 props:{state=down, core=collection1, collection=collection1, node_name=127.0.0.1:39279_sbp%2Fvt, base_url=http://127.0.0.1:39279/sbp/vt}
[junit4:junit4]   2> 974733 T2679 C1614 P39279 oasc.RecoveryStrategy.run Starting recovery process.  core=collection1 recoveringAfterStartup=true
[junit4:junit4]   2> 974734 T2679 C1614 P39279 oasc.RecoveryStrategy.doRecovery ###### startupVersions=[]
[junit4:junit4]   2> 974734 T2675 oascc.ZkStateReader.updateClusterState Updating cloud state from ZooKeeper... 
[junit4:junit4]   2> 974734 T2679 C1614 P39279 oasc.ZkController.publish publishing core=collection1 state=recovering
[junit4:junit4]   2> 974735 T2679 C1614 P39279 oasc.ZkController.publish numShards not found on descriptor - reading it from system property
[junit4:junit4]   2> 974736 T2599 oass.SolrDispatchFilter.init user.dir=/usr/home/hudson/hudson-slave/workspace/Lucene-Solr-Tests-4.x-Java6/solr/build/solr-core/test/J1
[junit4:junit4]   2> 974737 T2679 C1614 P39279 oascsi.HttpClientUtil.createClient Creating new http client, config:maxConnections=128&maxConnectionsPerHost=32&followRedirects=false
[junit4:junit4]   2> 974737 T2599 oass.SolrDispatchFilter.init SolrDispatchFilter.init() done
[junit4:junit4]   2> 974738 T2599 oascsi.HttpClientUtil.createClient Creating new http client, config:maxConnections=128&maxConnectionsPerHost=32&followRedirects=false
[junit4:junit4]   2> 974840 T2635 oasha.CoreAdminHandler.handleWaitForStateAction Going to wait for coreNodeName: 127.0.0.1:39279_sbp%2Fvt_collection1, state: recovering, checkLive: true, onlyIfLeader: true
[junit4:junit4]   2> 975534 T2622 oascc.ZkStateReader.updateClusterState Updating cloud state from ZooKeeper... 
[junit4:junit4]   2> 975536 T2622 oasc.Overseer$ClusterStateUpdater.updateState Update state numShards=1 message={
[junit4:junit4]   2> 	  "operation":"state",
[junit4:junit4]   2> 	  "core_node_name":"127.0.0.1:39279_sbp%2Fvt_collection1",
[junit4:junit4]   2> 	  "numShards":"1",
[junit4:junit4]   2> 	  "shard":"shard1",
[junit4:junit4]   2> 	  "roles":null,
[junit4:junit4]   2> 	  "state":"recovering",
[junit4:junit4]   2> 	  "shard_state":"active",
[junit4:junit4]   2> 	  "core":"collection1",
[junit4:junit4]   2> 	  "collection":"collection1",
[junit4:junit4]   2> 	  "shard_range":null,
[junit4:junit4]   2> 	  "node_name":"127.0.0.1:39279_sbp%2Fvt",
[junit4:junit4]   2> 	  "base_url":"http://127.0.0.1:39279/sbp/vt"}
[junit4:junit4]   2> 975554 T2641 oascc.ZkStateReader$2.process A cluster state change: WatchedEvent state:SyncConnected type:NodeDataChanged path:/clusterstate.json, has occurred - updating... (live nodes size: 4)
[junit4:junit4]   2> 975555 T2628 oascc.ZkStateReader$2.process A cluster state change: WatchedEvent state:SyncConnected type:NodeDataChanged path:/clusterstate.json, has occurred - updating... (live nodes size: 4)
[junit4:junit4]   2> 975555 T2657 oascc.ZkStateReader$2.process A cluster state change: WatchedEvent state:SyncConnected type:NodeDataChanged path:/clusterstate.json, has occurred - updating... (live nodes size: 4)
[junit4:junit4]   2> 975555 T2621 oascc.ZkStateReader$2.process A cluster state change: WatchedEvent state:SyncConnected type:NodeDataChanged path:/clusterstate.json, has occurred - updating... (live nodes size: 4)
[junit4:junit4]   2> 975554 T2674 oascc.ZkStateReader$2.process A cluster state change: WatchedEvent state:SyncConnected type:NodeDataChanged path:/clusterstate.json, has occurred - updating... (live nodes size: 4)
[junit4:junit4]   2> 975842 T2635 oasha.CoreAdminHandler.handleWaitForStateAction Waited coreNodeName: 127.0.0.1:39279_sbp%2Fvt_collection1, state: recovering, checkLive: true, onlyIfLeader: true for: 1 seconds.
[junit4:junit4]   2> 975842 T2635 oass.SolrDispatchFilter.handleAdminRequest [admin] webapp=null path=/admin/cores params={coreNodeName=127.0.0.1:39279_sbp%252Fvt_collection1&state=recovering&nodeName=127.0.0.1:39279_sbp%252Fvt&action=PREPRECOVERY&checkLive=true&core=collection1&wt=javabin&onlyIfLeader=true&version=2} status=0 QTime=1002 
[junit4:junit4]   2> 975931 T2599 oejs.Server.doStart jetty-8.1.10.v20130312
[junit4:junit4]   2> 975935 T2599 oejs.AbstractConnector.doStart Started SocketConnector@127.0.0.1:39307
[junit4:junit4]   2> 975936 T2599 oass.SolrDispatchFilter.init SolrDispatchFilter.init()
[junit4:junit4]   2> 975937 T2599 oasc.SolrResourceLoader.locateSolrHome JNDI not configured for solr (NoInitialContextEx)
[junit4:junit4]   2> 975938 T2599 oasc.SolrResourceLoader.locateSolrHome using system property solr.solr.home: /usr/home/hudson/hudson-slave/workspace/Lucene-Solr-Tests-4.x-Java6/solr/build/solr-core/test/J1/./org.apache.solr.cloud.SyncSliceTest-jetty4-1371032087396
[junit4:junit4]   2> 975939 T2599 oasc.CoreContainer$Initializer.initialize looking for solr config file: /usr/home/hudson/hudson-slave/workspace/Lucene-Solr-Tests-4.x-Java6/solr/build/solr-core/test/J1/./org.apache.solr.cloud.SyncSliceTest-jetty4-1371032087396/solr.xml
[junit4:junit4]   2> 975939 T2599 oasc.CoreContainer.<init> New CoreContainer 1428340436
[junit4:junit4]   2> 975941 T2599 oasc.CoreContainer.load Loading CoreContainer using Solr Home: '/usr/home/hudson/hudson-slave/workspace/Lucene-Solr-Tests-4.x-Java6/solr/build/solr-core/test/J1/./org.apache.solr.cloud.SyncSliceTest-jetty4-1371032087396/'
[junit4:junit4]   2> 975941 T2599 oasc.SolrResourceLoader.<init> new SolrResourceLoader for directory: '/usr/home/hudson/hudson-slave/workspace/Lucene-Solr-Tests-4.x-Java6/solr/build/solr-core/test/J1/./org.apache.solr.cloud.SyncSliceTest-jetty4-1371032087396/'
[junit4:junit4]   2> 976271 T2599 oashc.HttpShardHandlerFactory.getParameter Setting socketTimeout to: 120000
[junit4:junit4]   2> 976272 T2599 oashc.HttpShardHandlerFactory.getParameter Setting urlScheme to: http://
[junit4:junit4]   2> 976273 T2599 oashc.HttpShardHandlerFactory.getParameter Setting connTimeout to: 15000
[junit4:junit4]   2> 976273 T2599 oashc.HttpShardHandlerFactory.getParameter Setting maxConnectionsPerHost to: 20
[junit4:junit4]   2> 976274 T2599 oashc.HttpShardHandlerFactory.getParameter Setting corePoolSize to: 0
[junit4:junit4]   2> 976275 T2599 oashc.HttpShardHandlerFactory.getParameter Setting maximumPoolSize to: 2147483647
[junit4:junit4]   2> 976276 T2599 oashc.HttpShardHandlerFactory.getParameter Setting maxThreadIdleTime to: 5
[junit4:junit4]   2> 976276 T2599 oashc.HttpShardHandlerFactory.getParameter Setting sizeOfQueue to: -1
[junit4:junit4]   2> 976277 T2599 oashc.HttpShardHandlerFactory.getParameter Setting fairnessPolicy to: false
[junit4:junit4]   2> 976278 T2599 oascsi.HttpClientUtil.createClient Creating new http client, config:maxConnectionsPerHost=20&maxConnections=10000&socketTimeout=120000&connTimeout=15000&retry=false
[junit4:junit4]   2> 976314 T2599 oasl.LogWatcher.newRegisteredLogWatcher Registering Log Listener
[junit4:junit4]   2> 976315 T2599 oasc.ZkContainer.initZooKeeper Zookeeper client=127.0.0.1:59366/solr
[junit4:junit4]   2> 976316 T2599 oasc.ZkController.checkChrootPath zkHost includes chroot
[junit4:junit4]   2> 976317 T2599 oascc.ConnectionManager.waitForConnected Waiting for client to connect to ZooKeeper
[junit4:junit4]   2> 976322 T2691 oascc.ConnectionManager.process Watcher org.apache.solr.common.cloud.ConnectionManager@555c82b9 name:ZooKeeperConnection Watcher:127.0.0.1:59366 got event WatchedEvent state:SyncConnected type:None path:null path:null type:None
[junit4:junit4]   2> 976323 T2599 oascc.ConnectionManager.waitForConnected Client is connected to ZooKeeper
[junit4:junit4]   2> 976329 T2599 oascsi.HttpClientUtil.createClient Creating new http client, config:maxConnections=500&maxConnectionsPerHost=16&socketTimeout=120000&connTimeout=15000
[junit4:junit4]   2> 976348 T2599 oascc.ConnectionManager.waitForConnected Waiting for client to connect to ZooKeeper
[junit4:junit4]   2> 976351 T2693 oascc.ConnectionManager.process Watcher org.apache.solr.common.cloud.ConnectionManager@5719e0ce name:ZooKeeperConnection Watcher:127.0.0.1:59366/solr got event WatchedEvent state:SyncConnected type:None path:null path:null type:None
[junit4:junit4]   2> 976351 T2599 oascc.ConnectionManager.waitForConnected Client is connected to ZooKeeper
[junit4:junit4]   2> 976363 T2599 oascc.ZkStateReader.createClusterStateWatchersAndUpdate Updating cluster state from ZooKeeper... 
[junit4:junit4]   2> 977367 T2599 oasc.ZkController.createEphemeralLiveNode Register node as live in ZooKeeper:/live_nodes/127.0.0.1:39307_sbp%2Fvt
[junit4:junit4]   2> 977369 T2599 oascc.SolrZkClient.makePath makePath: /live_nodes/127.0.0.1:39307_sbp%2Fvt
[junit4:junit4]   2> 977373 T2641 oascc.ZkStateReader$3.process Updating live nodes... (5)
[junit4:junit4]   2> 977373 T2628 oascc.ZkStateReader$3.process Updating live nodes... (5)
[junit4:junit4]   2> 977373 T2657 oascc.ZkStateReader$3.process Updating live nodes... (5)
[junit4:junit4]   2> 977373 T2621 oascc.ZkStateReader$3.process Updating live nodes... (5)
[junit4:junit4]   2> 977373 T2641 oascc.ZkStateReader$2.process A cluster state change: WatchedEvent state:SyncConnected type:NodeChildrenChanged path:/live_nodes, has occurred - updating... (live nodes size: 5)
[junit4:junit4]   2> 977373 T2693 oascc.ZkStateReader$3.process Updating live nodes... (5)
[junit4:junit4]   2> 977373 T2674 oascc.ZkStateReader$3.process Updating live nodes... (5)
[junit4:junit4]   2> 977374 T2621 oascc.ZkStateReader$2.process A cluster state change: WatchedEvent state:SyncConnected type:NodeChildrenChanged path:/live_nodes, has occurred - updating... (live nodes size: 5)
[junit4:junit4]   2> 977373 T2657 oascc.ZkStateReader$2.process A cluster state change: WatchedEvent state:SyncConnected type:NodeChildrenChanged path:/live_nodes, has occurred - updating... (live nodes size: 5)
[junit4:junit4]   2> 977373 T2628 oascc.ZkStateReader$2.process A cluster state change: WatchedEvent state:SyncConnected type:NodeChildrenChanged path:/live_nodes, has occurred - updating... (live nodes size: 5)
[junit4:junit4]   2> 977374 T2674 oascc.ZkStateReader$2.process A cluster state change: WatchedEvent state:SyncConnected type:NodeChildrenChanged path:/live_nodes, has occurred - updating... (live nodes size: 5)
[junit4:junit4]   2> 977386 T2694 oasc.ZkController.publish publishing core=collection1 state=down
[junit4:junit4]   2> 977386 T2694 oasc.ZkController.publish numShards not found on descriptor - reading it from system property
[junit4:junit4]   2>  C1614_STATE=coll:collection1 core:collection1 props:{shard=shard1, state=recovering, core=collection1, collection=collection1, node_name=127.0.0.1:39279_sbp%2Fvt, base_url=http://127.0.0.1:39279/sbp/vt}
[junit4:junit4]   2> 977845 T2679 C1614 P39279 oasc.RecoveryStrategy.doRecovery Attempting to PeerSync from http://127.0.0.1:52168/sbp/vt/collection1/ core=collection1 - recoveringAfterStartup=true
[junit4:junit4]   2> 977845 T2679 C1614 P39279 oasu.PeerSync.sync PeerSync: core=collection1 url=http://127.0.0.1:39279/sbp/vt START replicas=[http://127.0.0.1:52168/sbp/vt/collection1/] nUpdates=100
[junit4:junit4]   2> 977846 T2679 C1614 P39279 oasu.PeerSync.sync WARN no frame of reference to tell of we've missed updates
[junit4:junit4]   2> 977846 T2679 C1614 P39279 oasc.RecoveryStrategy.doRecovery PeerSync Recovery was not successful - trying replication. core=collection1
[junit4:junit4]   2> 977846 T2679 C1614 P39279 oasc.RecoveryStrategy.doRecovery Starting Replication Recovery. core=collection1
[junit4:junit4]   2> 977846 T2679 C1614 P39279 oasc.RecoveryStrategy.doRecovery Begin buffering updates. core=collection1
[junit4:junit4]   2> 977846 T2679 C1614 P39279 oasu.UpdateLog.bufferUpdates Starting to buffer updates. FSUpdateLog{state=ACTIVE, tlog=null}
[junit4:junit4]   2> 977846 T2679 C1614 P39279 oasc.RecoveryStrategy.replicate Attempting to replicate from http://127.0.0.1:52168/sbp/vt/collection1/. core=collection1
[junit4:junit4]   2> 977847 T2679 C1614 P39279 oascsi.HttpClientUtil.createClient Creating new http client, config:maxConnections=128&maxConnectionsPerHost=32&followRedirects=false
[junit4:junit4]   2> ASYNC  NEW_CORE C1615 name=collection1 org.apache.solr.core.SolrCore@3c488812 url=http://127.0.0.1:52168/sbp/vt/collection1 node=127.0.0.1:52168_sbp%2Fvt C1615_STATE=coll:collection1 core:collection1 props:{shard=shard1, state=active, core=collection1, collection=collection1, node_name=127.0.0.1:52168_sbp%2Fvt, base_url=http://127.0.0.1:52168/sbp/vt, leader=true}
[junit4:junit4]   2> 977849 T2632 C1615 P52168 oasc.SolrCore.execute [collection1] webapp=/sbp/vt path=/get params={getVersions=100&distrib=false&wt=javabin&qt=/get&version=2} status=0 QTime=0 
[junit4:junit4]   2> 977858 T2636 C1615 P52168 oasu.DirectUpdateHandler2.commit start commit{,optimize=false,openSearcher=false,waitSearcher=true,expungeDeletes=false,softCommit=false,prepareCommit=false}
[junit4:junit4]   2> 977863 T2636 C1615 P52168 oasc.SolrDeletionPolicy.onCommit SolrDeletionPolicy.onCommit: commits: num=2
[junit4:junit4]   2> 		commit{dir=NRTCachingDirectory(org.apache.lucene.store.NIOFSDirectory@/usr/home/hudson/hudson-slave/workspace/Lucene-Solr-Tests-4.x-Java6/solr/build/solr-core/test/J1/org.apache.solr.cloud.SyncSliceTest-1371032070401/jetty1/index lockFactory=org.apache.lucene.store.NativeFSLockFactory@76002e16; maxCacheMB=48.0 maxMergeSizeMB=4.0),segFN=segments_2,generation=2}
[junit4:junit4]   2> 		commit{dir=NRTCachingDirectory(org.apache.lucene.store.NIOFSDirectory@/usr/home/hudson/hudson-slave/workspace/Lucene-Solr-Tests-4.x-Java6/solr/build/solr-core/test/J1/org.apache.solr.cloud.SyncSliceTest-1371032070401/jetty1/index lockFactory=org.apache.lucene.store.NativeFSLockFactory@76002e16; maxCacheMB=48.0 maxMergeSizeMB=4.0),segFN=segments_3,generation=3}
[junit4:junit4]   2> 977864 T2636 C1615 P52168 oasc.SolrDeletionPolicy.updateCommits newest commit generation = 3
[junit4:junit4]   2> 977865 T2636 C1615 P52168 oasu.DirectUpdateHandler2.commit end_commit_flush
[junit4:junit4]   2> 977866 T2636 C1615 P52168 oasup.LogUpdateProcessor.finish [collection1] webapp=/sbp/vt path=/update params={waitSearcher=true&openSearcher=false&commit=true&wt=javabin&commit_end_point=true&version=2&softCommit=false} {commit=} 0 7
[junit4:junit4]   2> 977866 T2679 C1614 P39279 oash.ReplicationHandler.inform Commits will be reserved for  10000
[junit4:junit4]   2> 977867 T2679 C1614 P39279 oash.SnapPuller.<init>  No value set for 'pollInterval'. Timer Task not started.
[junit4:junit4]   2> 977869 T2634 C1615 P52168 oasc.SolrCore.execute [collection1] webapp=/sbp/vt path=/replication params={command=indexversion&qt=/replication&wt=javabin&version=2} status=0 QTime=0 
[junit4:junit4]   2> 977870 T2679 C1614 P39279 oash.SnapPuller.fetchLatestIndex Master's generation: 3
[junit4:junit4]   2> 977870 T2679 C1614 P39279 oash.SnapPuller.fetchLatestIndex Slave's generation: 1
[junit4:junit4]   2> 977870 T2679 C1614 P39279 oash.SnapPuller.fetchLatestIndex Starting replication process
[junit4:junit4]   2> 977873 T2634 C1615 P52168 oasc.SolrCore.execute [collection1] webapp=/sbp/vt path=/replication params={command=filelist&qt=/replication&wt=javabin&generation=3&version=2} status=0 QTime=1 
[junit4:junit4]   2> 977873 T2679 C1614 P39279 oash.SnapPuller.fetchLatestIndex Number of files in latest index in master: 1
[junit4:junit4]   2> 977875 T2679 C1614 P39279 oasc.CachingDirectoryFactory.get return new directory for /usr/home/hudson/hudson-slave/workspace/Lucene-Solr-Tests-4.x-Java6/solr/build/solr-core/test/J1/org.apache.solr.cloud.SyncSliceTest-1371032070401/jetty3/index.20130612041450429
[junit4:junit4]   2> 977876 T2679 C1614 P39279 oash.SnapPuller.fetchLatestIndex Starting download to NRTCachingDirectory(org.apache.lucene.store.NIOFSDirectory@/usr/home/hudson/hudson-slave/workspace/Lucene-Solr-Tests-4.x-Java6/solr/build/solr-core/test/J1/org.apache.solr.cloud.SyncSliceTest-1371032070401/jetty3/index.20130612041450429 lockFactory=org.apache.lucene.store.NativeFSLockFactory@1746a349; maxCacheMB=48.0 maxMergeSizeMB=4.0) fullCopy=false
[junit4:junit4]   2> 977880 T2634 C1615 P52168 oasc.SolrCore.execute [collection1] webapp=/sbp/vt path=/replication params={file=segments_3&command=filecontent&checksum=true&wt=filestream&qt=/replication&generation=3} status=0 QTime=0 
[junit4:junit4]   2> 977881 T2679 C1614 P39279 oash.SnapPuller.fetchLatestIndex Total time taken for download : 0 secs
[junit4:junit4]   2> 977884 T2679 C1614 P39279 oasu.DefaultSolrCoreState.newIndexWriter Creating new IndexWriter...
[junit4:junit4]   2> 977884 T2679 C1614 P39279 oasu.DefaultSolrCoreState.newIndexWriter Waiting until IndexWriter is unused... core=collection1
[junit4:junit4]   2> 977889 T2679 C1614 P39279 oasc.SolrDeletionPolicy.onInit SolrDeletionPolicy.onInit: commits: num=2
[junit4:junit4]   2> 		commit{dir=NRTCachingDirectory(org.apache.lucene.store.NIOFSDirectory@/usr/home/hudson/hudson-slave/workspace/Lucene-Solr-Tests-4.x-Java6/solr/build/solr-core/test/J1/org.apache.solr.cloud.SyncSliceTest-1371032070401/jetty3/index lockFactory=org.apache.lucene.store.NativeFSLockFactory@40d137ab; maxCacheMB=48.0 maxMergeSizeMB=4.0),segFN=segments_1,generation=1}
[junit4:junit4]   2> 		commit{dir=NRTCachingDirectory(org.apache.lucene.store.NIOFSDirectory@/usr/home/hudson/hudson-slave/workspace/Lucene-Solr-Tests-4.x-Java6/solr/build/solr-core/test/J1/org.apache.solr.cloud.SyncSliceTest-1371032070401/jetty3/index lockFactory=org.apache.lucene.store.NativeFSLockFactory@40d137ab; maxCacheMB=48.0 maxMergeSizeMB=4.0),segFN=segments_3,generation=3}
[junit4:junit4]   2> 977889 T2679 C1614 P39279 oasc.SolrDeletionPolicy.updateCommits newest commit generation = 3
[junit4:junit4]   2> 977890 T2679 C1614 P39279 oasu.DefaultSolrCoreState.newIndexWriter New IndexWriter is ready to be used.
[junit4:junit4]   2> 977891 T2679 C1614 P39279 oass.SolrIndexSearcher.<init> Opening Searcher@1f7ab3a main
[junit4:junit4]   2> 977898 T2678 oasc.SolrCore.registerSearcher [collection1] Registered new searcher Searcher@1f7ab3a main{StandardDirectoryReader(segments_3:1:nrt)}
[junit4:junit4]   2> ASYNC  NEW_CORE C1616 name=collection1 org.apache.solr.core.SolrCore@74e71d58 url=http://127.0.0.1:39279/sbp/vt/collection1 node=127.0.0.1:39279_sbp%2Fvt C1616_STATE=coll:collection1 core:collection1 props:{shard=shard1, state=recovering, core=collection1, collection=collection1, node_name=127.0.0.1:39279_sbp%2Fvt, base_url=http://127.0.0.1:39279/sbp/vt}
[junit4:junit4]   2> 977899 T2679 C1616 P39279 oasc.CachingDirectoryFactory.closeCacheValue looking to close /usr/home/hudson/hudson-slave/workspace/Lucene-Solr-Tests-4.x-Java6/solr/build/solr-core/test/J1/org.apache.solr.cloud.SyncSliceTest-1371032070401/jetty3/index.20130612041450429 [CachedDir<<refCount=0;path=/usr/home/hudson/hudson-slave/workspace/Lucene-Solr-Tests-4.x-Java6/solr/build/solr-core/test/J1/org.apache.solr.cloud.SyncSliceTest-1371032070401/jetty3/index.20130612041450429;done=true>>]
[junit4:junit4]   2> 977899 T2679 C1616 P39279 oasc.CachingDirectoryFactory.close Closing directory: /usr/home/hudson/hudson-slave/workspace/Lucene-Solr-Tests-4.x-Java6/solr/build/solr-core/test/J1/org.apache.solr.cloud.SyncSliceTest-1371032070401/jetty3/index.20130612041450429
[junit4:junit4]   2> 977900 T2679 C1616 P39279 oasc.CachingDirectoryFactory.closeCacheValue Removing directory before core close: /usr/home/hudson/hudson-slave/workspace/Lucene-Solr-Tests-4.x-Java6/solr/build/solr-core/test/J1/org.apache.solr.cloud.SyncSliceTest-1371032070401/jetty3/index.20130612041450429
[junit4:junit4]   2> 977901 T2679 C1616 P39279 oasc.RecoveryStrategy.replay No replay needed. core=collection1
[junit4:junit4]   2> 977901 T2679 C1616 P39279 oasc.RecoveryStrategy.doRecovery Replication Recovery was successful - registering as Active. core=collection1
[junit4:junit4]   2> 977901 T2679 C1616 P39279 oasc.ZkController.publish publishing core=collection1 state=active
[junit4:junit4]   2> 977901 T2679 C1616 P39279 oasc.ZkController.publish numShards not found on descriptor - reading it from system property
[junit4:junit4]   2> 977903 T2679 C1616 P39279 oasc.RecoveryStrategy.doRecovery Finished recovery process. core=collection1
[junit4:junit4]   2> 978566 T2622 oascc.ZkStateReader.updateClusterState Updating cloud state from ZooKeeper... 
[junit4:junit4]   2> 978567 T2622 oasc.Overseer$ClusterStateUpdater.updateState Update state numShards=1 message={
[junit4:junit4]   2> 	  "operation":"state",
[junit4:junit4]   2> 	  "core_node_name":null,
[junit4:junit4]   2> 	  "numShards":"1",
[junit4:junit4]   2> 	  "shard":null,
[junit4:junit4]   2> 	  "roles":null,
[junit4:junit4]   2> 	  "state":"down",
[junit4:junit4]   2> 	  "shard_state":"active",
[junit4:junit4]   2> 	  "core":"collection1",
[junit4:junit4]   2> 	  "collection":"collection1",
[junit4:junit4]   2> 	  "shard_range":null,
[junit4:junit4]   2> 	  "node_name":"127.0.0.1:39307_sbp%2Fvt",
[junit4:junit4]   2> 	  "base_url":"http://127.0.0.1:39307/sbp/vt"}
[junit4:junit4]   2> 978568 T2622 oasc.Overseer$ClusterStateUpdater.updateState Collection already exists with numShards=1
[junit4:junit4]   2> 978568 T2622 oasc.Overseer$ClusterStateUpdater.updateState Assigning new node to shard=shard1
[junit4:junit4]   2> 978571 T2622 oasc.Overseer$ClusterStateUpdater.updateState Update state numShards=1 message={
[junit4:junit4]   2> 	  "operation":"state",
[junit4:junit4]   2> 	  "core_node_name":"127.0.0.1:39279_sbp%2Fvt_collection1",
[junit4:junit4]   2> 	  "numShards":"1",
[junit4:junit4]   2> 	  "shard":"shard1",
[junit4:junit4]   2> 	  "roles":null,
[junit4:junit4]   2> 	  "state":"active",
[junit4:junit4]   2> 	  "shard_state":"active",
[junit4:junit4]   2> 	  "core":"collection1",
[junit4:junit4]   2> 	  "collection":"collection1",
[junit4:junit4]   2> 	  "shard_range":null,
[junit4:junit4]   2> 	  "node_name":"127.0.0.1:39279_sbp%2Fvt",
[junit4:junit4]   2> 	  "base_url":"http://127.0.0.1:39279/sbp/vt"}
[junit4:junit4]   2> 978583 T2693 oascc.ZkStateReader$2.process A cluster state change: WatchedEvent state:SyncConnected type:NodeDataChanged path:/clusterstate.json, has occurred - updating... (live nodes size: 5)
[junit4:junit4]   2> 978583 T2621 oascc.ZkStateReader$2.process A cluster state change: WatchedEvent state:SyncConnected type:NodeDataChanged path:/clusterstate.json, has occurred - updating... (live nodes size: 5)
[junit4:junit4]   2> 978583 T2628 oascc.ZkStateReader$2.process A cluster state change: WatchedEvent state:SyncConnected type:NodeDataChanged path:/clusterstate.json, has occurred - updating... (live nodes size: 5)
[junit4:junit4]   2> 978583 T2657 oascc.ZkStateReader$2.process A cluster state change: WatchedEvent state:SyncConnected type:NodeDataChanged path:/clusterstate.json, has occurred - updating... (live nodes size: 5)
[junit4:junit4]   2> 978583 T2641 oascc.ZkStateReader$2.process A cluster state change: WatchedEvent state:SyncConnected type:NodeDataChanged path:/clusterstate.json, has occurred - updating... (live nodes size: 5)
[junit4:junit4]   2> 978583 T2674 oascc.ZkStateReader$2.process A cluster state change: WatchedEvent state:SyncConnected type:NodeDataChanged path:/clusterstate.json, has occurred - updating... (live nodes size: 5)
[junit4:junit4]   2> 979391 T2694 oasc.CoreContainer.create Creating SolrCore 'collection1' using instanceDir: /usr/home/hudson/hudson-slave/workspace/Lucene-Solr-Tests-4.x-Java6/solr/build/solr-core/test/J1/./org.apache.solr.cloud.SyncSliceTest-jetty4-1371032087396/collection1
[junit4:junit4]   2> 979391 T2694 oasc.ZkController.createCollectionZkNode Check for collection zkNode:collection1
[junit4:junit4]   2> 979392 T2694 oasc.ZkController.createCollectionZkNode Collection zkNode exists
[junit4:junit4]   2> 979392 T2694 oasc.ZkController.readConfigName Load collection config from:/collections/collection1
[junit4:junit4]   2> 979394 T2694 oasc.SolrResourceLoader.<init> new SolrResourceLoader for directory: '/usr/home/hudson/hudson-slave/workspace/Lucene-Solr-Tests-4.x-Java6/solr/build/solr-core/test/J1/./org.apache.solr.cloud.SyncSliceTest-jetty4-1371032087396/collection1/'
[junit4:junit4]   2> 979395 T2694 oasc.SolrResourceLoader.replaceClassLoader Adding 'file:/usr/home/hudson/hudson-slave/workspace/Lucene-Solr-Tests-4.x-Java6/solr/build/solr-core/test/J1/org.apache.solr.cloud.SyncSliceTest-jetty4-1371032087396/collection1/lib/README' to classloader
[junit4:junit4]   2> 979395 T2694 oasc.SolrResourceLoader.replaceClassLoader Adding 'file:/usr/home/hudson/hudson-slave/workspace/Lucene-Solr-Tests-4.x-Java6/solr/build/solr-core/test/J1/org.apache.solr.cloud.SyncSliceTest-jetty4-1371032087396/collection1/lib/classes/' to classloader
[junit4:junit4]   2> 979476 T2694 oasc.SolrConfig.<init> Using Lucene MatchVersion: LUCENE_44
[junit4:junit4]   2> 979533 T2694 oasc.SolrConfig.<init> Loaded SolrConfig: solrconfig.xml
[junit4:junit4]   2> 979635 T2694 oass.IndexSchema.readSchema Reading Solr Schema from schema.xml
[junit4:junit4]   2> 979641 T2694 oass.IndexSchema.readSchema [collection1] Schema name=test
[junit4:junit4]   2> 980254 T2694 oass.OpenExchangeRatesOrgProvider.init Initialized with rates=open-exchange-rates.json, refreshInterval=1440.
[junit4:junit4]   2> 980267 T2694 oass.IndexSchema.readSchema default search field in schema is text
[junit4:junit4]   2> 980271 T2694 oass.IndexSchema.readSchema unique key field: id
[junit4:junit4]   2> 980284 T2694 oass.FileExchangeRateProvider.reload Reloading exchange rates from file currency.xml
[junit4:junit4]   2> 980289 T2694 oass.FileExchangeRateProvider.reload Reloading exchange rates from file currency.xml
[junit4:junit4]   2> 980293 T2694 oass.OpenExchangeRatesOrgProvider.reload Reloading exchange rates from open-exchange-rates.json
[junit4:junit4]   2> 980294 T2694 oass.OpenExchangeRatesOrgProvider$OpenExchangeRates.<init> WARN Unknown key IMPORTANT NOTE
[junit4:junit4]   2> 980295 T2694 oass.OpenExchangeRatesOrgProvider$OpenExchangeRates.<init> WARN Expected key, got STRING
[junit4:junit4]   2> 980295 T2694 oass.OpenExchangeRatesOrgProvider.reload Reloading exchange rates from open-exchange-rates.json
[junit4:junit4]   2> 980296 T2694 oass.OpenExchangeRatesOrgProvider$OpenExchangeRates.<init> WARN Unknown key IMPORTANT NOTE
[junit4:junit4]   2> 980296 T2694 oass.OpenExchangeRatesOrgProvider$OpenExchangeRates.<init> WARN Expected key, got STRING
[junit4:junit4]   2> 980297 T2694 oasc.SolrCore.initDirectoryFactory solr.NRTCachingDirectoryFactory
[junit4:junit4]   2> 980297 T2694 oasc.SolrCore.<init> [collection1] Opening new SolrCore at /usr/home/hudson/hudson-slave/workspace/Lucene-Solr-Tests-4.x-Java6/solr/build/solr-core/test/J1/./org.apache.solr.cloud.SyncSliceTest-jetty4-1371032087396/collection1/, dataDir=./org.apache.solr.cloud.SyncSliceTest-1371032070401/jetty4/
[junit4:junit4]   2> 980297 T2694 oasc.JmxMonitoredMap.<init> JMX monitoring is enabled. Adding Solr mbeans to JMX Server: com.sun.jmx.mbeanserver.JmxMBeanServer@64d22462
[junit4:junit4]   2> 980298 T2694 oasc.SolrCore.initDirectoryFactory solr.NRTCachingDirectoryFactory
[junit4:junit4]   2> 980299 T2694 oasc.CachingDirectoryFactory.get return new directory for /usr/home/hudson/hudson-slave/workspace/Lucene-Solr-Tests-4.x-Java6/solr/build/solr-core/test/J1/org.apache.solr.cloud.SyncSliceTest-1371032070401/jetty4
[junit4:junit4]   2> 980300 T2694 oasc.SolrCore.getNewIndexDir New index directory detected: old=null new=./org.apache.solr.cloud.SyncSliceTest-1371032070401/jetty4/index/
[junit4:junit4]   2> 980301 T2694 oasc.SolrCore.initIndex WARN [collection1] Solr index directory './org.apache.solr.cloud.SyncSliceTest-1371032070401/jetty4/index' doesn't exist. Creating new index...
[junit4:junit4]   2> 980301 T2694 oasc.CachingDirectoryFactory.get return new directory for /usr/home/hudson/hudson-slave/workspace/Lucene-Solr-Tests-4.x-Java6/solr/build/solr-core/test/J1/org.apache.solr.cloud.SyncSliceTest-1371032070401/jetty4/index
[junit4:junit4]   2> 980308 T2694 oasc.SolrDeletionPolicy.onCommit SolrDeletionPolicy.onCommit: commits: num=1
[junit4:junit4]   2> 		commit{dir=NRTCachingDirectory(org.apache.lucene.store.NIOFSDirectory@/usr/home/hudson/hudson-slave/workspace/Lucene-Solr-Tests-4.x-Java6/solr/build/solr-core/test/J1/org.apache.solr.cloud.SyncSliceTest-1371032070401/jetty4/index lockFactory=org.apache.lucene.store.NativeFSLockFactory@52ea5e97; maxCacheMB=48.0 maxMergeSizeMB=4.0),segFN=segments_1,generation=1}
[junit4:junit4]   2> 980308 T2694 oasc.SolrDeletionPolicy.updateCommits newest commit generation = 1
[junit4:junit4]   2> 980311 T2694 oasup.UpdateRequestProcessorChain.init inserting DistributedUpdateProcessorFactory into updateRequestProcessorChain "dedupe"
[junit4:junit4]   2> 980312 T2694 oasup.UpdateRequestProcessorChain.init inserting DistributedUpdateProcessorFactory into updateRequestProcessorChain "stored_sig"
[junit4:junit4]   2> 980312 T2694 oasup.UpdateRequestProcessorChain.init inserting DistributedUpdateProcessorFactory into updateRequestProcessorChain "distrib-dup-test-chain-implicit"
[junit4:junit4]   2> 980313 T2694 oasc.RequestHandlers.initHandlersFromConfig created standard: solr.StandardRequestHandler
[junit4:junit4]   2> 980314 T2694 oasc.RequestHandlers.initHandlersFromConfig created /get: solr.RealTimeGetHandler
[junit4:junit4]   2> 980314 T2694 oasc.RequestHandlers.initHandlersFromConfig adding lazy requestHandler: solr.ReplicationHandler
[junit4:junit4]   2> 980317 T2694 oasc.RequestHandlers.initHandlersFromConfig created /replication: solr.ReplicationHandler
[junit4:junit4]   2> 980318 T2694 oasc.RequestHandlers.initHandlersFromConfig created /update: solr.UpdateRequestHandler
[junit4:junit4]   2> 980318 T2694 oasc.RequestHandlers.initHandlersFromConfig created /admin/: org.apache.solr.handler.admin.AdminHandlers
[junit4:junit4]   2> 980327 T2694 oashl.XMLLoader.init xsltCacheLifetimeSeconds=60
[junit4:junit4]   2> 980336 T2694 oass.SolrIndexSearcher.<init> Opening Searcher@3134f26e main
[junit4:junit4]   2> 980337 T2694 oasu.CommitTracker.<init> Hard AutoCommit: disabled
[junit4:junit4]   2> 980337 T2694 oasu.CommitTracker.<init> Soft AutoCommit: disabled
[junit4:junit4]   2> 980342 T2697 oasc.SolrCore.registerSearcher [collection1] Registered new searcher Searcher@3134f26e main{StandardDirectoryReader(segments_1:1)}
[junit4:junit4]   2> 980344 T2694 oasc.CoreContainer.registerCore registering core: collection1
[junit4:junit4]   2> 980344 T2694 oasc.ZkController.register Register replica - core:collection1 address:http://127.0.0.1:39307/sbp/vt collection:collection1 shard:shard1
[junit4:junit4]   2> 980347 T2694 oasc.ZkController.register We are http://127.0.0.1:39307/sbp/vt/collection1/ and leader is http://127.0.0.1:52168/sbp/vt/collection1/
[junit4:junit4]   2> 980347 T2694 oasc.ZkController.register No LogReplay needed for core=collection1 baseURL=http://127.0.0.1:39307/sbp/vt
[junit4:junit4]   2> 980347 T2694 oasc.ZkController.checkRecovery Core needs to recover:collection1
[junit4:junit4]   2> 980348 T2694 oasu.DefaultSolrCoreState.doRecovery Running recovery - first canceling any ongoing recovery
[junit4:junit4]   2> ASYNC  NEW_CORE C1617 name=collection1 org.apache.solr.core.SolrCore@5d24600a url=http://127.0.0.1:39307/sbp/vt/collection1 node=127.0.0.1:39307_sbp%2Fvt C1617_STATE=coll:collection1 core:collection1 props:{state=down, core=collection1, collection=collection1, node_name=127.0.0.1:39307_sbp%2Fvt, base_url=http://127.0.0.1:39307/sbp/vt}
[junit4:junit4]   2> 980348 T2698 C1617 P39307 oasc.RecoveryStrategy.run Starting recovery process.  core=collection1 recoveringAfterStartup=true
[junit4:junit4]   2> 980348 T2698 C1617 P39307 oasc.RecoveryStrategy.doRecovery ###### startupVersions=[]
[junit4:junit4]   2> 980348 T2694 oascc.ZkStateReader.updateClusterState Updating cloud state from ZooKeeper... 
[junit4:junit4]   2> 980348 T2698 C1617 P39307 oasc.ZkController.publish publishing core=collection1 state=recovering
[junit4:junit4]   2> 980349 T2698 C1617 P39307 oasc.ZkController.publish numShards not found on descriptor - reading it from system property
[junit4:junit4]   2> 980349 T2599 oass.SolrDispatchFilter.init user.dir=/usr/home/hudson/hudson-slave/workspace/Lucene-Solr-Tests-4.x-Java6/solr/build/solr-core/test/J1
[junit4:junit4]   2> 980350 T2599 oass.SolrDispatchFilter.init SolrDispatchFilter.init() done
[junit4:junit4]   2> 980350 T2698 C1617 P39307 oascsi.HttpClientUtil.createClient Creating new http client, config:maxConnections=128&maxConnectionsPerHost=32&followRedirects=false
[junit4:junit4]   2> 980351 T2599 oascsi.HttpClientUtil.createClient Creating new http client, config:maxConnections=128&maxConnectionsPerHost=32&followRedirects=false
[junit4:junit4]   2> 980374 T2599 oascc.ZkStateReader.updateClusterState Updating cloud state from ZooKeeper... 
[junit4:junit4]   2> 980375 T2637 oasha.CoreAdminHandler.handleWaitForStateAction Going to wait for coreNodeName: 127.0.0.1:39307_sbp%2Fvt_collection1, state: recovering, checkLive: true, onlyIfLeader: true
[junit4:junit4]   2> 980375 T2599 oasc.AbstractFullDistribZkTestBase.waitForThingsToLevelOut Wait for recoveries to finish - wait 15 for each attempt
[junit4:junit4]   2> 980376 T2599 oasc.AbstractDistribZkTestBase.waitForRecoveriesToFinish Wait for recoveries to finish - collection: collection1 failOnTimeout:true timeout (sec):15
[junit4:junit4]   2> 980377 T2599 oascc.ZkStateReader.updateClusterState Updating cloud state from ZooKeeper... 
[junit4:junit4]   2> 981379 T2599 oascc.ZkStateReader.updateClusterState Updating cloud state from ZooKeeper... 
[junit4:junit4]   2> 981591 T2622 oascc.ZkStateReader.updateClusterState Updating cloud state from ZooKeeper... 
[junit4:junit4]   2> 981592 T2622 oasc.Overseer$ClusterStateUpdater.updateState Update state numShards=1 message={
[junit4:junit4]   2> 	  "operation":"state",
[junit4:junit4]   2> 	  "core_node_name":"127.0.0.1:39307_sbp%2Fvt_collection1",
[junit4:junit4]   2> 	  "numShards":"1",
[junit4:junit4]   2> 	  "shard":"shard1",
[junit4:junit4]   2> 	  "roles":null,
[junit4:junit4]   2> 	  "state":"recovering",
[junit4:junit4]   2> 	  "shard_state":"active",
[junit4:junit4]   2> 	  "core":"collection1",
[junit4:junit4]   2> 	  "collection":"collection1",
[junit4:junit4]   2> 	  "shard_range":null,
[junit4:junit4]   2> 	  "node_name":"127.0.0.1:39307_sbp%2Fvt",
[junit4:junit4]   2> 	  "base_url":"http://127.0.0.1:39307/sbp/vt"}
[junit4:junit4]   2> 981610 T2693 oascc.ZkStateReader$2.process A cluster state change: WatchedEvent state:SyncConnected type:NodeDataChanged path:/clusterstate.json, has occurred - updating... (live nodes size: 5)
[junit4:junit4]   2> 981611 T2657 oascc.ZkStateReader$2.process A cluster state change: WatchedEvent state:SyncConnected type:NodeDataChanged path:/clusterstate.json, has occurred - updating... (live nodes size: 5)
[junit4:junit4]   2> 981610 T2621 oascc.ZkStateReader$2.process A cluster state change: WatchedEvent state:SyncConnected type:NodeDataChanged path:/clusterstate.json, has occurred - updating... (live nodes size: 5)
[junit4:junit4]   2> 981610 T2628 oascc.ZkStateReader$2.process A cluster state change: WatchedEvent state:SyncConnected type:NodeDataChanged path:/clusterstate.json, has occurred - updating... (live nodes size: 5)
[junit4:junit4]   2> 981610 T2674 oascc.ZkStateReader$2.process A cluster state change: WatchedEvent state:SyncConnected type:NodeDataChanged path:/clusterstate.json, has occurred - updating... (live nodes size: 5)
[junit4:junit4]   2> 981610 T2641 oascc.ZkStateReader$2.process A cluster state change: WatchedEvent state:SyncConnected type:NodeDataChanged path:/clusterstate.json, has occurred - updating... (live nodes size: 5)
[junit4:junit4]   2> 982379 T2637 oasha.CoreAdminHandler.handleWaitForStateAction Waited coreNodeName: 127.0.0.1:39307_sbp%2Fvt_collection1, state: recovering, checkLive: true, onlyIfLeader: true for: 2 seconds.
[junit4:junit4]   2> 982379 T2637 oass.SolrDispatchFilter.handleAdminRequest [admin] webapp=null path=/admin/cores params={coreNodeName=127.0.0.1:39307_sbp%252Fvt_collection1&state=recovering&nodeName=127.0.0.1:39307_sbp%252Fvt&action=PREPRECOVERY&checkLive=true&core=collection1&wt=javabin&onlyIfLeader=true&version=2} status=0 QTime=2004 
[junit4:junit4]   2> 982382 T2599 oascc.ZkStateReader.updateClusterState Updating cloud state from ZooKeeper... 
[junit4:junit4]   2> 983385 T2599 oascc.ZkStateReader.updateClusterState Updating cloud state from ZooKeeper... 
[junit4:junit4]   2>  C1617_STATE=coll:collection1 core:collection1 props:{shard=shard1, state=recovering, core=collection1, collection=collection1, node_name=127.0.0.1:39307_sbp%2Fvt, base_url=http://127.0.0.1:39307/sbp/vt}
[junit4:junit4]   2> 984381 T2698 C1617 P39307 oasc.RecoveryStrategy.doRecovery Attempting to PeerSync from http://127.0.0.1:52168/sbp/vt/collection1/ core=collection1 - recoveringAfterStartup=true
[junit4:junit4]   2> 984381 T2698 C1617 P39307 oasu.PeerSync.sync PeerSync: core=collection1 url=http://127.0.0.1:39307/sbp/vt START replicas=[http://127.0.0.1:52168/sbp/vt/collection1/] nUpdates=100
[junit4:junit4]   2> 984382 T2698 C1617 P39307 oasu.PeerSync.sync WARN no frame of reference to tell of we've missed updates
[junit4:junit4]   2> 984382 T2698 C1617 P39307 oasc.RecoveryStrategy.doRecovery PeerSync Recovery was not successful - trying replication. core=collection1
[junit4:junit4]   2> 984382 T2698 C1617 P39307 oasc.RecoveryStrategy.doRecovery Starting Replication Recovery. core=collection1
[junit4:junit4]   2> 984382 T2698 C1617 P39307 oasc.RecoveryStrategy.doRecovery Begin buffering updates. core=collection1
[junit4:junit4]   2> 984382 T2698 C1617 P39307 oasu.UpdateLog.bufferUpdates Starting to buffer updates. FSUpdateLog{state=ACTIVE, tlog=null}
[junit4:junit4]   2> 984383 T2698 C1617 P39307 oasc.RecoveryStrategy.replicate Attempting to replicate from http://127.0.0.1:52168/sbp/vt/collection1/. core=collection1
[junit4:junit4]   2> 984383 T2698 C1617 P39307 oascsi.HttpClientUtil.createClient Creating new http client, config:maxConnections=128&maxConnectionsPerHost=32&followRedirects=false
[junit4:junit4]   2> ASYNC  NEW_CORE C1618 name=collection1 org.apache.solr.core.SolrCore@3c488812 url=http://127.0.0.1:52168/sbp/vt/collection1 node=127.0.0.1:52168_sbp%2Fvt C1618_STATE=coll:collection1 core:collection1 props:{shard=shard1, state=active, core=collection1, collection=collection1, node_name=127.0.0.1:52168_sbp%2Fvt, base_url=http://127.0.0.1:52168/sbp/vt, leader=true}
[junit4:junit4]   2> 984384 T2632 C1618 P52168 oasc.SolrCore.execute [collection1] webapp=/sbp/vt path=/get params={getVersions=100&distrib=false&wt=javabin&qt=/get&version=2} status=0 QTime=0 
[junit4:junit4]   2> 984389 T2599 oascc.ZkStateReader.updateClusterState Updating cloud state from ZooKeeper... 
[junit4:junit4]   2> 984393 T2631 C1618 P52168 oasu.DirectUpdateHandler2.commit start commit{,optimize=false,openSearcher=false,waitSearcher=true,expungeDeletes=false,softCommit=false,prepareCommit=false}
[junit4:junit4]   2> 984397 T2631 C1618 P52168 oasc.SolrDeletionPolicy.onCommit SolrDeletionPolicy.onCommit: commits: num=3
[junit4:junit4]   2> 		commit{dir=NRTCachingDirectory(org.apache.lucene.store.NIOFSDirectory@/usr/home/hudson/hudson-slave/workspace/Lucene-Solr-Tests-4.x-Java6/solr/build/solr-core/test/J1/org.apache.solr.cloud.SyncSliceTest-1371032070401/jetty1/index lockFactory=org.apache.lucene.store.NativeFSLockFactory@76002e16; maxCacheMB=48.0 maxMergeSizeMB=4.0),segFN=segments_2,generation=2}
[junit4:junit4]   2> 		commit{dir=NRTCachingDirectory(org.apache.lucene.store.NIOFSDirectory@/usr/home/hudson/hudson-slave/workspace/Lucene-Solr-Tests-4.x-Java6/solr/build/solr-core/test/J1/org.apache.solr.cloud.SyncSliceTest-1371032070401/jetty1/index lockFactory=org.apache.lucene.store.NativeFSLockFactory@76002e16; maxCacheMB=48.0 maxMergeSizeMB=4.0),segFN=segments_3,generation=3}
[junit4:junit4]   2> 		commit{dir=NRTCachingDirectory(org.apache.lucene.store.NIOFSDirectory@/usr/home/hudson/hudson-slave/workspace/Lucene-Solr-Tests-4.x-Java6/solr/build/solr-core/test/J1/org.apache.solr.cloud.SyncSliceTest-1371032070401/jetty1/index lockFactory=org.apache.lucene.store.NativeFSLockFactory@76002e16; maxCacheMB=48.0 maxMergeSizeMB=4.0),segFN=segments_4,generation=4}
[junit4:junit4]   2> 984398 T2631 C1618 P52168 oasc.SolrDeletionPolicy.updateCommits newest commit generation = 4
[junit4:junit4]   2> 984399 T2631 C1618 P52168 oasu.DirectUpdateHandler2.commit end_commit_flush
[junit4:junit4]   2> 984400 T2631 C1618 P52168 oasup.LogUpdateProcessor.finish [collection1] webapp=/sbp/vt path=/update params={waitSearcher=true&openSearcher=false&commit=true&wt=javabin&commit_end_point=true&version=2&softCommit=false} {commit=} 0 7
[junit4:junit4]   2> 984401 T2698 C1617 P39307 oash.ReplicationHandler.inform Commits will be reserved for  10000
[junit4:junit4]   2> 984401 T2698 C1617 P39307 oash.SnapPuller.<init>  No value set for 'pollInterval'. Timer Task not started.
[junit4:junit4]   2> 984403 T2634 C1618 P52168 oasc.SolrCore.execute [collection1] webapp=/sbp/vt path=/replication params={command=indexversion&qt=/replication&wt=javabin&version=2} status=0 QTime=0 
[junit4:junit4]   2> 984403 T2698 C1617 P39307 oash.SnapPuller.fetchLatestIndex Master's generation: 4
[junit4:junit4]   2> 984404 T2698 C1617 P39307 oash.SnapPuller.fetchLatestIndex Slave's generation: 1
[junit4:junit4]   2> 984404 T2698 C1617 P39307 oash.SnapPuller.fetchLatestIndex Starting replication process
[junit4:junit4]   2> 984407 T2634 C1618 P52168 oasc.SolrCore.execute [collection1] webapp=/sbp/vt path=/replication params={command=filelist&qt=/replication&wt=javabin&generation=4&version=2} status=0 QTime=1 
[junit4:junit4]   2> 984407 T2698 C1617 P39307 oash.SnapPuller.fetchLatestIndex Number of files in latest index in master: 1
[junit4:junit4]   2> 984409 T2698 C1617 P39307 oasc.CachingDirectoryFactory.get return new directory for /usr/home/hudson/hudson-slave/workspace/Lucene-Solr-Tests-4.x-Java6/solr/build/solr-core/test/J1/org.apache.solr.cloud.SyncSliceTest-1371032070401/jetty4/index.20130612041456964
[junit4:junit4]   2> 984410 T2698 C1617 P39307 oash.SnapPuller.fetchLatestIndex Starting download to NRTCachingDirectory(org.apache.lucene.store.NIOFSDirectory@/usr/home/hudson/hudson-slave/workspace/Lucene-Solr-Tests-4.x-Java6/solr/build/solr-core/test/J1/org.apache.solr.cloud.SyncSliceTest-1371032070401/jetty4/index.20130612041456964 lockFactory=org.apache.lucene.store.NativeFSLockFactory@43e06011; maxCacheMB=48.0 maxMergeSizeMB=4.0) fullCopy=false
[junit4:junit4]   2> 984414 T2634 C1618 P52168 oasc.SolrCore.execute [collection1] webapp=/sbp/vt path=/replication params={file=segments_4&command=filecontent&checksum=true&wt=filestream&qt=/replication&generation=4} status=0 QTime=0 
[junit4:junit4]   2> 984415 T2698 C1617 P39307 oash.SnapPuller.fetchLatestIndex Total time taken for download : 0 secs
[junit4:junit4]   2> 984436 T2698 C1617 P39307 oasu.DefaultSolrCoreState.newIndexWriter Creating new IndexWriter...
[junit4:junit4]   2> 984437 T2698 C1617 P39307 oasu.DefaultSolrCoreState.newIndexWriter Waiting until IndexWriter is unused... core=collection1
[junit4:junit4]   2> 984441 T2698 C1617 P39307 oasc.SolrDeletionPolicy.onInit SolrDeletionPolicy.onInit: commits: num=2
[junit4:junit4]   2> 		commit{dir=NRTCachingDirectory(org.apache.lucene.store.NIOFSDirectory@/usr/home/hudson/hudson-slave/workspace/Lucene-Solr-Tests-4.x-Java6/solr/build/solr-core/test/J1/org.apache.solr.cloud.SyncSliceTest-1371032070401/jetty4/index lockFactory=org.apache.lucene.store.NativeFSLockFactory@52ea5e97; maxCacheMB=48.0 maxMergeSizeMB=4.0),segFN=segments_1,generation=1}
[junit4:junit4]   2> 		commit{dir=NRTCachingDirectory(org.apache.lucene.store.NIOFSDirectory@/usr/home/hudson/hudson-slave/workspace/Lucene-Solr-Tests-4.x-Java6/solr/build/solr-core/test/J1/org.apache.solr.cloud.SyncSliceTest-1371032070401/jetty4/index lockFactory=org.apache.lucene.store.NativeFSLockFactory@52ea5e97; maxCacheMB=48.0 maxMergeSizeMB=4.0),segFN=segments_4,generation=4}
[junit4:junit4]   2> 984442 T2698 C1617 P39307 oasc.SolrDeletionPolicy.updateCommits newest commit generation = 4
[junit4:junit4]   2> 984442 T2698 C1617 P39307 oasu.DefaultSolrCoreState.newIndexWriter New IndexWriter is ready to be used.
[junit4:junit4]   2> 984443 T2698 C1617 P39307 oass.SolrIndexSearcher.<init> Opening Searcher@68077fdf main
[junit4:junit4]   2> 984444 T2697 oasc.SolrCore.registerSearcher [collection1] Registered new searcher Searcher@68077fdf main{StandardDirectoryReader(segments_4:1:nrt)}
[junit4:junit4]   2> 984445 T2698 C1617 P39307 oasc.CachingDirectoryFactory.closeCacheValue looking to close /usr/home/hudson/hudson-slave/workspace/Lucene-Solr-Tests-4.x-Java6/solr/build/solr-core/test/J1/org.apache.solr.cloud.SyncSliceTest-1371032070401/jetty4/index.20130612041456964 [CachedDir<<refCount=0;path=/usr/home/hudson/hudson-slave/workspace/Lucene-Solr-Tests-4.x-Java6/solr/build/solr-core/test/J1/org.apache.solr.cloud.SyncSliceTest-1371032070401/jetty4/index.20130612041456964;done=true>>]
[junit4:junit4]   2> 984445 T2698 C1617 P39307 oasc.CachingDirectoryFactory.close Closing directory: /usr/home/hudson/hudson-slave/workspace/Lucene-Solr-Tests-4.x-Java6/solr/build/solr-core/test/J1/org.apache.solr.cloud.SyncSliceTest-1371032070401/jetty4/index.20130612041456964
[junit4:junit4]   2> 984445 T2698 C1617 P39307 oasc.CachingDirectoryFactory.closeCacheValue Removing directory before core close: /usr/home/hudson/hudson-slave/workspace/Lucene-Solr-Tests-4.x-Java6/solr/build/solr-core/test/J1/org.apache.solr.cloud.SyncSliceTest-1371032070401/jetty4/index.20130612041456964
[junit4:junit4]   2> 984446 T2698 C1617 P39307 oasc.RecoveryStrategy.replay No replay needed. core=collection1
[junit4:junit4]   2> 984446 T2698 C1617 P39307 oasc.RecoveryStrategy.doRecovery Replication Recovery was successful - registering as Active. core=collection1
[junit4:junit4]   2> 984447 T2698 C1617 P39307 oasc.ZkController.publish publishing core=collection1 state=active
[junit4:junit4]   2> 984447 T2698 C1617 P39307 oasc.ZkController.publish numShards not found on descriptor - reading it from system property
[junit4:junit4]   2> 984448 T2698 C1617 P39307 oasc.RecoveryStrategy.doRecovery Finished recovery process. core=collection1
[junit4:junit4]   2> 984619 T2622 oascc.ZkStateReader.updateClusterState Updating cloud state from ZooKeeper... 
[junit4:junit4]   2> 984620 T2622 oasc.Overseer$ClusterStateUpdater.updateState Update state numShards=1 message={
[junit4:junit4]   2> 	  "operation":"state",
[junit4:junit4]   2> 	  "core_node_name":"127.0.0.1:39307_sbp%2Fvt_collection1",
[junit4:junit4]   2> 	  "numShards":"1",
[junit4:junit4]   2> 	  "shard":"shard1",
[junit4:junit4]   2> 	  "roles":null,
[junit4:junit4]   2> 	  "state":"active",
[junit4:junit4]   2> 	  "shard_state":"active",
[junit4:junit4]   2> 	  "core":"collection1",
[junit4:junit4]   2> 	  "collection":"collection1",
[junit4:junit4]   2> 	  "shard_range":null,
[junit4:junit4]   2> 	  "node_name":"127.0.0.1:39307_sbp%2Fvt",
[junit4:junit4]   2> 	  "base_url":"http://127.0.0.1:39307/sbp/vt"}
[junit4:junit4]   2> 984634 T2641 oascc.ZkStateReader$2.process A cluster state change: WatchedEvent state:SyncConnected type:NodeDataChanged path:/clusterstate.json, has occurred - updating... (live nodes size: 5)
[junit4:junit4]   2> 984634 T2657 oascc.ZkStateReader$2.process A cluster state change: WatchedEvent state:SyncConnected type:NodeDataChanged path:/clusterstate.json, has occurred - updating... (live nodes size: 5)
[junit4:junit4]   2> 984634 T2621 oascc.ZkStateReader$2.process A cluster state change: WatchedEvent state:SyncConnected type:NodeDataChanged path:/clusterstate.json, has occurred - updating... (live nodes size: 5)
[junit4:junit4]   2> 984634 T2628 oascc.ZkStateReader$2.process A cluster state change: WatchedEvent state:SyncConnected type:NodeDataChanged path:/clusterstate.json, has occurred - updating... (live nodes size: 5)
[junit4:junit4]   2> 984634 T2693 oascc.ZkStateReader$2.process A cluster state change: WatchedEvent state:SyncConnected type:NodeDataChanged path:/clusterstate.json, has occurred - updating... (live nodes size: 5)
[junit4:junit4]   2> 984634 T2674 oascc.ZkStateReader$2.process A cluster state change: WatchedEvent state:SyncConnected type:NodeDataChanged path:/clusterstate.json, has occurred - updating... (live nodes size: 5)
[junit4:junit4]   2> 985392 T2599 oascc.ZkStateReader.updateClusterState Updating cloud state from ZooKeeper... 
[junit4:junit4]   2> 985393 T2599 oasc.AbstractDistribZkTestBase.waitForRecoveriesToFinish Recoveries finished - collection: collection1
[junit4:junit4]   2> ASYNC  NEW_CORE C1619 name=collection1 org.apache.solr.core.SolrCore@839df4b url=http://127.0.0.1:60562/sbp/vt/collection1 node=127.0.0.1:60562_sbp%2Fvt C1619_STATE=coll:control_collection core:collection1 props:{shard=shard1, state=active, core=collection1, collection=control_collection, node_name=127.0.0.1:60562_sbp%2Fvt, base_url=http://127.0.0.1:60562/sbp/vt, leader=true}
[junit4:junit4]   2> 985405 T2611 C1619 P60562 oasu.DirectUpdateHandler2.commit start commit{,optimize=false,openSearcher=true,waitSearcher=true,expungeDeletes=false,softCommit=false,prepareCommit=false}
[junit4:junit4]   2> 985411 T2611 C1619 P60562 oasc.SolrDeletionPolicy.onInit SolrDeletionPolicy.onInit: commits: num=1
[junit4:junit4]   2> 		commit{dir=NRTCachingDirectory(org.apache.lucene.store.NIOFSDirectory@/usr/home/hudson/hudson-slave/workspace/Lucene-Solr-Tests-4.x-Java6/solr/build/solr-core/test/J1/org.apache.solr.cloud.SyncSliceTest-1371032070401/control/data/index lockFactory=org.apache.lucene.store.NativeFSLockFactory@72ebb88e; maxCacheMB=48.0 maxMergeSizeMB=4.0),segFN=segments_1,generation=1}
[junit4:junit4]   2> 985412 T2611 C1619 P60562 oasc.SolrDeletionPolicy.updateCommits newest commit generation = 1
[junit4:junit4]   2> 985416 T2611 C1619 P60562 oasc.SolrDeletionPolicy.onCommit SolrDeletionPolicy.onCommit: commits: num=2
[junit4:junit4]   2> 		commit{dir=NRTCachingDirectory(org.apache.lucene.store.NIOFSDirectory@/usr/home/hudson/hudson-slave/workspace/Lucene-Solr-Tests-4.x-Java6/solr/build/solr-core/test/J1/org.apache.solr.cloud.SyncSliceTest-1371032070401/control/data/index lockFactory=org.apache.lucene.store.NativeFSLockFactory@72ebb88e; maxCacheMB=48.0 maxMergeSizeMB=4.0),segFN=segments_1,generation=1}
[junit4:junit4]   2> 		commit{dir=NRTCachingDirectory(org.apache.lucene.store.NIOFSDirectory@/usr/home/hudson/hudson-slave/workspace/Lucene-Solr-Tests-4.x-Java6/solr/build/solr-core/test/J1/org.apache.solr.cloud.SyncSliceTest-1371032070401/control/data/index lockFactory=org.apache.lucene.store.NativeFSLockFactory@72ebb88e; maxCacheMB=48.0 maxMergeSizeMB=4.0),segFN=segments_2,generation=2}
[junit4:junit4]   2> 985417 T2611 C1619 P60562 oasc.SolrDeletionPolicy.updateCommits newest commit generation = 2
[junit4:junit4]   2> 985419 T2611 C1619 P60562 oass.SolrIndexSearcher.<init> Opening Searcher@e09e5b6 main
[junit4:junit4]   2> 985419 T2611 C1619 P60562 oasu.DirectUpdateHandler2.commit end_commit_flush
[junit4:junit4]   2> 985420 T2625 oasc.SolrCore.registerSearcher [collection1] Registered new searcher Searcher@e09e5b6 main{StandardDirectoryReader(segments_2:1:nrt)}
[junit4:junit4]   2> 985420 T2611 C1619 P60562 oasup.LogUpdateProcessor.finish [collection1] webapp=/sbp/vt path=/update params={waitSearcher=true&commit=true&wt=javabin&version=2&softCommit=false} {commit=} 0 15
[junit4:junit4]   2> 985431 T2633 C1618 P52168 oasu.DirectUpdateHandler2.commit start commit{,optimize=false,openSearcher=true,waitSearcher=true,expungeDeletes=false,softCommit=false,prepareCommit=false}
[junit4:junit4]   2> 985435 T2633 C1618 P52168 oasc.SolrDeletionPolicy.onCommit SolrDeletionPolicy.onCommit: commits: num=3
[junit4:junit4]   2> 		commit{dir=NRTCachingDirectory(org.apache.lucene.store.NIOFSDirectory@/usr/home/hudson/hudson-slave/workspace/Lucene-Solr-Tests-4.x-Java6/solr/build/solr-core/test/J1/org.apache.solr.cloud.SyncSliceTest-1371032070401/jetty1/index lockFactory=org.apache.lucene.store.NativeFSLockFactory@76002e16; maxCacheMB=48.0 maxMergeSizeMB=4.0),segFN=segments_3,generation=3}
[junit4:junit4]   2> 		commit{dir=NRTCachingDirectory(org.apache.lucene.store.NIOFSDirectory@/usr/home/hudson/hudson-slave/workspace/Lucene-Solr-Tests-4.x-Java6/solr/build/solr-core/test/J1/org.apache.solr.cloud.SyncSliceTest-1371032070401/jetty1/index lockFactory=org.apache.lucene.store.NativeFSLockFactory@76002e16; maxCacheMB=48.0 maxMergeSizeMB=4.0),segFN=segments_4,generation=4}
[junit4:junit4]   2> 		commit{dir=NRTCachingDirectory(org.apache.lucene.store.NIOFSDirectory@/usr/home/hudson/hudson-slave/workspace/Lucene-Solr-Tests-4.x-Java6/solr/build/solr-core/test/J1/org.apache.solr.cloud.SyncSliceTest-1371032070401/jetty1/index lockFactory=org.apache.lucene.store.NativeFSLockFactory@76002e16; maxCacheMB=48.0 maxMergeSizeMB=4.0),segFN=segments_5,generation=5}
[junit4:junit4]   2> 985436 T2633 C1618 P52168 oasc.SolrDeletionPolicy.updateCommits newest commit generation = 5
[junit4:junit4]   2> 985437 T2633 C1618 P52168 oass.SolrIndexSearcher.<init> Opening Searcher@70828f46 main
[junit4:junit4]   2> 985437 T2633 C1618 P52168 oasu.DirectUpdateHandler2.commit end_commit_flush
[junit4:junit4]   2> 985438 T2643 oasc.SolrCore.registerSearcher [collection1] Registered new searcher Searcher@70828f46 main{StandardDirectoryReader(segments_2:1:nrt)}
[junit4:junit4]   2> 985439 T2633 C1618 P52168 oasu.SolrCmdDistributor.distribCommit Distrib commit to:[StdNode: http://127.0.0.1:39271/sbp/vt/collection1/, StdNode: http://127.0.0.1:39279/sbp/vt/collection1/, StdNode: http://127.0.0.1:39307/sbp/vt/collection1/] params:commit_end_point=true&commit=true&softCommit=false&waitSearcher=true&expungeDeletes=false
[junit4:junit4]   2> ASYNC  NEW_CORE C1620 name=collection1 org.apache.solr.core.SolrCore@74e71d58 url=http://127.0.0.1:39279/sbp/vt/collection1 node=127.0.0.1:39279_sbp%2Fvt C1620_STATE=coll:collection1 core:collection1 props:{shard=shard1, state=active, core=collection1, collection=collection1, node_name=127.0.0.1:39279_sbp%2Fvt, base_url=http://127.0.0.1:39279/sbp/vt}
[junit4:junit4]   2> 985455 T2664 C1620 P39279 oasu.DirectUpdateHandler2.commit start commit{,optimize=false,openSearcher=true,waitSearcher=true,expungeDeletes=false,softCommit=false,prepareCommit=false}
[junit4:junit4]   2> ASYNC  NEW_CORE C1621 name=collection1 org.apache.solr.core.SolrCore@1dd44625 url=http://127.0.0.1:39271/sbp/vt/collection1 node=127.0.0.1:39271_sbp%2Fvt C1621_STATE=coll:collection1 core:collection1 props:{shard=shard1, state=active, core=collection1, collection=collection1, node_name=127.0.0.1:39271_sbp%2Fvt, base_url=http://127.0.0.1:39271/sbp/vt}
[junit4:junit4]   2> 985456 T2647 C1621 P39271 oasu.DirectUpdateHandler2.commit start commit{,optimize=false,openSearcher=true,waitSearcher=true,expungeDeletes=false,softCommit=false,prepareCommit=false}
[junit4:junit4]   2>  C1617_STATE=coll:collection1 core:collection1 props:{shard=shard1, state=active, core=collection1, collection=collection1, node_name=127.0.0.1:39307_sbp%2Fvt, base_url=http://127.0.0.1:39307/sbp/vt}
[junit4:junit4]   2> 985455 T2683 C1617 P39307 oasu.DirectUpdateHandler2.commit start commit{,optimize=false,openSearcher=true,waitSearcher=true,expungeDeletes=false,softCommit=false,prepareCommit=false}
[junit4:junit4]   2> 985472 T2664 C1620 P39279 oasc.SolrDeletionPolicy.onCommit SolrDeletionPolicy.onCommit: commits: num=2
[junit4:junit4]   2> 		commit{dir=NRTCachingDirectory(org.apache.lucene.store.NIOFSDirectory@/usr/home/hudson/hudson-slave/workspace/Lucene-Solr-Tests-4.x-Java6/solr/build/solr-core/test/J1/org.apache.solr.cloud.SyncSliceTest-1371032070401/jetty3/index lockFactory=org.apache.lucene.store.NativeFSLockFactory@40d137ab; maxCacheMB=48.0 maxMergeSizeMB=4.0),segFN=segments_3,generation=3}
[junit4:junit4]   2> 		commit{dir=NRTCachingDirectory(org.apache.lucene.store.NIOFSDirectory@/usr/home/hudson/hudson-slave/workspace/Lucene-Solr-Tests-4.x-Java6/solr/build/solr-core/test/J1/org.apache.solr.cloud.SyncSliceTest-1371032070401/jetty3/index lockFactory=org.apache.lucene.store.NativeFSLockFactory@40d137ab; maxCacheMB=48.0 maxMergeSizeMB=4.0),segFN=segments_4,generation=4}
[junit4:junit4]   2> 985472 T2647 C1621 P39271 oasc.SolrDeletionPolicy.onCommit SolrDeletionPolicy.onCommit: commits: num=2
[junit4:junit4]   2> 		commit{dir=NRTCachingDirectory(org.apache.lucene.store.NIOFSDirectory@/usr/home/hudson/hudson-slave/workspace/Lucene-Solr-Tests-4.x-Java6/solr/build/solr-core/test/J1/org.apache.solr.cloud.SyncSliceTest-1371032070401/jetty2/index lockFactory=org.apache.lucene.store.NativeFSLockFactory@5ed171d0; maxCacheMB=48.0 maxMergeSizeMB=4.0),segFN=segments_2,generation=2}
[junit4:junit4]   2> 		commit{dir=NRTCachingDirectory(org.apache.lucene.store.NIOFSDirectory@/usr/home/hudson/hudson-slave/workspace/Lucene-Solr-Tests-4.x-Java6/solr/build/solr-core/test/J1/org.apache.solr.cloud.SyncSliceTest-1371032070401/jetty2/index lockFactory=org.apache.lucene.store.NativeFSLockFactory@5ed171d0; maxCacheMB=48.0 maxMergeSizeMB=4.0),segFN=segments_3,generation=3}
[junit4:junit4]   2> 985472 T2664 C1620 P39279 oasc.SolrDeletionPolicy.updateCommits newest commit generation = 4
[junit4:junit4]   2> 985473 T2683 C1617 P39307 oasc.SolrDeletionPolicy.onCommit SolrDeletionPolicy.onCommit: commits: num=2
[junit4:junit4]   2> 		commit{dir=NRTCachingDirectory(org.apache.lucene.store.NIOFSDirectory@/usr/home/hudson/hudson-slave/workspace/Lucene-Solr-Tests-4.x-Java6/solr/build/solr-core/test/J1/org.apache.solr.cloud.SyncSliceTest-1371032070401/jetty4/index lockFactory=org.apache.lucene.store.NativeFSLockFactory@52ea5e97; maxCacheMB=48.0 maxMergeSizeMB=4.0),segFN=segments_4,generation=4}
[junit4:junit4]   2> 		commit{dir=NRTCachingDirectory(org.apache.lucene.store.NIOFSDirectory@/usr/home/hudson/hudson-slave/workspace/Lucene-Solr-Tests-4.x-Java6/solr/build/solr-core/test/J1/org.apache.solr.cloud.SyncSliceTest-1371032070401/jetty4/index lockFactory=org.apache.lucene.store.NativeFSLockFactory@52ea5e97; maxCacheMB=48.0 maxMergeSizeMB=4.0),segFN=segments_5,generation=5}
[junit4:junit4]   2> 985473 T2647 C1621 P39271 oasc.SolrDeletionPolicy.updateCommits newest commit generation = 3
[junit4:junit4]   2> 985474 T2683 C1617 P39307 oasc.SolrDeletionPolicy.updateCommits newest commit generation = 5
[junit4:junit4]   2> 985475 T2664 C1620 P39279 oass.SolrIndexSearcher.<init> Opening Searcher@4208f7a6 main
[junit4:junit4]   2> 985475 T2664 C1620 P39279 oasu.DirectUpdateHandler2.commit end_commit_flush
[junit4:junit4]   2> 985476 T2647 C1621 P39271 oass.SolrIndexSearcher.<init> Opening Searcher@200063a1 main
[junit4:junit4]   2> 985476 T2683 C1617 P39307 oass.SolrIndexSearcher.<init> Opening Searcher@13bbe068 main
[junit4:junit4]   2> 985476 T2678 oasc.SolrCore.registerSearcher [collection1] Registered new searcher Searcher@4208f7a6 main{StandardDirectoryReader(segments_3:1:nrt)}
[junit4:junit4]   2> 985477 T2683 C1617 P39307 oasu.DirectUpdateHandler2.commit end_commit_flush
[junit4:junit4]   2> 985477 T2664 C1620 P39279 oasup.LogUpdateProcessor.finish [collection1] webapp=/sbp/vt path=/update params={waitSearcher=true&commit=true&wt=javabin&expungeDeletes=false&commit_end_point=true&version=2&softCommit=false} {commit=} 0 22
[junit4:junit4]   2> 985476 T2647 C1621 P39271 oasu.DirectUpdateHandler2.commit end_commit_flush
[junit4:junit4]   2> 985477 T2697 oasc.SolrCore.registerSearcher [collection1] Registered new searcher Searcher@13bbe068 main{StandardDirectoryReader(segments_4:1:nrt)}
[junit4:junit4]   2> 985477 T2659 oasc.SolrCore.registerSearcher [collection1] Registered new searcher Searcher@200063a1 main{StandardDirectoryReader(segments_2:1:nrt)}
[junit4:junit4]   2> 985479 T2683 C1617 P39307 oasup.LogUpdateProcessor.finish [collection1] webapp=/sbp/vt path=/update params={waitSearcher=true&commit=true&wt=javabin&expungeDeletes=false&commit_end_point=true&version=2&softCommit=false} {commit=} 0 24
[junit4:junit4]   2> 985479 T2647 C1621 P39271 oasup.LogUpdateProcessor.finish [collection1] webapp=/sbp/vt path=/update params={waitSearcher=true&commit=true&wt=javabin&expungeDeletes=false&commit_end_point=true&version=2&softCommit=false} {commit=} 0 23
[junit4:junit4]   2> 985479 T2633 C1618 P52168 oasup.LogUpdateProcessor.finish [collection1] webapp=/sbp/vt path=/update params={waitSearcher=true&commit=true&wt=javabin&version=2&softCommit=false} {commit=} 0 48
[junit4:junit4]   2> 985481 T2599 oascc.ZkStateReader.updateClusterState Updating cloud state from ZooKeeper... 
[junit4:junit4]   2> 985483 T2635 C1618 P52168 oasc.SolrCore.execute [collection1] webapp=/sbp/vt path=/select params={tests=checkShardConsistency&q=*:*&distrib=false&wt=javabin&version=2&rows=0} hits=0 status=0 QTime=0 
[junit4:junit4]   2> 985485 T2648 C1621 P39271 oasc.SolrCore.execute [collection1] webapp=/sbp/vt path=/select params={tests=checkShardConsistency&q=*:*&distrib=false&wt=javabin&version=2&rows=0} hits=0 status=0 QTime=0 
[junit4:junit4]   2> 985487 T2665 C1620 P39279 oasc.SolrCore.execute [collection1] webapp=/sbp/vt path=/select params={tests=checkShardConsistency&q=*:*&distrib=false&wt=javabin&version=2&rows=0} hits=0 status=0 QTime=1 
[junit4:junit4]   2> 985488 T2684 C1617 P39307 oasc.SolrCore.execute [collection1] webapp=/sbp/vt path=/select params={tests=checkShardConsistency&q=*:*&distrib=false&wt=javabin&version=2&rows=0} hits=0 status=0 QTime=0 
[junit4:junit4]   2> 987495 T2611 C1619 P60562 oasup.LogUpdateProcessor.finish [collection1] webapp=/sbp/vt path=/update params={wt=javabin&version=2} {deleteByQuery=*:* (-1437631355340980224)} 0 2
[junit4:junit4]   2> 987505 T2647 C1621 P39271 oasup.LogUpdateProcessor.finish [collection1] webapp=/sbp/vt path=/update params={update.distrib=FROMLEADER&_version_=-1437631355347271680&update.from=http://127.0.0.1:52168/sbp/vt/collection1/&wt=javabin&version=2} {deleteByQuery=*:* (-1437631355347271680)} 0 1
[junit4:junit4]   2> 987505 T2683 C1617 P39307 oasup.LogUpdateProcessor.finish [collection1] webapp=/sbp/vt path=/update params={update.distrib=FROMLEADER&_version_=-1437631355347271680&update.from=http://127.0.0.1:52168/sbp/vt/collection1/&wt=javabin&version=2} {deleteByQuery=*:* (-1437631355347271680)} 0 1
[junit4:junit4]   2> 987506 T2664 C1620 P39279 oasup.LogUpdateProcessor.finish [collection1] webapp=/sbp/vt path=/update params={update.distrib=FROMLEADER&_version_=-1437631355347271680&update.from=http://127.0.0.1:52168/sbp/vt/collection1/&wt=javabin&version=2} {deleteByQuery=*:* (-1437631355347271680)} 0 2
[junit4:junit4]   2> 987507 T2633 C1618 P52168 oasup.LogUpdateProcessor.finish [collection1] webapp=/sbp/vt path=/update params={wt=javabin&version=2} {deleteByQuery=*:* (-1437631355347271680)} 0 8
[junit4:junit4]   2> 987512 T2611 C1619 P60562 oasup.LogUpdateProcessor.finish [collection1] webapp=/sbp/vt path=/update params={wt=javabin&version=2} {add=[0 (1437631355358806016)]} 0 2
[junit4:junit4]   2> 987521 T2683 C1617 P39307 oasup.LogUpdateProcessor.finish [collection1] webapp=/sbp/vt path=/update params={distrib.from=http://127.0.0.1:52168/sbp/vt/collection1/&update.distrib=FROMLEADER&wt=javabin&version=2} {add=[0 (1437631355364048896)]} 0 2
[junit4:junit4]   2> 987521 T2664 C1620 P39279 oasup.LogUpdateProcessor.finish [collection1] webapp=/sbp/vt path=/update params={distrib.from=http://127.0.0.1:52168/sbp/vt/collection1/&update.distrib=FROMLEADER&wt=javabin&version=2} {add=[0 (1437631355364048896)]} 0 2
[junit4:junit4]   2> 987522 T2647 C1621 P39271 oasup.LogUpdateProcessor.finish [collection1] webapp=/sbp/vt path=/update params={distrib.from=http://127.0.0.1:52168/sbp/vt/collection1/&update.distrib=FROMLEADER&wt=javabin&version=2} {add=[0 (1437631355364048896)]} 0 2
[junit4:junit4]   2> 987523 T2633 C1618 P52168 oasup.LogUpdateProcessor.finish [collection1] webapp=/sbp/vt path=/update params={wt=javabin&version=2} {add=[0 (1437631355364048896)]} 0 8
[junit4:junit4]   2> 987525 T2611 C1619 P60562 oasup.LogUpdateProcessor.finish [collection1] webapp=/sbp/vt path=/update params={wt=javabin&version=2} {add=[1 (1437631355374534656)]} 0 0
[junit4:junit4]   2> 987530 T2664 C1620 P39279 oasup.LogUpdateProcessor.finish [collection1] webapp=/sbp/vt path=/update params={distrib.from=http://127.0.0.1:52168/sbp/vt/collection1/&update.distrib=FROMLEADER&wt=javabin&version=2} {add=[1 (1437631355377680384)]} 0 0
[junit4:junit4]   2> 987531 T2647 C1621 P39271 oasup.LogUpdateProcessor.finish [collection1] webapp=/sbp/vt path=/update params={distrib.from=http://127.0.0.1:52168/sbp/vt/collection1/&update.distrib=FROMLEADER&wt=javabin&version=2} {add=[1 (1437631355377680384)]} 0 0
[junit4:junit4]   2> 987531 T2683 C1617 P39307 oasup.LogUpdateProcessor.finish [collection1] webapp=/sbp/vt path=/update params={distrib.from=http://127.0.0.1:52168/sbp/vt/collection1/&update.distrib=FROMLEADER&wt=javabin&version=2} {add=[1 (1437631355377680384)]} 0 0
[junit4:junit4]   2> 987532 T2633 C1618 P52168 oasup.LogUpdateProcessor.finish [collection1] webapp=/sbp/vt path=/update params={wt=javabin&version=2} {add=[1 (1437631355377680384)]} 0 4
[junit4:junit4]   2> 987536 T2611 C1619 P60562 oasup.LogUpdateProcessor.finish [collection1] webapp=/sbp/vt path=/update params={wt=javabin&version=2} {add=[2 (1437631355386068992)]} 0 0
[junit4:junit4]   2> 987539 T2633 C1618 P52168 oasup.DistributedUpdateProcessor.setupRequest test.distrib.skip.servers was found and contains:[http://127.0.0.1:39271/sbp/vt/collection1/]
[junit4:junit4]   2> 987539 T2633 C1618 P52168 oasup.DistributedUpdateProcessor.setupRequest check url:http://127.0.0.1:39271/sbp/vt/collection1/ against:[http://127.0.0.1:39271/sbp/vt/collection1/] result:true
[junit4:junit4]   2> 987540 T2633 C1618 P52168 oasup.DistributedUpdateProcessor.setupRequest check url:http://127.0.0.1:39279/sbp/vt/collection1/ against:[http://127.0.0.1:39271/sbp/vt/collection1/] result:false
[junit4:junit4]   2> 987540 T2633 C1618 P52168 oasup.DistributedUpdateProcessor.setupRequest check url:http://127.0.0.1:39307/sbp/vt/collection1/ against:[http://127.0.0.1:39271/sbp/vt/collection1/] result:false
[junit4:junit4]   2> 987543 T2683 C1617 P39307 oasup.LogUpdateProcessor.finish [collection1] webapp=/sbp/vt path=/update params={distrib.from=http://127.0.0.1:52168/sbp/vt/collection1/&update.distrib=FROMLEADER&test.distrib.skip.servers=http://127.0.0.1:39271/sbp/vt/collection1/&wt=javabin&version=2} {add=[2 (1437631355391311872)]} 0 0
[junit4:junit4]   2> 987544 T2664 C1620 P39279 oasup.LogUpdateProcessor.finish [collection1] webapp=/sbp/vt path=/update params={distrib.from=http://127.0.0.1:52168/sbp/vt/collection1/&update.distrib=FROMLEADER&test.distrib.skip.servers=http://127.0.0.1:39271/sbp/vt/collection1/&wt=javabin&version=2} {add=[2 (1437631355391311872)]} 0 0
[junit4:junit4]   2> 987545 T2633 C1618 P52168 oasup.LogUpdateProcessor.finish [collection1] webapp=/sbp/vt path=/update params={test.distrib.skip.servers=http://127.0.0.1:39271/sbp/vt/collection1/&wt=javabin&version=2} {add=[2 (1437631355391311872)]} 0 6
[junit4:junit4]   2> 987548 T2611 C1619 P60562 oasup.LogUpdateProcessor.finish [collection1] webapp=/sbp/vt path=/update params={wt=javabin&version=2} {add=[3 (1437631355398651904)]} 0 0
[junit4:junit4]   2> 987551 T2633 C1618 P52168 oasup.DistributedUpdateProcessor.setupRequest test.distrib.skip.servers was found and contains:[http://127.0.0.1:39271/sbp/vt/collection1/, http://127.0.0.1:39279/sbp/vt/collection1/]
[junit4:junit4]   2> 987551 T2633 C1618 P52168 oasup.DistributedUpdateProcessor.setupRequest check url:http://127.0.0.1:39271/sbp/vt/collection1/ against:[http://127.0.0.1:39271/sbp/vt/collection1/, http://127.0.0.1:39279/sbp/vt/collection1/] result:true
[junit4:junit4]   2> 987552 T2633 C1618 P52168 oasup.DistributedUpdateProcessor.setupRequest check url:http://127.0.0.1:39279/sbp/vt/collection1/ against:[http://127.0.0.1:39271/sbp/vt/collection1/, http://127.0.0.1:39279/sbp/vt/collection1/] result:true
[junit4:junit4]   2> 987552 T2633 C1618 P52168 oasup.DistributedUpdateProcessor.setupRequest check url:http://127.0.0.1:39307/sbp/vt/collection1/ against:[http://127.0.0.1:39271/sbp/vt/collection1/, http://127.0.0.1:39279/sbp/vt/collection1/] result:false
[junit4:junit4]   2> 987555 T2683 C1617 P39307 oasup.LogUpdateProcessor.finish [collection1] webapp=/sbp/vt path=/update params={distrib.from=http://127.0.0.1:52168/sbp/vt/collection1/&update.distrib=FROMLEADER&test.distrib.skip.servers=http://127.0.0.1:39271/sbp/vt/collection1/&wt=javabin&version=2} {add=[3 (1437631355403894784)]} 0 0
[junit4:junit4]   2> 987556 T2633 C1618 P52168 oasup.LogUpdateProcessor.finish [collection1] webapp=/sbp/vt path=/update params={test.distrib.skip.servers=http://127.0.0.1:39271/sbp/vt/collection1/&test.distrib.skip.servers=http://127.0.0.1:39279/sbp/vt/collection1/&wt=javabin&version=2} {add=[3 (1437631355403894784)]} 0 5
[junit4:junit4]   2> 987559 T2611 C1619 P60562 oasu.DirectUpdateHandler2.commit start commit{,optimize=false,openSearcher=true,waitSearcher=true,expungeDeletes=false,softCommit=false,prepareCommit=false}
[junit4:junit4]   2> 987629 T2611 C1619 P60562 oasc.SolrDeletionPolicy.onCommit SolrDeletionPolicy.onCommit: commits: num=2
[junit4:junit4]   2> 		commit{dir=NRTCachingDirectory(org.apache.lucene.store.NIOFSDirectory@/usr/home/hudson/hudson-slave/workspace/Lucene-Solr-Tests-4.x-Java6/solr/build/solr-core/test/J1/org.apache.solr.cloud.SyncSliceTest-1371032070401/control/data/index lockFactory=org.apache.lucene.store.NativeFSLockFactory@72ebb88e; maxCacheMB=48.0 maxMergeSizeMB=4.0),segFN=segments_2,generation=2}
[junit4:junit4]   2> 		commit{dir=NRTCachingDirectory(org.apache.lucene.store.NIOFSDirectory@/usr/home/hudson/hudson-slave/workspace/Lucene-Solr-Tests-4.x-Java6/solr/build/solr-core/test/J1/org.apache.solr.cloud.SyncSliceTest-1371032070401/control/data/index lockFactory=org.apache.lucene.store.NativeFSLockFactory@72ebb88e; maxCacheMB=48.0 maxMergeSizeMB=4.0),segFN=segments_3,generation=3}
[junit4:junit4]   2> 987630 T2611 C1619 P60562 oasc.SolrDeletionPolicy.updateCommits newest commit generation = 3
[junit4:junit4]   2> 987636 T2611 C1619 P60562 oass.SolrIndexSearcher.<init> Opening Searcher@369742a2 main
[junit4:junit4]   2> 987636 T2611 C1619 P60562 oasu.DirectUpdateHandler2.commit end_commit_flush
[junit4:junit4]   2> 987637 T2625 oasc.SolrCore.registerSearcher [collection1] Registered new searcher Searcher@369742a2 main{StandardDirectoryReader(segments_3:3:nrt _0(4.4):C4)}
[junit4:junit4]   2> 987637 T2611 C1619 P60562 oasup.LogUpdateProcessor.finish [collection1] webapp=/sbp/vt path=/update params={waitSearcher=true&commit=true&wt=javabin&version=2&softCommit=false} {commit=} 0 78
[junit4:junit4]   2> 987641 T2633 C1618 P52168 oasu.DirectUpdateHandler2.commit start commit{,optimize=false,openSearcher=true,waitSearcher=true,expungeDeletes=false,softCommit=false,prepareCommit=false}
[junit4:junit4]   2> 987698 T2633 C1618 P52168 oasc.SolrDeletionPolicy.onCommit SolrDeletionPolicy.onCommit: commits: num=4
[junit4:junit4]   2> 		commit{dir=NRTCachingDirectory(org.apache.lucene.store.NIOFSDirectory@/usr/home/hudson/hudson-slave/workspace/Lucene-Solr-Tests-4.x-Java6/solr/build/solr-core/test/J1/org.apache.solr.cloud.SyncSliceTest-1371032070401/jetty1/index lockFactory=org.apache.lucene.store.NativeFSLockFactory@76002e16; maxCacheMB=48.0 maxMergeSizeMB=4.0),segFN=segments_3,generation=3}
[junit4:junit4]   2> 		commit{dir=NRTCachingDirectory(org.apache.lucene.store.NIOFSDirectory@/usr/home/hudson/hudson-slave/workspace/Lucene-Solr-Tests-4.x-Java6/solr/build/solr-core/test/J1/org.apache.solr.cloud.SyncSliceTest-1371032070401/jetty1/index lockFactory=org.apache.lucene.store.NativeFSLockFactory@76002e16; maxCacheMB=48.0 maxMergeSizeMB=4.0),segFN=segments_4,generation=4}
[junit4:junit4]   2> 		commit{dir=NRTCachingDirectory(org.apache.lucene.store.NIOFSDirectory@/usr/home/hudson/hudson-slave/workspace/Lucene-Solr-Tests-4.x-Java6/solr/build/solr-core/test/J1/org.apache.solr.cloud.SyncSliceTest-1371032070401/jetty1/index lockFactory=org.apache.lucene.store.NativeFSLockFactory@76002e16; maxCacheMB=48.0 maxMergeSizeMB=4.0),segFN=segments_5,generation=5}
[junit4:junit4]   2> 		commit{dir=NRTCachingDirectory(org.apache.lucene.store.NIOFSDirectory@/usr/home/hudson/hudson-slave/workspace/Lucene-Solr-Tests-4.x-Java6/solr/build/solr-core/test/J1/org.apache.solr.cloud.SyncSliceTest-1371032070401/jetty1/index lockFactory=org.apache.lucene.store.NativeFSLockFactory@76002e16; maxCacheMB=48.0 maxMergeSizeMB=4.0),segFN=segments_6,generation=6}
[junit4:junit4]   2> 987699 T2633 C1618 P52168 oasc.SolrDeletionPolicy.updateCommits newest commit generation = 6
[junit4:junit4]   2> 987705 T2633 C1618 P52168 oass.SolrIndexSearcher.<init> Opening Searcher@1fda244d main
[junit4:junit4]   2> 987705 T2633 C1618 P52168 oasu.DirectUpdateHandler2.commit end_commit_flush
[junit4:junit4]   2> 987706 T2643 oasc.SolrCore.registerSearcher [collection1] Registered new searcher Searcher@1fda244d main{StandardDirectoryReader(segments_6:3:nrt _0(4.4):C4)}
[junit4:junit4]   2> 987707 T2633 C1618 P52168 oasu.SolrCmdDistributor.distribCommit Distrib commit to:[StdNode: http://127.0.0.1:39271/sbp/vt/collection1/, StdNode: http://127.0.0.1:39279/sbp/vt/collection1/, StdNode: http://127.0.0.1:39307/sbp/vt/collection1/] params:commit_end_point=true&commit=true&softCommit=false&waitSearcher=true&expungeDeletes=false
[junit4:junit4]   2> 987709 T2647 C1621 P39271 oasu.DirectUpdateHandler2.commit start commit{,optimize=false,openSearcher=true,waitSearcher=true,expungeDeletes=false,softCommit=false,prepareCommit=false}
[junit4:junit4]   2> 987710 T2683 C1617 P39307 oasu.DirectUpdateHandler2.commit start commit{,optimize=false,openSearcher=true,waitSearcher=true,expungeDeletes=false,softCommit=false,prepareCommit=false}
[junit4:junit4]   2> 987710 T2664 C1620 P39279 oasu.DirectUpdateHandler2.commit start commit{,optimize=false,openSearcher=true,waitSearcher=true,expungeDeletes=false,softCommit=false,prepareCommit=false}
[junit4:junit4]   2> ASYNC  NEW_CORE C1622 name=collection1 org.apache.solr.core.SolrCore@1dd44625 url=http://127.0.0.1:39271/sbp/vt/collection1 node=127.0.0.1:39271_sbp%2Fvt C1622_STATE=coll:collection1 core:collection1 props:{shard=shard1, state=active, core=collection1, collection=collection1, node_name=127.0.0.1:39271_sbp%2Fvt, base_url=http://127.0.0.1:39271/sbp/vt}
[junit4:junit4]   2> 987823 T2647 C1622 P39271 oasc.SolrDeletionPolicy.onCommit SolrDeletionPolicy.onCommit: commits: num=2
[junit4:junit4]   2> 		commit{dir=NRTCachingDirectory(org.apache.lucene.store.NIOFSDirectory@/usr/home/hudson/hudson-slave/workspace/Lucene-Solr-Tests-4.x-Java6/solr/build/solr-core/test/J1/org.apache.solr.cloud.SyncSliceTest-1371032070401/jetty2/index lockFactory=org.apache.lucene.store.NativeFSLockFactory@5ed171d0; maxCacheMB=48.0 maxMergeSizeMB=4.0),segFN=segments_3,generation=3}
[junit4:junit4]   2> 		commit{dir=NRTCachingDirectory(org.apache.lucene.store.NIOFSDirectory@/usr/home/hudson/hudson-slave/workspace/Lucene-Solr-Tests-4.x-Java6/solr/build/solr-core/test/J1/org.apache.solr.cloud.SyncSliceTest-1371032070401/jetty2/index lockFactory=org.apache.lucene.store.NativeFSLockFactory@5ed171d0; maxCacheMB=48.0 maxMergeSizeMB=4.0),segFN=segments_4,generation=4}
[junit4:junit4]   2> 987824 T2647 C1622 P39271 oasc.SolrDeletionPolicy.updateCommits newest commit generation = 4
[junit4:junit4]   2> ASYNC  NEW_CORE C1623 name=collection1 org.apache.solr.core.SolrCore@74e71d58 url=http://127.0.0.1:39279/sbp/vt/collection1 node=127.0.0.1:39279_sbp%2Fvt C1623_STATE=coll:collection1 core:collection1 props:{shard=shard1, state=active, core=collection1, collection=collection1, node_name=127.0.0.1:39279_sbp%2Fvt, base_url=http://127.0.0.1:39279/sbp/vt}
[junit4:junit4]   2> 987825 T2664 C1623 P39279 oasc.SolrDeletionPolicy.onCommit SolrDeletionPolicy.onCommit: commits: num=2
[junit4:junit4]   2> 		commit{dir=NRTCachingDirectory(org.apache.lucene.store.NIOFSDirectory@/usr/home/hudson/hudson-slave/workspace/Lucene-Solr-Tests-4.x-Java6/solr/build/solr-core/test/J1/org.apache.solr.cloud.SyncSliceTest-1371032070401/jetty3/index lockFactory=org.apache.lucene.store.NativeFSLockFactory@40d137ab; maxCacheMB=48.0 maxMergeSizeMB=4.0),segFN=segments_4,generation=4}
[junit4:junit4]   2> 		commit{dir=NRTCachingDirectory(org.apache.lucene.store.NIOFSDirectory@/usr/home/hudson/hudson-slave/workspace/Lucene-Solr-Tests-4.x-Java6/solr/build/solr-core/test/J1/org.apache.solr.cloud.SyncSliceTest-1371032070401/jetty3/index lockFactory=org.apache.lucene.store.NativeFSLockFactory@40d137ab; maxCacheMB=48.0 maxMergeSizeMB=4.0),segFN=segments_5,generation=5}
[junit4:junit4]   2> 987826 T2664 C1623 P39279 oasc.SolrDeletionPolicy.updateCommits newest commit generation = 5
[junit4:junit4]   2> ASYNC  NEW_CORE C1624 name=collection1 org.apache.solr.core.SolrCore@5d24600a url=http://127.0.0.1:39307/sbp/vt/collection1 node=127.0.0.1:39307_sbp%2Fvt C1624_STATE=coll:collection1 core:collection1 props:{shard=shard1, state=active, core=collection1, collection=collection1, node_name=127.0.0.1:39307_sbp%2Fvt, base_url=http://127.0.0.1:39307/sbp/vt}
[junit4:junit4]   2> 987826 T2683 C1624 P39307 oasc.SolrDeletionPolicy.onCommit SolrDeletionPolicy.onCommit: commits: num=2
[junit4:junit4]   2> 		commit{dir=NRTCachingDirectory(org.apache.lucene.store.NIOFSDirectory@/usr/home/hudson/hudson-slave/workspace/Lucene-Solr-Tests-4.x-Java6/solr/build/solr-core/test/J1/org.apache.solr.cloud.SyncSliceTest-1371032070401/jetty4/index lockFactory=org.apache.lucene.store.NativeFSLockFactory@52ea5e97; maxCacheMB=48.0 maxMergeSizeMB=4.0),segFN=segments_5,generation=5}
[junit4:junit4]   2> 		commit{dir=NRTCachingDirectory(org.apache.lucene.store.NIOFSDirectory@/usr/home/hudson/hudson-slave/workspace/Lucene-Solr-Tests-4.x-Java6/solr/build/solr-core/test/J1/org.apache.solr.cloud.SyncSliceTest-1371032070401/jetty4/index lockFactory=org.apache.lucene.store.NativeFSLockFactory@52ea5e97; maxCacheMB=48.0 maxMergeSizeMB=4.0),segFN=segments_6,generation=6}
[junit4:junit4]   2> 987827 T2683 C1624 P39307 oasc.SolrDeletionPolicy.updateCommits newest commit generation = 6
[junit4:junit4]   2> 987831 T2647 C1622 P39271 oass.SolrIndexSearcher.<init> Opening Searcher@25cef5db main
[junit4:junit4]   2> 987832 T2647 C1622 P39271 oasu.DirectUpdateHandler2.commit end_commit_flush
[junit4:junit4]   2> 987832 T2659 oasc.SolrCore.registerSearcher [collection1] Registered new searcher Searcher@25cef5db main{StandardDirectoryReader(segments_4:3:nrt _0(4.4):C2)}
[junit4:junit4]   2> 987833 T2664 C1623 P39279 oass.SolrIndexSearcher.<init> Opening Searcher@15bc03f9 main
[junit4:junit4]   2> 987833 T2647 C1622 P39271 oasup.LogUpdateProcessor.finish [collection1] webapp=/sbp/vt path=/update params={waitSearcher=true&commit=true&wt=javabin&expungeDeletes=false&commit_end_point=true&version=2&softCommit=false} {commit=} 0 124
[junit4:junit4]   2> 987833 T2664 C1623 P39279 oasu.DirectUpdateHandler2.commit end_commit_flush
[junit4:junit4]   2> 987834 T2678 oasc.SolrCore.registerSearcher [collection1] Registered new searcher Searcher@15bc03f9 main{StandardDirectoryReader(segments_5:3:nrt _0(4.4):C3)}
[junit4:junit4]   2> 987834 T2683 C1624 P39307 oass.SolrIndexSearcher.<init> Opening Searcher@675dd33 main
[junit4:junit4]   2> 987834 T2664 C1623 P39279 oasup.LogUpdateProcessor.finish [collection1] webapp=/sbp/vt path=/update params={waitSearcher=true&commit=true&wt=javabin&expungeDeletes=false&commit_end_point=true&version=2&softCommit=false} {commit=} 0 124
[junit4:junit4]   2> 987835 T2683 C1624 P39307 oasu.DirectUpdateHandler2.commit end_commit_flush
[junit4:junit4]   2> 987835 T2697 oasc.SolrCore.registerSearcher [collection1] Registered new searcher Searcher@675dd33 main{StandardDirectoryReader(segments_6:3:nrt _0(4.4):C4)}
[junit4:junit4]   2> 987836 T2683 C1624 P39307 oasup.LogUpdateProcessor.finish [collection1] webapp=/sbp/vt path=/update params={waitSearcher=true&commit=true&wt=javabin&expungeDeletes=false&commit_end_point=true&version=2&softCommit=false} {commit=} 0 126
[junit4:junit4]   2> ASYNC  NEW_CORE C1625 name=collection1 org.apache.solr.core.SolrCore@3c488812 url=http://127.0.0.1:52168/sbp/vt/collection1 node=127.0.0.1:52168_sbp%2Fvt C1625_STATE=coll:collection1 core:collection1 props:{shard=shard1, state=active, core=collection1, collection=collection1, node_name=127.0.0.1:52168_sbp%2Fvt, base_url=http://127.0.0.1:52168/sbp/vt, leader=true}
[junit4:junit4]   2> 987837 T2633 C1625 P52168 oasup.LogUpdateProcessor.finish [collection1] webapp=/sbp/vt path=/update params={waitSearcher=true&commit=true&wt=javabin&version=2&softCommit=false} {commit=} 0 196
[junit4:junit4]   2> 987837 T2599 oasc.AbstractDistribZkTestBase.waitForRecoveriesToFinish Wait for recoveries to finish - collection: collection1 failOnTimeout:true timeout (sec):230
[junit4:junit4]   2> 987838 T2599 oascc.ZkStateReader.updateClusterState Updating cloud state from ZooKeeper... 
[junit4:junit4]   2> 987839 T2599 oasc.AbstractDistribZkTestBase.waitForRecoveriesToFinish Recoveries finished - collection: collection1
[junit4:junit4]   2> 987842 T2635 C1625 P52168 oasc.SolrCore.execute [collection1] webapp=/sbp/vt path=/select params={tests=checkShardConsistency&q=*:*&distrib=false&wt=javabin&version=2&rows=0} hits=4 status=0 QTime=0 
[junit4:junit4]   2> 987846 T2648 C1622 P39271 oasc.SolrCore.execute [collection1] webapp=/sbp/vt path=/select params={tests=checkShardConsistency&q=*:*&distrib=false&wt=javabin&version=2&rows=0} hits=2 status=0 QTime=0 
[junit4:junit4]   2> 987849 T2665 C1623 P39279 oasc.SolrCore.execute [collection1] webapp=/sbp/vt path=/select params={tests=checkShardConsistency&q=*:*&distrib=false&wt=javabin&version=2&rows=0} hits=3 status=0 QTime=0 
[junit4:junit4]   2> 987851 T2684 C1624 P39307 oasc.SolrCore.execute [collection1] webapp=/sbp/vt path=/select params={tests=checkShardConsistency&q=*:*&distrib=false&wt=javabin&version=2&rows=0} hits=4 status=0 QTime=0 
[junit4:junit4]   2> 987852 T2599 oascsi.HttpClientUtil.createClient Creating new http client, config:maxConnections=128&maxConnectionsPerHost=32&followRedirects=false
[junit4:junit4]   2> 987870 T2666 oasha.CollectionsHandler.handleSyncShardAction Syncing shard : shard=shard1&action=SYNCSHARD&collection=collection1&wt=javabin&version=2
[junit4:junit4]   2> 987870 T2666 oascsi.HttpClientUtil.createClient Creating new http client, config:maxConnections=128&maxConnectionsPerHost=32&followRedirects=false
[junit4:junit4]   2> 987882 T2636 oasha.CoreAdminHandler.handleRequestSyncAction I have been requested to sync up my shard
[junit4:junit4]   2> 987882 T2636 oasc.SyncStrategy.sync Sync replicas to http://127.0.0.1:52168/sbp/vt/collection1/
[junit4:junit4]   2> 987883 T2636 oasu.PeerSync.sync PeerSync: core=collection1 url=http://127.0.0.1:52168/sbp/vt START replicas=[http://127.0.0.1:39271/sbp/vt/collection1/, http://127.0.0.1:39279/sbp/vt/collection1/, http://127.0.0.1:39307/sbp/vt/collection1/] nUpdates=100
[junit4:junit4]   2> 987884 T2649 C1622 P39271 oasc.SolrCore.execute [collection1] webapp=/sbp/vt path=/get params={getVersions=100&distrib=false&wt=javabin&qt=/get&version=2} status=0 QTime=0 
[junit4:junit4]   2> 987885 T2685 C1624 P39307 oasc.SolrCore.execute [collection1] webapp=/sbp/vt path=/get params={getVersions=100&distrib=false&wt=javabin&qt=/get&version=2} status=0 QTime=0 
[junit4:junit4]   2> 987885 T2667 C1623 P39279 oasc.SolrCore.execute [collection1] webapp=/sbp/vt path=/get params={getVersions=100&distrib=false&wt=javabin&qt=/get&version=2} status=0 QTime=1 
[junit4:junit4]   2> 987885 T2636 oasu.PeerSync.handleVersions PeerSync: core=collection1 url=http://127.0.0.1:52168/sbp/vt  Received 3 versions from 127.0.0.1:39271/sbp/vt/collection1/
[junit4:junit4]   2> 987886 T2636 oasu.PeerSync.handleVersions PeerSync: core=collection1 url=http://127.0.0.1:52168/sbp/vt  Our versions are newer. ourLowThreshold=1437631355347271680 otherHigh=1437631355377680384
[junit4:junit4]   2> 987886 T2636 oasu.PeerSync.handleVersions PeerSync: core=collection1 url=http://127.0.0.1:52168/sbp/vt  Received 5 versions from 127.0.0.1:39307/sbp/vt/collection1/
[junit4:junit4]   2> 987887 T2636 oasu.PeerSync.handleVersions PeerSync: core=collection1 url=http://127.0.0.1:52168/sbp/vt  Our versions are newer. ourLowThreshold=1437631355347271680 otherHigh=1437631355391311872
[junit4:junit4]   2> 987887 T2636 oasu.PeerSync.handleVersions PeerSync: core=collection1 url=http://127.0.0.1:52168/sbp/vt  Received 4 versions from 127.0.0.1:39279/sbp/vt/collection1/
[junit4:junit4]   2> 987888 T2636 oasu.PeerSync.handleVersions PeerSync: core=collection1 url=http://127.0.0.1:52168/sbp/vt  Our versions are newer. ourLowThreshold=1437631355347271680 otherHigh=1437631355391311872
[junit4:junit4]   2> 987888 T2636 oasu.PeerSync.sync PeerSync: core=collection1 url=http://127.0.0.1:52168/sbp/vt DONE. sync succeeded
[junit4:junit4]   2> 987888 T2636 oasc.SyncStrategy.syncReplicas Sync Success - now sync replicas to me
[junit4:junit4]   2> 987889 T2636 oasc.SyncStrategy.syncToMe http://127.0.0.1:52168/sbp/vt/collection1/: try and ask http://127.0.0.1:39271/sbp/vt/collection1/ to sync
[junit4:junit4]   2> 987889 T2636 oasc.SyncStrategy.syncToMe http://127.0.0.1:52168/sbp/vt/collection1/: try and ask http://127.0.0.1:39279/sbp/vt/collection1/ to sync
[junit4:junit4]   2> 987890 T2636 oasc.SyncStrategy.syncToMe http://127.0.0.1:52168/sbp/vt/collection1/: try and ask http://127.0.0.1:39307/sbp/vt/collection1/ to sync
[junit4:junit4]   2> 987890 T2650 C1622 P39271 oasu.PeerSync.sync PeerSync: core=collection1 url=http://127.0.0.1:39271/sbp/vt START replicas=[http://127.0.0.1:52168/sbp/vt/collection1/] nUpdates=100
[junit4:junit4]   2> 987890 T2668 C1623 P39279 oasu.PeerSync.sync PeerSync: core=collection1 url=http://127.0.0.1:39279/sbp/vt START replicas=[http://127.0.0.1:52168/sbp/vt/collection1/] nUpdates=100
[junit4:junit4]   2> 987891 T2686 C1624 P39307 oasu.PeerSync.sync PeerSync: core=collection1 url=http://127.0.0.1:39307/sbp/vt START replicas=[http://127.0.0.1:52168/sbp/vt/collection1/] nUpdates=100
[junit4:junit4]   2> 987892 T2637 C1625 P52168 oasc.SolrCore.execute [collection1] webapp=/sbp/vt path=/get params={getVersions=100&distrib=false&wt=javabin&qt=/get&version=2} status=0 QTime=0 
[junit4:junit4]   2> 987892 T2668 C1623 P39279 oasu.PeerSync.handleVersions PeerSync: core=collection1 url=http://127.0.0.1:39279/sbp/vt  Received 5 versions from 127.0.0.1:52168/sbp/vt/collection1/
[junit4:junit4]   2> 987892 T2631 C1625 P52168 oasc.SolrCore.execute [collection1] webapp=/sbp/vt path=/get params={getVersions=100&distrib=false&wt=javabin&qt=/get&version=2} status=0 QTime=0 
[junit4:junit4]   2> 987893 T2668 C1623 P39279 oasu.PeerSync.requestUpdates PeerSync: core=collection1 url=http://127.0.0.1:39279/sbp/vt Requesting updates from 127.0.0.1:52168/sbp/vt/collection1/n=1 versions=[1437631355403894784]
[junit4:junit4]   2> 987893 T2686 C1624 P39307 oasu.PeerSync.handleVersions PeerSync: core=collection1 url=http://127.0.0.1:39307/sbp/vt  Received 5 versions from 127.0.0.1:52168/sbp/vt/collection1/
[junit4:junit4]   2> 987894 T2632 C1625 P52168 oasc.SolrCore.execute [collection1] webapp=/sbp/vt path=/get params={getVersions=100&distrib=false&wt=javabin&qt=/get&version=2} status=0 QTime=0 
[junit4:junit4]   2> 987894 T2686 C1624 P39307 oasu.PeerSync.handleVersions PeerSync: core=collection1 url=http://127.0.0.1:39307/sbp/vt  Our versions are newer. ourLowThreshold=1437631355347271680 otherHigh=1437631355391311872
[junit4:junit4]   2> 987895 T2650 C1622 P39271 oasu.PeerSync.handleVersions PeerSync: core=collection1 url=http://127.0.0.1:39271/sbp/vt  Received 5 versions from 127.0.0.1:52168/sbp/vt/collection1/
[junit4:junit4]   2> 987895 T2686 C1624 P39307 oasu.PeerSync.sync PeerSync: core=collection1 url=http://127.0.0.1:39307/sbp/vt DONE. sync succeeded
[junit4:junit4]   2> 987895 T2650 C1622 P39271 oasu.PeerSync.requestUpdates PeerSync: core=collection1 url=http://127.0.0.1:39271/sbp/vt Requesting updates from 127.0.0.1:52168/sbp/vt/collection1/n=2 versions=[1437631355403894784, 1437631355391311872]
[junit4:junit4]   2> 987896 T2686 C1624 P39307 oasc.SolrCore.execute [collection1] webapp=/sbp/vt path=/get params={sync=http://127.0.0.1:52168/sbp/vt/collection1/&getVersions=100&distrib=false&wt=javabin&qt=/get&version=2} status=0 QTime=5 
[junit4:junit4]   2> 987897 T2636 oasc.SyncStrategy.syncToMe http://127.0.0.1:52168/sbp/vt/collection1/:  sync completed with http://127.0.0.1:39307/sbp/vt/collection1/
[junit4:junit4]   2> 987897 T2631 C1625 P52168 oasc.SolrCore.execute [collection1] webapp=/sbp/vt path=/get params={distrib=false&getUpdates=1437631355403894784&wt=javabin&qt=/get&version=2} status=0 QTime=0 
[junit4:junit4]   2> 987898 T2632 C1625 P52168 oasc.SolrCore.execute [collection1] webapp=/sbp/vt path=/get params={distrib=false&getUpdates=1437631355403894784,1437631355391311872&wt=javabin&qt=/get&version=2} status=0 QTime=0 
[junit4:junit4]   2> 987901 T2668 C1623 P39279 oasup.LogUpdateProcessor.finish [collection1] {add=[3 (1437631355403894784)]} 0 4
[junit4:junit4]   2> 987901 T2668 C1623 P39279 oasu.PeerSync.sync PeerSync: core=collection1 url=http://127.0.0.1:39279/sbp/vt DONE. sync succeeded
[junit4:junit4]   2> 987901 T2668 C1623 P39279 oasc.SolrCore.execute [collection1] webapp=/sbp/vt path=/get params={sync=http://127.0.0.1:52168/sbp/vt/collection1/&getVersions=100&distrib=false&wt=javabin&qt=/get&version=2} status=0 QTime=11 
[junit4:junit4]   2> 987902 T2650 C1622 P39271 oasup.LogUpdateProcessor.finish [collection1] {add=[2 (1437631355391311872), 3 (1437631355403894784)]} 0 4
[junit4:junit4]   2> 987902 T2636 oasc.SyncStrategy.syncToMe http://127.0.0.1:52168/sbp/vt/collection1/:  sync completed with http://127.0.0.1:39279/sbp/vt/collection1/
[junit4:junit4]   2> 987902 T2650 C1622 P39271 oasu.PeerSync.sync PeerSync: core=collection1 url=http://127.0.0.1:39271/sbp/vt DONE. sync succeeded
[junit4:junit4]   2> 987903 T2650 C1622 P39271 oasc.SolrCore.execute [collection1] webapp=/sbp/vt path=/get params={sync=http://127.0.0.1:52168/sbp/vt/collection1/&getVersions=100&distrib=false&wt=javabin&qt=/get&version=2} status=0 QTime=13 
[junit4:junit4]   2> 987904 T2636 oasc.SyncStrategy.syncToMe http://127.0.0.1:52168/sbp/vt/collection1/:  sync completed with http://127.0.0.1:39271/sbp/vt/collection1/
[junit4:junit4]   2> 987904 T2636 oass.SolrDispatchFilter.handleAdminRequest [admin] webapp=null path=/admin/cores params={shard=shard1&action=REQUESTSYNCSHARD&core=collection1&collection=collection1&wt=javabin&version=2} status=0 QTime=22 
[junit4:junit4]   2> 987905 T2666 oass.SolrDispatchFilter.handleAdminRequest [admin] webapp=null path=/admin/collections params={shard=shard1&action=SYNCSHARD&collection=collection1&wt=javabin&version=2} status=0 QTime=34 
[junit4:junit4]   2> 987905 T2599 oasc.AbstractFullDistribZkTestBase.waitForThingsToLevelOut Wait for recoveries to finish - wait 15 for each attempt
[junit4:junit4]   2> 987905 T2599 oasc.AbstractDistribZkTestBase.waitForRecoveriesToFinish Wait for recoveries to finish - collection: collection1 failOnTimeout:true timeout (sec):15
[junit4:junit4]   2> 987906 T2599 oascc.ZkStateReader.updateClusterState Updating cloud state from ZooKeeper... 
[junit4:junit4]   2> 987907 T2599 oasc.AbstractDistribZkTestBase.waitForRecoveriesToFinish Recoveries finished - collection: collection1
[junit4:junit4]   2> ASYNC  NEW_CORE C1626 name=collection1 org.apache.solr.core.SolrCore@839df4b url=http://127.0.0.1:60562/sbp/vt/collection1 node=127.0.0.1:60562_sbp%2Fvt C1626_STATE=coll:control_colle

[...truncated too long message...]

ck to leader
[junit4:junit4]   2> 1839283 T2693 oasc.ShardLeaderElectionContext.runLeaderProcess Sync was not a success but no one else is active! I am the leader
[junit4:junit4]   2> 1839283 T2693 oasc.ShardLeaderElectionContext.runLeaderProcess I am the new leader: http://127.0.0.1:39307/sbp/vt/collection1/
[junit4:junit4]   2> 1839283 T2693 oasc.SolrCore.close [collection1]  CLOSING SolrCore org.apache.solr.core.SolrCore@5d24600a
[junit4:junit4]   2> 1839284 T2693 oasu.DirectUpdateHandler2.close closing DirectUpdateHandler2{commits=50,autocommits=0,soft autocommits=0,optimizes=0,rollbacks=0,expungeDeletes=0,docsPending=0,adds=0,deletesById=0,deletesByQuery=0,errors=0,cumulative_adds=5,cumulative_deletesById=0,cumulative_deletesByQuery=1,cumulative_errors=0}
[junit4:junit4]   2> 1839284 T2693 oasu.SolrCoreState.decrefSolrCoreState Closing SolrCoreState
[junit4:junit4]   2> 1839285 T2693 oasu.DefaultSolrCoreState.closeIndexWriter SolrCoreState ref count has reached 0 - closing IndexWriter
[junit4:junit4]   2> 1839285 T2693 oasu.DefaultSolrCoreState.closeIndexWriter closing IndexWriter with IndexWriterCloser
[junit4:junit4]   2> 1839288 T2693 oasc.SolrCore.closeSearcher [collection1] Closing main searcher on request.
[junit4:junit4]   2> 1839289 T2693 oasc.CachingDirectoryFactory.close Closing NRTCachingDirectoryFactory - 2 directories currently being tracked
[junit4:junit4]   2> 1839289 T2693 oasc.CachingDirectoryFactory.closeCacheValue looking to close /usr/home/hudson/hudson-slave/workspace/Lucene-Solr-Tests-4.x-Java6/solr/build/solr-core/test/J1/org.apache.solr.cloud.SyncSliceTest-1371032070401/jetty4/index [CachedDir<<refCount=0;path=/usr/home/hudson/hudson-slave/workspace/Lucene-Solr-Tests-4.x-Java6/solr/build/solr-core/test/J1/org.apache.solr.cloud.SyncSliceTest-1371032070401/jetty4/index;done=false>>]
[junit4:junit4]   2> 1839290 T2693 oasc.CachingDirectoryFactory.close Closing directory: /usr/home/hudson/hudson-slave/workspace/Lucene-Solr-Tests-4.x-Java6/solr/build/solr-core/test/J1/org.apache.solr.cloud.SyncSliceTest-1371032070401/jetty4/index
[junit4:junit4]   2> 1839290 T2693 oasc.CachingDirectoryFactory.closeCacheValue looking to close /usr/home/hudson/hudson-slave/workspace/Lucene-Solr-Tests-4.x-Java6/solr/build/solr-core/test/J1/org.apache.solr.cloud.SyncSliceTest-1371032070401/jetty4 [CachedDir<<refCount=0;path=/usr/home/hudson/hudson-slave/workspace/Lucene-Solr-Tests-4.x-Java6/solr/build/solr-core/test/J1/org.apache.solr.cloud.SyncSliceTest-1371032070401/jetty4;done=false>>]
[junit4:junit4]   2> 1839290 T2693 oasc.CachingDirectoryFactory.close Closing directory: /usr/home/hudson/hudson-slave/workspace/Lucene-Solr-Tests-4.x-Java6/solr/build/solr-core/test/J1/org.apache.solr.cloud.SyncSliceTest-1371032070401/jetty4
[junit4:junit4]   2> 1839290 T2693 oascc.SolrZkClient.makePath makePath: /collections/collection1/leaders/shard1
[junit4:junit4]   2> 1839291 T2693 oasc.LeaderElector$1.process WARN  org.apache.zookeeper.KeeperException$SessionExpiredException: KeeperErrorCode = Session expired for /collections/collection1/leader_elect/shard1/election/89851957766258700-127.0.0.1:39307_sbp%2Fvt_collection1-n_0000000006
[junit4:junit4]   2> 	at org.apache.zookeeper.KeeperException.create(KeeperException.java:127)
[junit4:junit4]   2> 	at org.apache.zookeeper.KeeperException.create(KeeperException.java:51)
[junit4:junit4]   2> 	at org.apache.zookeeper.ZooKeeper.delete(ZooKeeper.java:873)
[junit4:junit4]   2> 	at org.apache.solr.common.cloud.SolrZkClient$2.execute(SolrZkClient.java:152)
[junit4:junit4]   2> 	at org.apache.solr.common.cloud.SolrZkClient$2.execute(SolrZkClient.java:149)
[junit4:junit4]   2> 	at org.apache.solr.common.cloud.ZkCmdExecutor.retryOperation(ZkCmdExecutor.java:65)
[junit4:junit4]   2> 	at org.apache.solr.common.cloud.SolrZkClient.delete(SolrZkClient.java:149)
[junit4:junit4]   2> 	at org.apache.solr.cloud.ElectionContext.cancelElection(ElectionContext.java:63)
[junit4:junit4]   2> 	at org.apache.solr.cloud.ShardLeaderElectionContext.runLeaderProcess(ElectionContext.java:260)
[junit4:junit4]   2> 	at org.apache.solr.cloud.LeaderElector.runIamLeaderProcess(LeaderElector.java:156)
[junit4:junit4]   2> 	at org.apache.solr.cloud.LeaderElector.checkIfIamLeader(LeaderElector.java:100)
[junit4:junit4]   2> 	at org.apache.solr.cloud.LeaderElector.access$000(LeaderElector.java:55)
[junit4:junit4]   2> 	at org.apache.solr.cloud.LeaderElector$1.process(LeaderElector.java:129)
[junit4:junit4]   2> 	at org.apache.zookeeper.ClientCnxn$EventThread.processEvent(ClientCnxn.java:519)
[junit4:junit4]   2> 	at org.apache.zookeeper.ClientCnxn$EventThread.run(ClientCnxn.java:495)
[junit4:junit4]   2> 
[junit4:junit4]   2> 1839291 T2693 oascc.ZkStateReader$3.process WARN ZooKeeper watch triggered, but Solr cannot talk to ZK
[junit4:junit4]   2> 1839291 T2693 oascc.ZkStateReader$2.process A cluster state change: WatchedEvent state:SyncConnected type:NodeChildrenChanged path:/live_nodes, has occurred - updating... (live nodes size: 2)
[junit4:junit4]   2> 1839292 T2693 oascc.ZkStateReader$2.process WARN ZooKeeper watch triggered, but Solr cannot talk to ZK
[junit4:junit4]   2> 1839292 T2693 oasc.LeaderElector$1.process WARN  org.apache.zookeeper.KeeperException$SessionExpiredException: KeeperErrorCode = Session expired for /overseer_elect/election
[junit4:junit4]   2> 	at org.apache.zookeeper.KeeperException.create(KeeperException.java:127)
[junit4:junit4]   2> 	at org.apache.zookeeper.KeeperException.create(KeeperException.java:51)
[junit4:junit4]   2> 	at org.apache.zookeeper.ZooKeeper.getChildren(ZooKeeper.java:1468)
[junit4:junit4]   2> 	at org.apache.solr.common.cloud.SolrZkClient$6.execute(SolrZkClient.java:235)
[junit4:junit4]   2> 	at org.apache.solr.common.cloud.SolrZkClient$6.execute(SolrZkClient.java:232)
[junit4:junit4]   2> 	at org.apache.solr.common.cloud.ZkCmdExecutor.retryOperation(ZkCmdExecutor.java:65)
[junit4:junit4]   2> 	at org.apache.solr.common.cloud.SolrZkClient.getChildren(SolrZkClient.java:232)
[junit4:junit4]   2> 	at org.apache.solr.cloud.LeaderElector.checkIfIamLeader(LeaderElector.java:84)
[junit4:junit4]   2> 	at org.apache.solr.cloud.LeaderElector.access$000(LeaderElector.java:55)
[junit4:junit4]   2> 	at org.apache.solr.cloud.LeaderElector$1.process(LeaderElector.java:129)
[junit4:junit4]   2> 	at org.apache.zookeeper.ClientCnxn$EventThread.processEvent(ClientCnxn.java:519)
[junit4:junit4]   2> 	at org.apache.zookeeper.ClientCnxn$EventThread.run(ClientCnxn.java:495)
[junit4:junit4]   2> 
[junit4:junit4]   2> NOTE: test params are: codec=Lucene41, sim=DefaultSimilarity, locale=ar_SY, timezone=America/Yellowknife
[junit4:junit4]   2> NOTE: FreeBSD 9.1-RELEASE-p3 amd64/Sun Microsystems Inc. 1.6.0_32 (64-bit)/cpus=16,threads=2,free=90096528,total=400556032
[junit4:junit4]   2> NOTE: All tests run in this JVM: [DebugComponentTest, SolrPluginUtilsTest, TestSystemIdResolver, OpenExchangeRatesOrgProviderTest, TestCSVLoader, TestStressReorder, TestStressLucene, UpdateParamsTest, RequestHandlersTest, TestIndexingPerformance, TestUpdate, StandardRequestHandlerTest, PingRequestHandlerTest, TestUtils, SolrCmdDistributorTest, TestMultiCoreConfBootstrap, TestHashPartitioner, SimplePostToolTest, TestSolr4Spatial, TestShardHandlerFactory, TestFieldTypeCollectionResource, TestLMJelinekMercerSimilarityFactory, ShardRoutingCustomTest, TestSolrQueryParserResource, SampleTest, TestJmxMonitoredMap, TestRTGBase, TestWordDelimiterFilterFactory, StatsComponentTest, TestLuceneMatchVersion, IndexSchemaRuntimeFieldTest, CollectionsAPIDistributedZkTest, TestFieldTypeResource, ZkSolrClientTest, TestCollationField, TermVectorComponentDistributedTest, OutputWriterTest, HighlighterTest, TestRandomFaceting, UniqFieldsUpdateProcessorFactoryTest, TestPartialUpdateDeduplication, PathHierarchyTokenizerFactoryTest, NoCacheHeaderTest, TestOmitPositions, ConvertedLegacyTest, DistanceFunctionTest, CopyFieldTest, SpellCheckComponentTest, SolrRequestParserTest, TestSerializedLuceneMatchVersion, SignatureUpdateProcessorFactoryTest, TestDynamicFieldResource, TestQueryTypes, SpellCheckCollatorTest, TestRecovery, TestAddFieldRealTimeGet, TestDefaultSimilarityFactory, XmlUpdateRequestHandlerTest, ClusterStateTest, OpenCloseCoreStressTest, TestSolrJ, TestElisionMultitermQuery, JSONWriterTest, SpellPossibilityIteratorTest, NumericFieldsTest, TestFiltering, DirectSolrSpellCheckerTest, TestSuggestSpellingConverter, TestJmxIntegration, TestAnalyzedSuggestions, TestFoldingMultitermQuery, TestZkChroot, BasicDistributedZkTest, ChaosMonkeySafeLeaderTest, BasicDistributedZk2Test, SyncSliceTest]
[junit4:junit4] Completed on J1 in 881.82s, 1 test, 1 failure <<< FAILURES!

[...truncated 390 lines...]
BUILD FAILED
/usr/home/hudson/hudson-slave/workspace/Lucene-Solr-Tests-4.x-Java6/build.xml:391: The following error occurred while executing this line:
/usr/home/hudson/hudson-slave/workspace/Lucene-Solr-Tests-4.x-Java6/build.xml:371: The following error occurred while executing this line:
/usr/home/hudson/hudson-slave/workspace/Lucene-Solr-Tests-4.x-Java6/build.xml:39: The following error occurred while executing this line:
/usr/home/hudson/hudson-slave/workspace/Lucene-Solr-Tests-4.x-Java6/solr/build.xml:181: The following error occurred while executing this line:
/usr/home/hudson/hudson-slave/workspace/Lucene-Solr-Tests-4.x-Java6/solr/common-build.xml:437: The following error occurred while executing this line:
/usr/home/hudson/hudson-slave/workspace/Lucene-Solr-Tests-4.x-Java6/lucene/common-build.xml:1243: The following error occurred while executing this line:
/usr/home/hudson/hudson-slave/workspace/Lucene-Solr-Tests-4.x-Java6/lucene/common-build.xml:887: There were test failures: 297 suites, 1246 tests, 1 failure, 14 ignored (8 assumptions)

Total time: 56 minutes 28 seconds
Build step 'Invoke Ant' marked build as failure
Archiving artifacts
Recording test results
Email was triggered for: Failure
Sending email for trigger: Failure